{"text_format":"1","workbook":"xlsx","n_sheets":8,"sheets":["DataEntry","GoalEntryData","RawData","Lookup","Goal2Print","Goal1Graph","Goal2Graph","Goal1Print"],"not_rendered":{"charts":4,"images":0,"macros":1,"external_links":0,"defined_names":11,"comments":0,"pivot_tables":0},"unopened":[],"bounds":{"document_bytes":16777216,"sheet_cells":100000,"rows_first":2000,"rows_last":500,"rows_between":2000,"halvings":0,"cell_chars":16384,"cell_head_chars":4096},"cells_cut":0,"cells_raw":0,"read":"whole","date_system":"1900"}

{"sheet":"DataEntry","index":0,"n_rows":19,"n_cols":15,"rows_kept":19,"cut":false,"hidden":false,"merged":[[21,16,21,19],[7,2,12,2],[13,2,18,2],[5,16,5,19],[11,16,11,19],[17,16,17,19],[13,13,14,13],[4,2,4,3],[4,4,4,6],[16,3,16,4],[16,5,16,12],[2,2,2,3],[2,4,2,8],[7,3,7,4],[7,5,7,12],[6,2,6,13],[8,3,8,4],[8,5,8,12],[9,3,9,4],[12,3,12,4],[9,5,9,12],[7,13,8,13],[22,2,22,5],[10,5,10,12],[11,5,11,12],[12,5,12,12],[15,3,15,4],[13,3,13,4],[13,5,13,12],[15,5,15,12],[17,3,17,4],[17,5,17,12],[18,3,18,4],[18,5,18,12],[14,3,14,4],[14,5,14,12],[10,3,10,4],[11,3,11,4]]}
[]
[]
[null,null,"Student's Name",null,null,null,null,null,null,{"$f":"IFERROR(LEFT(E3,SEARCH(\" \",E3,1)),\"\")","v":""}]
[]
[null,null,"Student ID"]
[]
[]
[null,null,null,"Target Behavior 1:",null,{"$f":"IF(GoalEntryData!$Q$2=\"\",\"\",GoalEntryData!$Q$2)","v":""},null,null,null,null,null,null,null,"Date Achieved"]
[null,null,null,"Baseline Data:",null,{"$f":"IFERROR(IF(GoalEntryData!$C$2=\"\",\"\",\"Between \"&TEXT(GoalEntryData!$R$2,\"mm/dd/yyyy\")&\" and \"&TEXT(GoalEntryData!$S$2,\"mm/dd/yyyy\")&\", \"&DataEntry!$J$3&\"received an average of \"&GoalEntryData!$W$2&\" \"&GoalEntryData!$D$2&\" a \"&GoalEntryData!$E$2),\"\")","v":""},null,null,null,null,null,null,null,null,{"$f":"TODAY()","v":"2015-03-05"}]
[null,null,null,"Goal 1:",null,{"$f":"IFERROR(IF(GoalEntryData!$C$2=\"\",\"\",\"By \"&TEXT(GoalEntryData!$G$2,\"mm/dd/yyyy\")&\", \"&$J$3&\"will receive \"&IF(GoalEntryData!$B$2=\"No more than\",\"no more than \",IF(GoalEntryData!$B$2=\"At least\",\"at least \"))&GoalEntryData!$C$2&\" \"&GoalEntryData!$D$2&\" a \"&GoalEntryData!$E$2&\" for \"&GoalEntryData!$F$2&\" consecutive \"&GoalEntryData!$E$2&\"(s)\"),\"\")","v":""},null,null,null,null,null,null,null,{"$f":"IF(GoalEntryData!J6<>\"\",GoalEntryData!J6,\"\")","v":""},{"$f":"GoalEntryData!H6","v":"00:00:00"}]
[null,null,null,"Benchmark 1:",null,{"$f":"IFERROR(IF(GoalEntryData!$H$2=\"\",\"\",\"By \"&TEXT(GoalEntryData!$J$2,\"mm/dd/yyyy\")&\", \"&$J$3&\"will receive \"&IF(GoalEntryData!$B$2=\"No more than\",\"no more than \",IF(GoalEntryData!$B$2=\"At least\",\"at least \"))&GoalEntryData!$H$2&\" \"&GoalEntryData!$D$2&\" a \"&GoalEntryData!$E$2&\" for \"&GoalEntryData!$I$2&\" consecutive \"&GoalEntryData!$E$2&\"(s)\"),\"\")","v":""},null,null,null,null,null,null,null,{"$f":"IF(GoalEntryData!J7<>\"\",GoalEntryData!J7,\"\")","v":""},{"$f":"GoalEntryData!H7","v":"00:00:00"}]
[null,null,null,"Benchmark 2:",null,{"$f":"IFERROR(IF(GoalEntryData!$K$2=\"\",\"\",\"By \"&TEXT(GoalEntryData!$M$2,\"mm/dd/yyyy\")&\", \"&$J$3&\"will receive \"&IF(GoalEntryData!$B$2=\"No more than\",\"no more than \",IF(GoalEntryData!$B$2=\"At least\",\"at least \"))&GoalEntryData!$K$2&\" \"&GoalEntryData!$D$2&\" a \"&GoalEntryData!$E$2&\" for \"&GoalEntryData!$L$2&\" consecutive \"&GoalEntryData!$E$2&\"(s)\"),\"\")","v":""},null,null,null,null,null,null,null,{"$f":"IF(GoalEntryData!J8<>\"\",GoalEntryData!J8,\"\")","v":""},{"$f":"GoalEntryData!H8","v":"00:00:00"}]
[null,null,null,"Benchmark 3:",null,{"$f":"IFERROR(IF(GoalEntryData!$N$2=\"\",\"\",\"By \"&TEXT(GoalEntryData!$P$2,\"mm/dd/yyyy\")&\", \"&$J$3&\"will receive \"&IF(GoalEntryData!$B$2=\"No more than\",\"no more than \",IF(GoalEntryData!$B$2=\"At least\",\"at least \"))&GoalEntryData!$N$2&\" \"&GoalEntryData!$D$2&\" a \"&GoalEntryData!$E$2&\" for \"&GoalEntryData!$O$2&\" consecutive \"&GoalEntryData!$E$2&\"(s)\"),\"\")","v":""},null,null,null,null,null,null,null,{"$f":"IF(GoalEntryData!J9<>\"\",GoalEntryData!J9,\"\")","v":""},{"$f":"GoalEntryData!H9","v":"00:00:00"}]
[null,null,null,"Target Behavior 1:",null,{"$f":"IF(GoalEntryData!$Q$3=\"\",\"\",GoalEntryData!$Q$3)","v":""},null,null,null,null,null,null,null,"Date Achieved"]
[null,null,null,"Baseline Data:",null,{"$f":"IFERROR(IF(GoalEntryData!$C$3=\"\",\"\",\"Between \"&TEXT(GoalEntryData!$R$3,\"mm/dd/yyyy\")&\" and \"&TEXT(GoalEntryData!$S$3,\"mm/dd/yyyy\")&\", \"&DataEntry!$J$3&\"received an average of \"&GoalEntryData!$W$3&\" \"&GoalEntryData!$D$3&\" a \"&GoalEntryData!$E$3),\"\")","v":""}]
[null,null,null,"Goal 1:",null,{"$f":"IFERROR(IF(GoalEntryData!$C$3=\"\",\"\",\"By \"&TEXT(GoalEntryData!$G$3,\"mm/dd/yyyy\")&\", \"&$J$3&\"will receive \"&IF(GoalEntryData!$B$3=\"No more than\",\"no more than \",IF(GoalEntryData!$B$3=\"At least\",\"at least \"))&GoalEntryData!$C$3&\" \"&GoalEntryData!$D$3&\" a \"&GoalEntryData!$E$3&\" for \"&GoalEntryData!$F$3&\" consecutive \"&GoalEntryData!$E$3&\"(s)\"),\"\")","v":""},null,null,null,null,null,null,null,{"$f":"IF(GoalEntryData!J10<>\"\",GoalEntryData!J10,\"\")","v":""},{"$f":"GoalEntryData!H10","v":"00:00:00"}]
[null,null,null,"Benchmark 1:",null,{"$f":"IFERROR(IF(GoalEntryData!$H$3=\"\",\"\",\"By \"&TEXT(GoalEntryData!$J$3,\"mm/dd/yyyy\")&\", \"&$J$3&\"will receive \"&IF(GoalEntryData!$B$3=\"No more than\",\"no more than \",IF(GoalEntryData!$B$3=\"At least\",\"at least \"))&GoalEntryData!$H$3&\" \"&GoalEntryData!$D$3&\" a \"&GoalEntryData!$E$3&\" for \"&GoalEntryData!$I$3&\" consecutive \"&GoalEntryData!$E$3&\"(s)\"),\"\")","v":""},null,null,null,null,null,null,null,{"$f":"IF(GoalEntryData!J11<>\"\",GoalEntryData!J11,\"\")","v":""},{"$f":"GoalEntryData!H11","v":"00:00:00"}]
[null,null,null,"Benchmark 2:",null,{"$f":"IFERROR(IF(GoalEntryData!$K$3=\"\",\"\",\"By \"&TEXT(GoalEntryData!$M$3,\"mm/dd/yyyy\")&\", \"&$J$3&\"will receive \"&IF(GoalEntryData!$B$3=\"No more than\",\"no more than \",IF(GoalEntryData!$B$3=\"At least\",\"at least \"))&GoalEntryData!$K$3&\" \"&GoalEntryData!$D$3&\" a \"&GoalEntryData!$E$3&\" for \"&GoalEntryData!$L$3&\" consecutive \"&GoalEntryData!$E$3&\"(s)\"),\"\")","v":""},null,null,null,null,null,null,null,{"$f":"IF(GoalEntryData!J12<>\"\",GoalEntryData!J12,\"\")","v":""},{"$f":"GoalEntryData!H12","v":"00:00:00"}]
[null,null,null,"Benchmark 3:",null,{"$f":"IFERROR(IF(GoalEntryData!$N$3=\"\",\"\",\"By \"&TEXT(GoalEntryData!$P$3,\"mm/dd/yyyy\")&\", \"&$J$3&\"will receive \"&IF(GoalEntryData!$B$3=\"No more than\",\"no more than \",IF(GoalEntryData!$B$3=\"At least\",\"at least \"))&GoalEntryData!$N$3&\" \"&GoalEntryData!$D$3&\" a \"&GoalEntryData!$E$3&\" for \"&GoalEntryData!$O$3&\" consecutive \"&GoalEntryData!$E$3&\"(s)\"),\"\")","v":""},null,null,null,null,null,null,null,{"$f":"IF(GoalEntryData!J13<>\"\",GoalEntryData!J13,\"\")","v":""},{"$f":"GoalEntryData!H13","v":"00:00:00"}]

{"sheet":"GoalEntryData","index":1,"n_rows":13,"n_cols":25,"rows_kept":13,"cut":false,"hidden":true,"merged":[]}
[null,null,null,null,null,null,null,null,null,null,null,null,null,null,null,null,null,null,null,null,null,"Dividing Factor",null,null,"BL Date"]
[1,"At least",null,"<Select one>","day",null,null,null,null,null,null,null,null,null,null,null,null,null,null,null,"Total",{"$f":"IF($C2=\"\",\"\",NETWORKDAYS($R$2,$S$2,Lookup!$A$2:$A$19)/IF($E2=\"day\",1,IF($E2=\"week\",5,IF($E2=\"2-week period\",10))))","v":""},{"$f":"IFERROR(IF($U2=\"Total\",IF($C2=\"\",\"\",ROUND($T2/$V2,1)),T2),\"\")","v":""},{"$f":"IF(MAX(RawData!C:C)=0,\"\",IF($E2=\"day\",WORKDAY(MAX(RawData!C:C),1),IF($E2=\"week\",MAX(RawData!C:C)+7,IF($E2=\"2-week period\",MAX(RawData!C:C)+14))))","v":""},{"$f":"IF(RawData!C2=0,\"\",MIN(RawData!C:C))","v":""}]
[2,"At least",null,"<Select one>","day",null,null,null,null,null,null,null,null,null,null,null,null,null,null,null,"Total",{"$f":"IF($C3=\"\",\"\",NETWORKDAYS($R$3,$S$3,Lookup!$A$2:$A$19)/IF($E3=\"day\",1,IF($E3=\"week\",5,IF($E3=\"2-week period\",10))))","v":""},{"$f":"IFERROR(IF($U3=\"Total\",IF($C3=\"\",\"\",ROUND($T3/$V3,1)),T3),\"\")","v":""},{"$f":"IF(MAX(RawData!N:N)=0,\"\",IF($E3=\"day\",WORKDAY(MAX(RawData!N:N),1),IF($E3=\"week\",MAX(RawData!N:N)+7,IF($E3=\"2-week period\",MAX(RawData!N:N)+14))))","v":""},{"$f":"IF(RawData!N2=0,\"\",MIN(RawData!N:N))","v":""}]
[]
[null,"Indicator","Threshold","Number","Method"]
["Goal1",1,{"$f":"IF($B$2=\"No more than\",\"<=\",IF($B$2=\"At least\",\">=\",\"\"))","v":">="},{"$f":"C2","v":0},{"$f":"$D$2","v":"<Select one>"},{"$f":"$E$2","v":"day"},{"$f":"F2","v":0},{"$f":"G2","v":"00:00:00"},{"$f":"IFERROR(IF(D6=0,\"N/A\",MATCH(GoalEntryData!$G6,RawData!$E:$E,0)),0)","v":"N/A"},{"$f":"IF(OR(I6=0,I6=\"N/A\"),\"\",INDEX(RawData!$C:$C,GoalEntryData!I6))","v":""}]
["Benchmark1",1,{"$f":"IF($B$2=\"No more than\",\"<=\",IF($B$2=\"At least\",\">=\",\"\"))","v":">="},{"$f":"H2","v":0},{"$f":"$D$2","v":"<Select one>"},{"$f":"$E$2","v":"day"},{"$f":"I2","v":0},{"$f":"J2","v":"00:00:00"},{"$f":"IFERROR(IF(D7=0,\"N/A\",MATCH(GoalEntryData!$G7,RawData!$G:$G,0)),0)","v":"N/A"},{"$f":"IF(OR(I7=0,I7=\"N/A\"),\"\",INDEX(RawData!$C:$C,GoalEntryData!I7))","v":""}]
["Benchmark2",1,{"$f":"IF($B$2=\"No more than\",\"<=\",IF($B$2=\"At least\",\">=\",\"\"))","v":">="},{"$f":"K2","v":0},{"$f":"$D$2","v":"<Select one>"},{"$f":"$E$2","v":"day"},{"$f":"L2","v":0},{"$f":"M2","v":"00:00:00"},{"$f":"IFERROR(IF(D8=0,\"N/A\",MATCH(GoalEntryData!$G8,RawData!$I:$I,0)),0)","v":"N/A"},{"$f":"IF(OR(I8=0,I8=\"N/A\"),\"\",INDEX(RawData!$C:$C,GoalEntryData!I8))","v":""}]
["Benchmark3",1,{"$f":"IF($B$2=\"No more than\",\"<=\",IF($B$2=\"At least\",\">=\",\"\"))","v":">="},{"$f":"N2","v":0},{"$f":"$D$2","v":"<Select one>"},{"$f":"$E$2","v":"day"},{"$f":"O2","v":0},{"$f":"P2","v":"00:00:00"},{"$f":"IFERROR(IF(D9=0,\"N/A\",MATCH(GoalEntryData!$G9,RawData!$K:$K,0)),0)","v":"N/A"},{"$f":"IF(OR(I9=0,I9=\"N/A\"),\"\",INDEX(RawData!$C:$C,GoalEntryData!I9))","v":""}]
["Goal2",2,{"$f":"IF($B$3=\"No more than\",\"<=\",IF($B$3=\"At least\",\">=\",\"\"))","v":">="},{"$f":"C3","v":0},{"$f":"$D$3","v":"<Select one>"},{"$f":"$E$3","v":"day"},{"$f":"F3","v":0},{"$f":"G3","v":"00:00:00"},{"$f":"IFERROR(IF(D10=0,\"N/A\",MATCH(GoalEntryData!$G10,RawData!$P:$P,0)),0)","v":"N/A"},{"$f":"IF(OR(I10=0,I10=\"N/A\"),\"\",INDEX(RawData!$N:$N,GoalEntryData!I10))","v":""}]
["Benchmark1",2,{"$f":"IF($B$3=\"No more than\",\"<=\",IF($B$3=\"At least\",\">=\",\"\"))","v":">="},{"$f":"H3","v":0},{"$f":"$D$3","v":"<Select one>"},{"$f":"$E$3","v":"day"},{"$f":"I3","v":0},{"$f":"J3","v":"00:00:00"},{"$f":"IFERROR(IF(D11=0,\"N/A\",MATCH(GoalEntryData!$G11,RawData!$R:$R,0)),0)","v":"N/A"},{"$f":"IF(OR(I11=0,I11=\"N/A\"),\"\",INDEX(RawData!$N:$N,GoalEntryData!I11))","v":""}]
["Benchmark2",2,{"$f":"IF($B$3=\"No more than\",\"<=\",IF($B$3=\"At least\",\">=\",\"\"))","v":">="},{"$f":"K3","v":0},{"$f":"$D$3","v":"<Select one>"},{"$f":"$E$3","v":"day"},{"$f":"L3","v":0},{"$f":"M3","v":"00:00:00"},{"$f":"IFERROR(IF(D12=0,\"N/A\",MATCH(GoalEntryData!$G12,RawData!$T:$T,0)),0)","v":"N/A"},{"$f":"IF(OR(I12=0,I12=\"N/A\"),\"\",INDEX(RawData!$N:$N,GoalEntryData!I12))","v":""}]
["Benchmark3",2,{"$f":"IF($B$3=\"No more than\",\"<=\",IF($B$3=\"At least\",\">=\",\"\"))","v":">="},{"$f":"N3","v":0},{"$f":"$D$3","v":"<Select one>"},{"$f":"$E$3","v":"day"},{"$f":"O3","v":0},{"$f":"P3","v":"00:00:00"},{"$f":"IFERROR(IF(D13=0,\"N/A\",MATCH(GoalEntryData!$G13,RawData!$V:$V,0)),0)","v":"N/A"},{"$f":"IF(OR(I13=0,I13=\"N/A\"),\"\",INDEX(RawData!$N:$N,GoalEntryData!I13))","v":""}]

{"sheet":"RawData","index":2,"n_rows":316,"n_cols":22,"rows_kept":316,"cut":false,"hidden":true,"merged":[]}
["Goal 1","Number","Date","Goal1","Goal2 count","BM11","BM11 count","BM21","BM21 count","BM31","BM31 count","Goal 2","Number","Date","Goal2","Goal2 count","BM12","BM12 count","BM22","BM22 count","BM32","BM32 count"]
[null,null,null,{"$f":"IF($B2=\"\",\"\",IF(GoalEntryData!$C$6=\"<=\",IF($B2<=GoalEntryData!$D$6,1,0),IF(GoalEntryData!$C$6=\">=\",IF($B2>=GoalEntryData!$D$6,1,0),\"\")))","v":""},{"$f":"D$2","v":""},{"$f":"IF($B2=\"\",\"\",IF(GoalEntryData!$C$7=\"<=\",IF($B2<=GoalEntryData!$D$7,1,0),IF(GoalEntryData!$C$7=\">=\",IF($B2>=GoalEntryData!$D$7,1,0),\"\")))","v":""},{"$f":"F$2","v":""},{"$f":"IF($B2=\"\",\"\",IF(GoalEntryData!$C$8=\"<=\",IF($B2<=GoalEntryData!$D$8,1,0),IF(GoalEntryData!$C$8=\">=\",IF($B2>=GoalEntryData!$D$8,1,0),\"\")))","v":""},{"$f":"H$2","v":""},{"$f":"IF($B2=\"\",\"\",IF(GoalEntryData!$C$9=\"<=\",IF($B2<=GoalEntryData!$D$9,1,0),IF(GoalEntryData!$C$9=\">=\",IF($B2>=GoalEntryData!$D$9,1,0),\"\")))","v":""},{"$f":"J$2","v":""},null,null,null,{"$f":"IF($M2=\"\",\"\",IF(GoalEntryData!$C$10=\"<=\",IF($M2<=GoalEntryData!$D$10,1,0),IF(GoalEntryData!$C$10=\">=\",IF($M2>=GoalEntryData!$D$10,1,0),\"\")))","v":""},{"$f":"O$2","v":""},{"$f":"IF($M2=\"\",\"\",IF(GoalEntryData!$C$11=\"<=\",IF($M2<=GoalEntryData!$D$11,1,0),IF(GoalEntryData!$C$11=\">=\",IF($M2>=GoalEntryData!$D$11,1,0),\"\")))","v":""},{"$f":"Q$2","v":""},{"$f":"IF($M2=\"\",\"\",IF(GoalEntryData!$C$12=\"<=\",IF($M2<=GoalEntryData!$D$12,1,0),IF(GoalEntryData!$C$10=\">=\",IF($M2>=GoalEntryData!$D$12,1,0),\"\")))","v":""},{"$f":"S$2","v":""},{"$f":"IF($M2=\"\",\"\",IF(GoalEntryData!$C$13=\"<=\",IF($M2<=GoalEntryData!$D$13,1,0),IF(GoalEntryData!$C$13=\">=\",IF($M2>=GoalEntryData!$D$13,1,0),\"\")))","v":""},{"$f":"U$2","v":""}]
[null,null,null,{"$f":"IF($B3=\"\",\"\",IF(GoalEntryData!$C$6=\"<=\",IF($B3<=GoalEntryData!$D$6,1,0),IF(GoalEntryData!$C$6=\">=\",IF($B3>=GoalEntryData!$D$6,1,0),\"\")))","v":""},{"$f":"IF(AND(E2>=1,D3=1),E2+1,D3)","v":""},{"$f":"IF($B3=\"\",\"\",IF(GoalEntryData!$C$7=\"<=\",IF($B3<=GoalEntryData!$D$7,1,0),IF(GoalEntryData!$C$7=\">=\",IF($B3>=GoalEntryData!$D$7,1,0),\"\")))","v":""},{"$f":"IF(AND(G2>=1,F3=1),G2+1,F3)","v":""},{"$f":"IF($B3=\"\",\"\",IF(GoalEntryData!$C$8=\"<=\",IF($B3<=GoalEntryData!$D$8,1,0),IF(GoalEntryData!$C$8=\">=\",IF($B3>=GoalEntryData!$D$8,1,0),\"\")))","v":""},{"$f":"IF(AND(I2>=1,H3=1),I2+1,H3)","v":""},{"$f":"IF($B3=\"\",\"\",IF(GoalEntryData!$C$9=\"<=\",IF($B3<=GoalEntryData!$D$9,1,0),IF(GoalEntryData!$C$9=\">=\",IF($B3>=GoalEntryData!$D$9,1,0),\"\")))","v":""},{"$f":"IF(AND(K2>=1,J3=1),K2+1,J3)","v":""},null,null,null,{"$f":"IF($M3=\"\",\"\",IF(GoalEntryData!$C$10=\"<=\",IF($M3<=GoalEntryData!$D$10,1,0),IF(GoalEntryData!$C$10=\">=\",IF($M3>=GoalEntryData!$D$10,1,0),\"\")))","v":""},{"$f":"IF(AND(P2>=1,O3=1),P2+1,O3)","v":""},{"$f":"IF($M3=\"\",\"\",IF(GoalEntryData!$C$11=\"<=\",IF($M3<=GoalEntryData!$D$11,1,0),IF(GoalEntryData!$C$11=\">=\",IF($M3>=GoalEntryData!$D$11,1,0),\"\")))","v":""},{"$f":"IF(AND(R2>=1,Q3=1),R2+1,Q3)","v":""},{"$f":"IF($M3=\"\",\"\",IF(GoalEntryData!$C$12=\"<=\",IF($M3<=GoalEntryData!$D$12,1,0),IF(GoalEntryData!$C$10=\">=\",IF($M3>=GoalEntryData!$D$12,1,0),\"\")))","v":""},{"$f":"IF(AND(T2>=1,S3=1),T2+1,S3)","v":""},{"$f":"IF($M3=\"\",\"\",IF(GoalEntryData!$C$13=\"<=\",IF($M3<=GoalEntryData!$D$13,1,0),IF(GoalEntryData!$C$13=\">=\",IF($M3>=GoalEntryData!$D$13,1,0),\"\")))","v":""},{"$f":"IF(AND(V2>=1,U3=1),V2+1,U3)","v":""}]
[null,null,null,{"$f":"IF($B4=\"\",\"\",IF(GoalEntryData!$C$6=\"<=\",IF($B4<=GoalEntryData!$D$6,1,0),IF(GoalEntryData!$C$6=\">=\",IF($B4>=GoalEntryData!$D$6,1,0),\"\")))","v":""},{"$f":"IF(AND(E3>=1,D4=1),E3+1,D4)","v":""},{"$f":"IF($B4=\"\",\"\",IF(GoalEntryData!$C$7=\"<=\",IF($B4<=GoalEntryData!$D$7,1,0),IF(GoalEntryData!$C$7=\">=\",IF($B4>=GoalEntryData!$D$7,1,0),\"\")))","v":""},{"$f":"IF(AND(G3>=1,F4=1),G3+1,F4)","v":""},{"$f":"IF($B4=\"\",\"\",IF(GoalEntryData!$C$8=\"<=\",IF($B4<=GoalEntryData!$D$8,1,0),IF(GoalEntryData!$C$8=\">=\",IF($B4>=GoalEntryData!$D$8,1,0),\"\")))","v":""},{"$f":"IF(AND(I3>=1,H4=1),I3+1,H4)","v":""},{"$f":"IF($B4=\"\",\"\",IF(GoalEntryData!$C$9=\"<=\",IF($B4<=GoalEntryData!$D$9,1,0),IF(GoalEntryData!$C$9=\">=\",IF($B4>=GoalEntryData!$D$9,1,0),\"\")))","v":""},{"$f":"IF(AND(K3>=1,J4=1),K3+1,J4)","v":""},null,null,null,{"$f":"IF($M4=\"\",\"\",IF(GoalEntryData!$C$10=\"<=\",IF($M4<=GoalEntryData!$D$10,1,0),IF(GoalEntryData!$C$10=\">=\",IF($M4>=GoalEntryData!$D$10,1,0),\"\")))","v":""},{"$f":"IF(AND(P3>=1,O4=1),P3+1,O4)","v":""},{"$f":"IF($M4=\"\",\"\",IF(GoalEntryData!$C$11=\"<=\",IF($M4<=GoalEntryData!$D$11,1,0),IF(GoalEntryData!$C$11=\">=\",IF($M4>=GoalEntryData!$D$11,1,0),\"\")))","v":""},{"$f":"IF(AND(R3>=1,Q4=1),R3+1,Q4)","v":""},{"$f":"IF($M4=\"\",\"\",IF(GoalEntryData!$C$12=\"<=\",IF($M4<=GoalEntryData!$D$12,1,0),IF(GoalEntryData!$C$10=\">=\",IF($M4>=GoalEntryData!$D$12,1,0),\"\")))","v":""},{"$f":"IF(AND(T3>=1,S4=1),T3+1,S4)","v":""},{"$f":"IF($M4=\"\",\"\",IF(GoalEntryData!$C$13=\"<=\",IF($M4<=GoalEntryData!$D$13,1,0),IF(GoalEntryData!$C$13=\">=\",IF($M4>=GoalEntryData!$D$13,1,0),\"\")))","v":""},{"$f":"IF(AND(V3>=1,U4=1),V3+1,U4)","v":""}]
[null,null,null,{"$f":"IF($B5=\"\",\"\",IF(GoalEntryData!$C$6=\"<=\",IF($B5<=GoalEntryData!$D$6,1,0),IF(GoalEntryData!$C$6=\">=\",IF($B5>=GoalEntryData!$D$6,1,0),\"\")))","v":""},"",{"$f":"IF($B5=\"\",\"\",IF(GoalEntryData!$C$7=\"<=\",IF($B5<=GoalEntryData!$D$7,1,0),IF(GoalEntryData!$C$7=\">=\",IF($B5>=GoalEntryData!$D$7,1,0),\"\")))","v":""},"",{"$f":"IF($B5=\"\",\"\",IF(GoalEntryData!$C$8=\"<=\",IF($B5<=GoalEntryData!$D$8,1,0),IF(GoalEntryData!$C$8=\">=\",IF($B5>=GoalEntryData!$D$8,1,0),\"\")))","v":""},"",{"$f":"IF($B5=\"\",\"\",IF(GoalEntryData!$C$9=\"<=\",IF($B5<=GoalEntryData!$D$9,1,0),IF(GoalEntryData!$C$9=\">=\",IF($B5>=GoalEntryData!$D$9,1,0),\"\")))","v":""},"",null,null,null,{"$f":"IF($M5=\"\",\"\",IF(GoalEntryData!$C$10=\"<=\",IF($M5<=GoalEntryData!$D$10,1,0),IF(GoalEntryData!$C$10=\">=\",IF($M5>=GoalEntryData!$D$10,1,0),\"\")))","v":""},"",{"$f":"IF($M5=\"\",\"\",IF(GoalEntryData!$C$11=\"<=\",IF($M5<=GoalEntryData!$D$11,1,0),IF(GoalEntryData!$C$11=\">=\",IF($M5>=GoalEntryData!$D$11,1,0),\"\")))","v":""},"",{"$f":"IF($M5=\"\",\"\",IF(GoalEntryData!$C$12=\"<=\",IF($M5<=GoalEntryData!$D$12,1,0),IF(GoalEntryData!$C$10=\">=\",IF($M5>=GoalEntryData!$D$12,1,0),\"\")))","v":""},"",{"$f":"IF($M5=\"\",\"\",IF(GoalEntryData!$C$13=\"<=\",IF($M5<=GoalEntryData!$D$13,1,0),IF(GoalEntryData!$C$13=\">=\",IF($M5>=GoalEntryData!$D$13,1,0),\"\")))","v":""},""]
[null,null,null,{"$f":"IF($B6=\"\",\"\",IF(GoalEntryData!$C$6=\"<=\",IF($B6<=GoalEntryData!$D$6,1,0),IF(GoalEntryData!$C$6=\">=\",IF($B6>=GoalEntryData!$D$6,1,0),\"\")))","v":""},"",{"$f":"IF($B6=\"\",\"\",IF(GoalEntryData!$C$7=\"<=\",IF($B6<=GoalEntryData!$D$7,1,0),IF(GoalEntryData!$C$7=\">=\",IF($B6>=GoalEntryData!$D$7,1,0),\"\")))","v":""},"",{"$f":"IF($B6=\"\",\"\",IF(GoalEntryData!$C$8=\"<=\",IF($B6<=GoalEntryData!$D$8,1,0),IF(GoalEntryData!$C$8=\">=\",IF($B6>=GoalEntryData!$D$8,1,0),\"\")))","v":""},"",{"$f":"IF($B6=\"\",\"\",IF(GoalEntryData!$C$9=\"<=\",IF($B6<=GoalEntryData!$D$9,1,0),IF(GoalEntryData!$C$9=\">=\",IF($B6>=GoalEntryData!$D$9,1,0),\"\")))","v":""},"",null,null,null,{"$f":"IF($M6=\"\",\"\",IF(GoalEntryData!$C$10=\"<=\",IF($M6<=GoalEntryData!$D$10,1,0),IF(GoalEntryData!$C$10=\">=\",IF($M6>=GoalEntryData!$D$10,1,0),\"\")))","v":""},"",{"$f":"IF($M6=\"\",\"\",IF(GoalEntryData!$C$11=\"<=\",IF($M6<=GoalEntryData!$D$11,1,0),IF(GoalEntryData!$C$11=\">=\",IF($M6>=GoalEntryData!$D$11,1,0),\"\")))","v":""},"",{"$f":"IF($M6=\"\",\"\",IF(GoalEntryData!$C$12=\"<=\",IF($M6<=GoalEntryData!$D$12,1,0),IF(GoalEntryData!$C$10=\">=\",IF($M6>=GoalEntryData!$D$12,1,0),\"\")))","v":""},"",{"$f":"IF($M6=\"\",\"\",IF(GoalEntryData!$C$13=\"<=\",IF($M6<=GoalEntryData!$D$13,1,0),IF(GoalEntryData!$C$13=\">=\",IF($M6>=GoalEntryData!$D$13,1,0),\"\")))","v":""},""]
[null,null,null,{"$f":"IF($B7=\"\",\"\",IF(GoalEntryData!$C$6=\"<=\",IF($B7<=GoalEntryData!$D$6,1,0),IF(GoalEntryData!$C$6=\">=\",IF($B7>=GoalEntryData!$D$6,1,0),\"\")))","v":""},"",{"$f":"IF($B7=\"\",\"\",IF(GoalEntryData!$C$7=\"<=\",IF($B7<=GoalEntryData!$D$7,1,0),IF(GoalEntryData!$C$7=\">=\",IF($B7>=GoalEntryData!$D$7,1,0),\"\")))","v":""},"",{"$f":"IF($B7=\"\",\"\",IF(GoalEntryData!$C$8=\"<=\",IF($B7<=GoalEntryData!$D$8,1,0),IF(GoalEntryData!$C$8=\">=\",IF($B7>=GoalEntryData!$D$8,1,0),\"\")))","v":""},"",{"$f":"IF($B7=\"\",\"\",IF(GoalEntryData!$C$9=\"<=\",IF($B7<=GoalEntryData!$D$9,1,0),IF(GoalEntryData!$C$9=\">=\",IF($B7>=GoalEntryData!$D$9,1,0),\"\")))","v":""},"",null,null,null,{"$f":"IF($M7=\"\",\"\",IF(GoalEntryData!$C$10=\"<=\",IF($M7<=GoalEntryData!$D$10,1,0),IF(GoalEntryData!$C$10=\">=\",IF($M7>=GoalEntryData!$D$10,1,0),\"\")))","v":""},"",{"$f":"IF($M7=\"\",\"\",IF(GoalEntryData!$C$11=\"<=\",IF($M7<=GoalEntryData!$D$11,1,0),IF(GoalEntryData!$C$11=\">=\",IF($M7>=GoalEntryData!$D$11,1,0),\"\")))","v":""},"",{"$f":"IF($M7=\"\",\"\",IF(GoalEntryData!$C$12=\"<=\",IF($M7<=GoalEntryData!$D$12,1,0),IF(GoalEntryData!$C$10=\">=\",IF($M7>=GoalEntryData!$D$12,1,0),\"\")))","v":""},"",{"$f":"IF($M7=\"\",\"\",IF(GoalEntryData!$C$13=\"<=\",IF($M7<=GoalEntryData!$D$13,1,0),IF(GoalEntryData!$C$13=\">=\",IF($M7>=GoalEntryData!$D$13,1,0),\"\")))","v":""},""]
[null,null,null,{"$f":"IF($B8=\"\",\"\",IF(GoalEntryData!$C$6=\"<=\",IF($B8<=GoalEntryData!$D$6,1,0),IF(GoalEntryData!$C$6=\">=\",IF($B8>=GoalEntryData!$D$6,1,0),\"\")))","v":""},"",{"$f":"IF($B8=\"\",\"\",IF(GoalEntryData!$C$7=\"<=\",IF($B8<=GoalEntryData!$D$7,1,0),IF(GoalEntryData!$C$7=\">=\",IF($B8>=GoalEntryData!$D$7,1,0),\"\")))","v":""},"",{"$f":"IF($B8=\"\",\"\",IF(GoalEntryData!$C$8=\"<=\",IF($B8<=GoalEntryData!$D$8,1,0),IF(GoalEntryData!$C$8=\">=\",IF($B8>=GoalEntryData!$D$8,1,0),\"\")))","v":""},"",{"$f":"IF($B8=\"\",\"\",IF(GoalEntryData!$C$9=\"<=\",IF($B8<=GoalEntryData!$D$9,1,0),IF(GoalEntryData!$C$9=\">=\",IF($B8>=GoalEntryData!$D$9,1,0),\"\")))","v":""},"",null,null,null,{"$f":"IF($M8=\"\",\"\",IF(GoalEntryData!$C$10=\"<=\",IF($M8<=GoalEntryData!$D$10,1,0),IF(GoalEntryData!$C$10=\">=\",IF($M8>=GoalEntryData!$D$10,1,0),\"\")))","v":""},"",{"$f":"IF($M8=\"\",\"\",IF(GoalEntryData!$C$11=\"<=\",IF($M8<=GoalEntryData!$D$11,1,0),IF(GoalEntryData!$C$11=\">=\",IF($M8>=GoalEntryData!$D$11,1,0),\"\")))","v":""},"",{"$f":"IF($M8=\"\",\"\",IF(GoalEntryData!$C$12=\"<=\",IF($M8<=GoalEntryData!$D$12,1,0),IF(GoalEntryData!$C$10=\">=\",IF($M8>=GoalEntryData!$D$12,1,0),\"\")))","v":""},"",{"$f":"IF($M8=\"\",\"\",IF(GoalEntryData!$C$13=\"<=\",IF($M8<=GoalEntryData!$D$13,1,0),IF(GoalEntryData!$C$13=\">=\",IF($M8>=GoalEntryData!$D$13,1,0),\"\")))","v":""},""]
[null,null,null,{"$f":"IF($B9=\"\",\"\",IF(GoalEntryData!$C$6=\"<=\",IF($B9<=GoalEntryData!$D$6,1,0),IF(GoalEntryData!$C$6=\">=\",IF($B9>=GoalEntryData!$D$6,1,0),\"\")))","v":""},"",{"$f":"IF($B9=\"\",\"\",IF(GoalEntryData!$C$7=\"<=\",IF($B9<=GoalEntryData!$D$7,1,0),IF(GoalEntryData!$C$7=\">=\",IF($B9>=GoalEntryData!$D$7,1,0),\"\")))","v":""},"",{"$f":"IF($B9=\"\",\"\",IF(GoalEntryData!$C$8=\"<=\",IF($B9<=GoalEntryData!$D$8,1,0),IF(GoalEntryData!$C$8=\">=\",IF($B9>=GoalEntryData!$D$8,1,0),\"\")))","v":""},"",{"$f":"IF($B9=\"\",\"\",IF(GoalEntryData!$C$9=\"<=\",IF($B9<=GoalEntryData!$D$9,1,0),IF(GoalEntryData!$C$9=\">=\",IF($B9>=GoalEntryData!$D$9,1,0),\"\")))","v":""},"",null,null,null,{"$f":"IF($M9=\"\",\"\",IF(GoalEntryData!$C$10=\"<=\",IF($M9<=GoalEntryData!$D$10,1,0),IF(GoalEntryData!$C$10=\">=\",IF($M9>=GoalEntryData!$D$10,1,0),\"\")))","v":""},"",{"$f":"IF($M9=\"\",\"\",IF(GoalEntryData!$C$11=\"<=\",IF($M9<=GoalEntryData!$D$11,1,0),IF(GoalEntryData!$C$11=\">=\",IF($M9>=GoalEntryData!$D$11,1,0),\"\")))","v":""},"",{"$f":"IF($M9=\"\",\"\",IF(GoalEntryData!$C$12=\"<=\",IF($M9<=GoalEntryData!$D$12,1,0),IF(GoalEntryData!$C$10=\">=\",IF($M9>=GoalEntryData!$D$12,1,0),\"\")))","v":""},"",{"$f":"IF($M9=\"\",\"\",IF(GoalEntryData!$C$13=\"<=\",IF($M9<=GoalEntryData!$D$13,1,0),IF(GoalEntryData!$C$13=\">=\",IF($M9>=GoalEntryData!$D$13,1,0),\"\")))","v":""},""]
[null,null,null,{"$f":"IF($B10=\"\",\"\",IF(GoalEntryData!$C$6=\"<=\",IF($B10<=GoalEntryData!$D$6,1,0),IF(GoalEntryData!$C$6=\">=\",IF($B10>=GoalEntryData!$D$6,1,0),\"\")))","v":""},"",{"$f":"IF($B10=\"\",\"\",IF(GoalEntryData!$C$7=\"<=\",IF($B10<=GoalEntryData!$D$7,1,0),IF(GoalEntryData!$C$7=\">=\",IF($B10>=GoalEntryData!$D$7,1,0),\"\")))","v":""},"",{"$f":"IF($B10=\"\",\"\",IF(GoalEntryData!$C$8=\"<=\",IF($B10<=GoalEntryData!$D$8,1,0),IF(GoalEntryData!$C$8=\">=\",IF($B10>=GoalEntryData!$D$8,1,0),\"\")))","v":""},"",{"$f":"IF($B10=\"\",\"\",IF(GoalEntryData!$C$9=\"<=\",IF($B10<=GoalEntryData!$D$9,1,0),IF(GoalEntryData!$C$9=\">=\",IF($B10>=GoalEntryData!$D$9,1,0),\"\")))","v":""},"",null,null,null,{"$f":"IF($M10=\"\",\"\",IF(GoalEntryData!$C$10=\"<=\",IF($M10<=GoalEntryData!$D$10,1,0),IF(GoalEntryData!$C$10=\">=\",IF($M10>=GoalEntryData!$D$10,1,0),\"\")))","v":""},"",{"$f":"IF($M10=\"\",\"\",IF(GoalEntryData!$C$11=\"<=\",IF($M10<=GoalEntryData!$D$11,1,0),IF(GoalEntryData!$C$11=\">=\",IF($M10>=GoalEntryData!$D$11,1,0),\"\")))","v":""},"",{"$f":"IF($M10=\"\",\"\",IF(GoalEntryData!$C$12=\"<=\",IF($M10<=GoalEntryData!$D$12,1,0),IF(GoalEntryData!$C$10=\">=\",IF($M10>=GoalEntryData!$D$12,1,0),\"\")))","v":""},"",{"$f":"IF($M10=\"\",\"\",IF(GoalEntryData!$C$13=\"<=\",IF($M10<=GoalEntryData!$D$13,1,0),IF(GoalEntryData!$C$13=\">=\",IF($M10>=GoalEntryData!$D$13,1,0),\"\")))","v":""},""]
[null,null,null,{"$f":"IF($B11=\"\",\"\",IF(GoalEntryData!$C$6=\"<=\",IF($B11<=GoalEntryData!$D$6,1,0),IF(GoalEntryData!$C$6=\">=\",IF($B11>=GoalEntryData!$D$6,1,0),\"\")))","v":""},"",{"$f":"IF($B11=\"\",\"\",IF(GoalEntryData!$C$7=\"<=\",IF($B11<=GoalEntryData!$D$7,1,0),IF(GoalEntryData!$C$7=\">=\",IF($B11>=GoalEntryData!$D$7,1,0),\"\")))","v":""},"",{"$f":"IF($B11=\"\",\"\",IF(GoalEntryData!$C$8=\"<=\",IF($B11<=GoalEntryData!$D$8,1,0),IF(GoalEntryData!$C$8=\">=\",IF($B11>=GoalEntryData!$D$8,1,0),\"\")))","v":""},"",{"$f":"IF($B11=\"\",\"\",IF(GoalEntryData!$C$9=\"<=\",IF($B11<=GoalEntryData!$D$9,1,0),IF(GoalEntryData!$C$9=\">=\",IF($B11>=GoalEntryData!$D$9,1,0),\"\")))","v":""},"",null,null,null,{"$f":"IF($M11=\"\",\"\",IF(GoalEntryData!$C$10=\"<=\",IF($M11<=GoalEntryData!$D$10,1,0),IF(GoalEntryData!$C$10=\">=\",IF($M11>=GoalEntryData!$D$10,1,0),\"\")))","v":""},"",{"$f":"IF($M11=\"\",\"\",IF(GoalEntryData!$C$11=\"<=\",IF($M11<=GoalEntryData!$D$11,1,0),IF(GoalEntryData!$C$11=\">=\",IF($M11>=GoalEntryData!$D$11,1,0),\"\")))","v":""},"",{"$f":"IF($M11=\"\",\"\",IF(GoalEntryData!$C$12=\"<=\",IF($M11<=GoalEntryData!$D$12,1,0),IF(GoalEntryData!$C$10=\">=\",IF($M11>=GoalEntryData!$D$12,1,0),\"\")))","v":""},"",{"$f":"IF($M11=\"\",\"\",IF(GoalEntryData!$C$13=\"<=\",IF($M11<=GoalEntryData!$D$13,1,0),IF(GoalEntryData!$C$13=\">=\",IF($M11>=GoalEntryData!$D$13,1,0),\"\")))","v":""},""]
[null,null,null,{"$f":"IF($B12=\"\",\"\",IF(GoalEntryData!$C$6=\"<=\",IF($B12<=GoalEntryData!$D$6,1,0),IF(GoalEntryData!$C$6=\">=\",IF($B12>=GoalEntryData!$D$6,1,0),\"\")))","v":""},"",{"$f":"IF($B12=\"\",\"\",IF(GoalEntryData!$C$7=\"<=\",IF($B12<=GoalEntryData!$D$7,1,0),IF(GoalEntryData!$C$7=\">=\",IF($B12>=GoalEntryData!$D$7,1,0),\"\")))","v":""},"",{"$f":"IF($B12=\"\",\"\",IF(GoalEntryData!$C$8=\"<=\",IF($B12<=GoalEntryData!$D$8,1,0),IF(GoalEntryData!$C$8=\">=\",IF($B12>=GoalEntryData!$D$8,1,0),\"\")))","v":""},"",{"$f":"IF($B12=\"\",\"\",IF(GoalEntryData!$C$9=\"<=\",IF($B12<=GoalEntryData!$D$9,1,0),IF(GoalEntryData!$C$9=\">=\",IF($B12>=GoalEntryData!$D$9,1,0),\"\")))","v":""},"",null,null,null,{"$f":"IF($M12=\"\",\"\",IF(GoalEntryData!$C$10=\"<=\",IF($M12<=GoalEntryData!$D$10,1,0),IF(GoalEntryData!$C$10=\">=\",IF($M12>=GoalEntryData!$D$10,1,0),\"\")))","v":""},"",{"$f":"IF($M12=\"\",\"\",IF(GoalEntryData!$C$11=\"<=\",IF($M12<=GoalEntryData!$D$11,1,0),IF(GoalEntryData!$C$11=\">=\",IF($M12>=GoalEntryData!$D$11,1,0),\"\")))","v":""},"",{"$f":"IF($M12=\"\",\"\",IF(GoalEntryData!$C$12=\"<=\",IF($M12<=GoalEntryData!$D$12,1,0),IF(GoalEntryData!$C$10=\">=\",IF($M12>=GoalEntryData!$D$12,1,0),\"\")))","v":""},"",{"$f":"IF($M12=\"\",\"\",IF(GoalEntryData!$C$13=\"<=\",IF($M12<=GoalEntryData!$D$13,1,0),IF(GoalEntryData!$C$13=\">=\",IF($M12>=GoalEntryData!$D$13,1,0),\"\")))","v":""},""]
[null,null,null,{"$f":"IF($B13=\"\",\"\",IF(GoalEntryData!$C$6=\"<=\",IF($B13<=GoalEntryData!$D$6,1,0),IF(GoalEntryData!$C$6=\">=\",IF($B13>=GoalEntryData!$D$6,1,0),\"\")))","v":""},"",{"$f":"IF($B13=\"\",\"\",IF(GoalEntryData!$C$7=\"<=\",IF($B13<=GoalEntryData!$D$7,1,0),IF(GoalEntryData!$C$7=\">=\",IF($B13>=GoalEntryData!$D$7,1,0),\"\")))","v":""},"",{"$f":"IF($B13=\"\",\"\",IF(GoalEntryData!$C$8=\"<=\",IF($B13<=GoalEntryData!$D$8,1,0),IF(GoalEntryData!$C$8=\">=\",IF($B13>=GoalEntryData!$D$8,1,0),\"\")))","v":""},"",{"$f":"IF($B13=\"\",\"\",IF(GoalEntryData!$C$9=\"<=\",IF($B13<=GoalEntryData!$D$9,1,0),IF(GoalEntryData!$C$9=\">=\",IF($B13>=GoalEntryData!$D$9,1,0),\"\")))","v":""},"",null,null,null,{"$f":"IF($M13=\"\",\"\",IF(GoalEntryData!$C$10=\"<=\",IF($M13<=GoalEntryData!$D$10,1,0),IF(GoalEntryData!$C$10=\">=\",IF($M13>=GoalEntryData!$D$10,1,0),\"\")))","v":""},"",{"$f":"IF($M13=\"\",\"\",IF(GoalEntryData!$C$11=\"<=\",IF($M13<=GoalEntryData!$D$11,1,0),IF(GoalEntryData!$C$11=\">=\",IF($M13>=GoalEntryData!$D$11,1,0),\"\")))","v":""},"",{"$f":"IF($M13=\"\",\"\",IF(GoalEntryData!$C$12=\"<=\",IF($M13<=GoalEntryData!$D$12,1,0),IF(GoalEntryData!$C$10=\">=\",IF($M13>=GoalEntryData!$D$12,1,0),\"\")))","v":""},"",{"$f":"IF($M13=\"\",\"\",IF(GoalEntryData!$C$13=\"<=\",IF($M13<=GoalEntryData!$D$13,1,0),IF(GoalEntryData!$C$13=\">=\",IF($M13>=GoalEntryData!$D$13,1,0),\"\")))","v":""},""]
[null,null,null,{"$f":"IF($B14=\"\",\"\",IF(GoalEntryData!$C$6=\"<=\",IF($B14<=GoalEntryData!$D$6,1,0),IF(GoalEntryData!$C$6=\">=\",IF($B14>=GoalEntryData!$D$6,1,0),\"\")))","v":""},"",{"$f":"IF($B14=\"\",\"\",IF(GoalEntryData!$C$7=\"<=\",IF($B14<=GoalEntryData!$D$7,1,0),IF(GoalEntryData!$C$7=\">=\",IF($B14>=GoalEntryData!$D$7,1,0),\"\")))","v":""},"",{"$f":"IF($B14=\"\",\"\",IF(GoalEntryData!$C$8=\"<=\",IF($B14<=GoalEntryData!$D$8,1,0),IF(GoalEntryData!$C$8=\">=\",IF($B14>=GoalEntryData!$D$8,1,0),\"\")))","v":""},"",{"$f":"IF($B14=\"\",\"\",IF(GoalEntryData!$C$9=\"<=\",IF($B14<=GoalEntryData!$D$9,1,0),IF(GoalEntryData!$C$9=\">=\",IF($B14>=GoalEntryData!$D$9,1,0),\"\")))","v":""},"",null,null,null,{"$f":"IF($M14=\"\",\"\",IF(GoalEntryData!$C$10=\"<=\",IF($M14<=GoalEntryData!$D$10,1,0),IF(GoalEntryData!$C$10=\">=\",IF($M14>=GoalEntryData!$D$10,1,0),\"\")))","v":""},"",{"$f":"IF($M14=\"\",\"\",IF(GoalEntryData!$C$11=\"<=\",IF($M14<=GoalEntryData!$D$11,1,0),IF(GoalEntryData!$C$11=\">=\",IF($M14>=GoalEntryData!$D$11,1,0),\"\")))","v":""},"",{"$f":"IF($M14=\"\",\"\",IF(GoalEntryData!$C$12=\"<=\",IF($M14<=GoalEntryData!$D$12,1,0),IF(GoalEntryData!$C$10=\">=\",IF($M14>=GoalEntryData!$D$12,1,0),\"\")))","v":""},"",{"$f":"IF($M14=\"\",\"\",IF(GoalEntryData!$C$13=\"<=\",IF($M14<=GoalEntryData!$D$13,1,0),IF(GoalEntryData!$C$13=\">=\",IF($M14>=GoalEntryData!$D$13,1,0),\"\")))","v":""},""]
[null,null,null,{"$f":"IF($B15=\"\",\"\",IF(GoalEntryData!$C$6=\"<=\",IF($B15<=GoalEntryData!$D$6,1,0),IF(GoalEntryData!$C$6=\">=\",IF($B15>=GoalEntryData!$D$6,1,0),\"\")))","v":""},"",{"$f":"IF($B15=\"\",\"\",IF(GoalEntryData!$C$7=\"<=\",IF($B15<=GoalEntryData!$D$7,1,0),IF(GoalEntryData!$C$7=\">=\",IF($B15>=GoalEntryData!$D$7,1,0),\"\")))","v":""},"",{"$f":"IF($B15=\"\",\"\",IF(GoalEntryData!$C$8=\"<=\",IF($B15<=GoalEntryData!$D$8,1,0),IF(GoalEntryData!$C$8=\">=\",IF($B15>=GoalEntryData!$D$8,1,0),\"\")))","v":""},"",{"$f":"IF($B15=\"\",\"\",IF(GoalEntryData!$C$9=\"<=\",IF($B15<=GoalEntryData!$D$9,1,0),IF(GoalEntryData!$C$9=\">=\",IF($B15>=GoalEntryData!$D$9,1,0),\"\")))","v":""},"",null,null,null,{"$f":"IF($M15=\"\",\"\",IF(GoalEntryData!$C$10=\"<=\",IF($M15<=GoalEntryData!$D$10,1,0),IF(GoalEntryData!$C$10=\">=\",IF($M15>=GoalEntryData!$D$10,1,0),\"\")))","v":""},"",{"$f":"IF($M15=\"\",\"\",IF(GoalEntryData!$C$11=\"<=\",IF($M15<=GoalEntryData!$D$11,1,0),IF(GoalEntryData!$C$11=\">=\",IF($M15>=GoalEntryData!$D$11,1,0),\"\")))","v":""},"",{"$f":"IF($M15=\"\",\"\",IF(GoalEntryData!$C$12=\"<=\",IF($M15<=GoalEntryData!$D$12,1,0),IF(GoalEntryData!$C$10=\">=\",IF($M15>=GoalEntryData!$D$12,1,0),\"\")))","v":""},"",{"$f":"IF($M15=\"\",\"\",IF(GoalEntryData!$C$10=\"<=\",IF($M15<=GoalEntryData!$D$10,1,0),IF(GoalEntryData!$C$10=\">=\",IF($M15>=GoalEntryData!$D$10,1,0),\"\")))","v":""},""]
[null,null,null,{"$f":"IF($B16=\"\",\"\",IF(GoalEntryData!$C$6=\"<=\",IF($B16<=GoalEntryData!$D$6,1,0),IF(GoalEntryData!$C$6=\">=\",IF($B16>=GoalEntryData!$D$6,1,0),\"\")))","v":""},"",{"$f":"IF($B16=\"\",\"\",IF(GoalEntryData!$C$7=\"<=\",IF($B16<=GoalEntryData!$D$7,1,0),IF(GoalEntryData!$C$7=\">=\",IF($B16>=GoalEntryData!$D$7,1,0),\"\")))","v":""},"",{"$f":"IF($B16=\"\",\"\",IF(GoalEntryData!$C$8=\"<=\",IF($B16<=GoalEntryData!$D$8,1,0),IF(GoalEntryData!$C$8=\">=\",IF($B16>=GoalEntryData!$D$8,1,0),\"\")))","v":""},"",{"$f":"IF($B16=\"\",\"\",IF(GoalEntryData!$C$9=\"<=\",IF($B16<=GoalEntryData!$D$9,1,0),IF(GoalEntryData!$C$9=\">=\",IF($B16>=GoalEntryData!$D$9,1,0),\"\")))","v":""},"",null,null,null,{"$f":"IF($M16=\"\",\"\",IF(GoalEntryData!$C$10=\"<=\",IF($M16<=GoalEntryData!$D$10,1,0),IF(GoalEntryData!$C$10=\">=\",IF($M16>=GoalEntryData!$D$10,1,0),\"\")))","v":""},"",{"$f":"IF($M16=\"\",\"\",IF(GoalEntryData!$C$11=\"<=\",IF($M16<=GoalEntryData!$D$11,1,0),IF(GoalEntryData!$C$11=\">=\",IF($M16>=GoalEntryData!$D$11,1,0),\"\")))","v":""},"",{"$f":"IF($M16=\"\",\"\",IF(GoalEntryData!$C$12=\"<=\",IF($M16<=GoalEntryData!$D$12,1,0),IF(GoalEntryData!$C$10=\">=\",IF($M16>=GoalEntryData!$D$12,1,0),\"\")))","v":""},"",{"$f":"IF($M16=\"\",\"\",IF(GoalEntryData!$C$10=\"<=\",IF($M16<=GoalEntryData!$D$10,1,0),IF(GoalEntryData!$C$10=\">=\",IF($M16>=GoalEntryData!$D$10,1,0),\"\")))","v":""},""]
[null,null,null,{"$f":"IF($B17=\"\",\"\",IF(GoalEntryData!$C$6=\"<=\",IF($B17<=GoalEntryData!$D$6,1,0),IF(GoalEntryData!$C$6=\">=\",IF($B17>=GoalEntryData!$D$6,1,0),\"\")))","v":""},"",{"$f":"IF($B17=\"\",\"\",IF(GoalEntryData!$C$7=\"<=\",IF($B17<=GoalEntryData!$D$7,1,0),IF(GoalEntryData!$C$7=\">=\",IF($B17>=GoalEntryData!$D$7,1,0),\"\")))","v":""},"",{"$f":"IF($B17=\"\",\"\",IF(GoalEntryData!$C$8=\"<=\",IF($B17<=GoalEntryData!$D$8,1,0),IF(GoalEntryData!$C$8=\">=\",IF($B17>=GoalEntryData!$D$8,1,0),\"\")))","v":""},"",{"$f":"IF($B17=\"\",\"\",IF(GoalEntryData!$C$6=\"<=\",IF($B17<=GoalEntryData!$D$6,1,0),IF(GoalEntryData!$C$6=\">=\",IF($B17>=GoalEntryData!$D$6,1,0),\"\")))","v":""},"",null,null,null,{"$f":"IF($M17=\"\",\"\",IF(GoalEntryData!$C$10=\"<=\",IF($M17<=GoalEntryData!$D$10,1,0),IF(GoalEntryData!$C$10=\">=\",IF($M17>=GoalEntryData!$D$10,1,0),\"\")))","v":""},"",{"$f":"IF($M17=\"\",\"\",IF(GoalEntryData!$C$11=\"<=\",IF($M17<=GoalEntryData!$D$11,1,0),IF(GoalEntryData!$C$11=\">=\",IF($M17>=GoalEntryData!$D$11,1,0),\"\")))","v":""},"",{"$f":"IF($M17=\"\",\"\",IF(GoalEntryData!$C$12=\"<=\",IF($M17<=GoalEntryData!$D$12,1,0),IF(GoalEntryData!$C$10=\">=\",IF($M17>=GoalEntryData!$D$12,1,0),\"\")))","v":""},"",{"$f":"IF($M17=\"\",\"\",IF(GoalEntryData!$C$10=\"<=\",IF($M17<=GoalEntryData!$D$10,1,0),IF(GoalEntryData!$C$10=\">=\",IF($M17>=GoalEntryData!$D$10,1,0),\"\")))","v":""},""]
[null,null,null,{"$f":"IF($B18=\"\",\"\",IF(GoalEntryData!$C$6=\"<=\",IF($B18<=GoalEntryData!$D$6,1,0),IF(GoalEntryData!$C$6=\">=\",IF($B18>=GoalEntryData!$D$6,1,0),\"\")))","v":""},"",{"$f":"IF($B18=\"\",\"\",IF(GoalEntryData!$C$7=\"<=\",IF($B18<=GoalEntryData!$D$7,1,0),IF(GoalEntryData!$C$7=\">=\",IF($B18>=GoalEntryData!$D$7,1,0),\"\")))","v":""},"",{"$f":"IF($B18=\"\",\"\",IF(GoalEntryData!$C$8=\"<=\",IF($B18<=GoalEntryData!$D$8,1,0),IF(GoalEntryData!$C$8=\">=\",IF($B18>=GoalEntryData!$D$8,1,0),\"\")))","v":""},"",{"$f":"IF($B18=\"\",\"\",IF(GoalEntryData!$C$6=\"<=\",IF($B18<=GoalEntryData!$D$6,1,0),IF(GoalEntryData!$C$6=\">=\",IF($B18>=GoalEntryData!$D$6,1,0),\"\")))","v":""},"",null,null,null,{"$f":"IF($M18=\"\",\"\",IF(GoalEntryData!$C$10=\"<=\",IF($M18<=GoalEntryData!$D$10,1,0),IF(GoalEntryData!$C$10=\">=\",IF($M18>=GoalEntryData!$D$10,1,0),\"\")))","v":""},"",{"$f":"IF($M18=\"\",\"\",IF(GoalEntryData!$C$11=\"<=\",IF($M18<=GoalEntryData!$D$11,1,0),IF(GoalEntryData!$C$11=\">=\",IF($M18>=GoalEntryData!$D$11,1,0),\"\")))","v":""},"",{"$f":"IF($M18=\"\",\"\",IF(GoalEntryData!$C$12=\"<=\",IF($M18<=GoalEntryData!$D$12,1,0),IF(GoalEntryData!$C$10=\">=\",IF($M18>=GoalEntryData!$D$12,1,0),\"\")))","v":""},"",{"$f":"IF($M18=\"\",\"\",IF(GoalEntryData!$C$10=\"<=\",IF($M18<=GoalEntryData!$D$10,1,0),IF(GoalEntryData!$C$10=\">=\",IF($M18>=GoalEntryData!$D$10,1,0),\"\")))","v":""},""]
[null,null,null,{"$f":"IF($B19=\"\",\"\",IF(GoalEntryData!$C$6=\"<=\",IF($B19<=GoalEntryData!$D$6,1,0),IF(GoalEntryData!$C$6=\">=\",IF($B19>=GoalEntryData!$D$6,1,0),\"\")))","v":""},"",{"$f":"IF($B19=\"\",\"\",IF(GoalEntryData!$C$7=\"<=\",IF($B19<=GoalEntryData!$D$7,1,0),IF(GoalEntryData!$C$7=\">=\",IF($B19>=GoalEntryData!$D$7,1,0),\"\")))","v":""},"",{"$f":"IF($B19=\"\",\"\",IF(GoalEntryData!$C$8=\"<=\",IF($B19<=GoalEntryData!$D$8,1,0),IF(GoalEntryData!$C$8=\">=\",IF($B19>=GoalEntryData!$D$8,1,0),\"\")))","v":""},"",{"$f":"IF($B19=\"\",\"\",IF(GoalEntryData!$C$6=\"<=\",IF($B19<=GoalEntryData!$D$6,1,0),IF(GoalEntryData!$C$6=\">=\",IF($B19>=GoalEntryData!$D$6,1,0),\"\")))","v":""},"",null,null,null,{"$f":"IF($M19=\"\",\"\",IF(GoalEntryData!$C$10=\"<=\",IF($M19<=GoalEntryData!$D$10,1,0),IF(GoalEntryData!$C$10=\">=\",IF($M19>=GoalEntryData!$D$10,1,0),\"\")))","v":""},"",{"$f":"IF($M19=\"\",\"\",IF(GoalEntryData!$C$11=\"<=\",IF($M19<=GoalEntryData!$D$11,1,0),IF(GoalEntryData!$C$11=\">=\",IF($M19>=GoalEntryData!$D$11,1,0),\"\")))","v":""},"",{"$f":"IF($M19=\"\",\"\",IF(GoalEntryData!$C$12=\"<=\",IF($M19<=GoalEntryData!$D$12,1,0),IF(GoalEntryData!$C$10=\">=\",IF($M19>=GoalEntryData!$D$12,1,0),\"\")))","v":""},"",{"$f":"IF($M19=\"\",\"\",IF(GoalEntryData!$C$10=\"<=\",IF($M19<=GoalEntryData!$D$10,1,0),IF(GoalEntryData!$C$10=\">=\",IF($M19>=GoalEntryData!$D$10,1,0),\"\")))","v":""},""]
[null,null,null,{"$f":"IF($B20=\"\",\"\",IF(GoalEntryData!$C$6=\"<=\",IF($B20<=GoalEntryData!$D$6,1,0),IF(GoalEntryData!$C$6=\">=\",IF($B20>=GoalEntryData!$D$6,1,0),\"\")))","v":""},"",{"$f":"IF($B20=\"\",\"\",IF(GoalEntryData!$C$7=\"<=\",IF($B20<=GoalEntryData!$D$7,1,0),IF(GoalEntryData!$C$7=\">=\",IF($B20>=GoalEntryData!$D$7,1,0),\"\")))","v":""},"",{"$f":"IF($B20=\"\",\"\",IF(GoalEntryData!$C$8=\"<=\",IF($B20<=GoalEntryData!$D$8,1,0),IF(GoalEntryData!$C$8=\">=\",IF($B20>=GoalEntryData!$D$8,1,0),\"\")))","v":""},"",{"$f":"IF($B20=\"\",\"\",IF(GoalEntryData!$C$6=\"<=\",IF($B20<=GoalEntryData!$D$6,1,0),IF(GoalEntryData!$C$6=\">=\",IF($B20>=GoalEntryData!$D$6,1,0),\"\")))","v":""},"",null,null,null,{"$f":"IF($M20=\"\",\"\",IF(GoalEntryData!$C$10=\"<=\",IF($M20<=GoalEntryData!$D$10,1,0),IF(GoalEntryData!$C$10=\">=\",IF($M20>=GoalEntryData!$D$10,1,0),\"\")))","v":""},"",{"$f":"IF($M20=\"\",\"\",IF(GoalEntryData!$C$11=\"<=\",IF($M20<=GoalEntryData!$D$11,1,0),IF(GoalEntryData!$C$11=\">=\",IF($M20>=GoalEntryData!$D$11,1,0),\"\")))","v":""},"",{"$f":"IF($M20=\"\",\"\",IF(GoalEntryData!$C$12=\"<=\",IF($M20<=GoalEntryData!$D$12,1,0),IF(GoalEntryData!$C$10=\">=\",IF($M20>=GoalEntryData!$D$12,1,0),\"\")))","v":""},"",{"$f":"IF($M20=\"\",\"\",IF(GoalEntryData!$C$10=\"<=\",IF($M20<=GoalEntryData!$D$10,1,0),IF(GoalEntryData!$C$10=\">=\",IF($M20>=GoalEntryData!$D$10,1,0),\"\")))","v":""},""]
[null,null,null,{"$f":"IF($B21=\"\",\"\",IF(GoalEntryData!$C$6=\"<=\",IF($B21<=GoalEntryData!$D$6,1,0),IF(GoalEntryData!$C$6=\">=\",IF($B21>=GoalEntryData!$D$6,1,0),\"\")))","v":""},"",{"$f":"IF($B21=\"\",\"\",IF(GoalEntryData!$C$7=\"<=\",IF($B21<=GoalEntryData!$D$7,1,0),IF(GoalEntryData!$C$7=\">=\",IF($B21>=GoalEntryData!$D$7,1,0),\"\")))","v":""},"",{"$f":"IF($B21=\"\",\"\",IF(GoalEntryData!$C$8=\"<=\",IF($B21<=GoalEntryData!$D$8,1,0),IF(GoalEntryData!$C$8=\">=\",IF($B21>=GoalEntryData!$D$8,1,0),\"\")))","v":""},"",{"$f":"IF($B21=\"\",\"\",IF(GoalEntryData!$C$6=\"<=\",IF($B21<=GoalEntryData!$D$6,1,0),IF(GoalEntryData!$C$6=\">=\",IF($B21>=GoalEntryData!$D$6,1,0),\"\")))","v":""},"",null,null,null,{"$f":"IF($M21=\"\",\"\",IF(GoalEntryData!$C$10=\"<=\",IF($M21<=GoalEntryData!$D$10,1,0),IF(GoalEntryData!$C$10=\">=\",IF($M21>=GoalEntryData!$D$10,1,0),\"\")))","v":""},"",{"$f":"IF($M21=\"\",\"\",IF(GoalEntryData!$C$11=\"<=\",IF($M21<=GoalEntryData!$D$11,1,0),IF(GoalEntryData!$C$11=\">=\",IF($M21>=GoalEntryData!$D$11,1,0),\"\")))","v":""},"",{"$f":"IF($M21=\"\",\"\",IF(GoalEntryData!$C$12=\"<=\",IF($M21<=GoalEntryData!$D$12,1,0),IF(GoalEntryData!$C$10=\">=\",IF($M21>=GoalEntryData!$D$12,1,0),\"\")))","v":""},"",{"$f":"IF($M21=\"\",\"\",IF(GoalEntryData!$C$10=\"<=\",IF($M21<=GoalEntryData!$D$10,1,0),IF(GoalEntryData!$C$10=\">=\",IF($M21>=GoalEntryData!$D$10,1,0),\"\")))","v":""},""]
[null,null,null,{"$f":"IF($B22=\"\",\"\",IF(GoalEntryData!$C$6=\"<=\",IF($B22<=GoalEntryData!$D$6,1,0),IF(GoalEntryData!$C$6=\">=\",IF($B22>=GoalEntryData!$D$6,1,0),\"\")))","v":""},"",{"$f":"IF($B22=\"\",\"\",IF(GoalEntryData!$C$7=\"<=\",IF($B22<=GoalEntryData!$D$7,1,0),IF(GoalEntryData!$C$7=\">=\",IF($B22>=GoalEntryData!$D$7,1,0),\"\")))","v":""},"",{"$f":"IF($B22=\"\",\"\",IF(GoalEntryData!$C$8=\"<=\",IF($B22<=GoalEntryData!$D$8,1,0),IF(GoalEntryData!$C$8=\">=\",IF($B22>=GoalEntryData!$D$8,1,0),\"\")))","v":""},"",{"$f":"IF($B22=\"\",\"\",IF(GoalEntryData!$C$6=\"<=\",IF($B22<=GoalEntryData!$D$6,1,0),IF(GoalEntryData!$C$6=\">=\",IF($B22>=GoalEntryData!$D$6,1,0),\"\")))","v":""},"",null,null,null,{"$f":"IF($M22=\"\",\"\",IF(GoalEntryData!$C$10=\"<=\",IF($M22<=GoalEntryData!$D$10,1,0),IF(GoalEntryData!$C$10=\">=\",IF($M22>=GoalEntryData!$D$10,1,0),\"\")))","v":""},"",{"$f":"IF($M22=\"\",\"\",IF(GoalEntryData!$C$11=\"<=\",IF($M22<=GoalEntryData!$D$11,1,0),IF(GoalEntryData!$C$11=\">=\",IF($M22>=GoalEntryData!$D$11,1,0),\"\")))","v":""},"",{"$f":"IF($M22=\"\",\"\",IF(GoalEntryData!$C$12=\"<=\",IF($M22<=GoalEntryData!$D$12,1,0),IF(GoalEntryData!$C$10=\">=\",IF($M22>=GoalEntryData!$D$12,1,0),\"\")))","v":""},"",{"$f":"IF($M22=\"\",\"\",IF(GoalEntryData!$C$10=\"<=\",IF($M22<=GoalEntryData!$D$10,1,0),IF(GoalEntryData!$C$10=\">=\",IF($M22>=GoalEntryData!$D$10,1,0),\"\")))","v":""},""]
[null,null,null,{"$f":"IF($B23=\"\",\"\",IF(GoalEntryData!$C$6=\"<=\",IF($B23<=GoalEntryData!$D$6,1,0),IF(GoalEntryData!$C$6=\">=\",IF($B23>=GoalEntryData!$D$6,1,0),\"\")))","v":""},"",{"$f":"IF($B23=\"\",\"\",IF(GoalEntryData!$C$7=\"<=\",IF($B23<=GoalEntryData!$D$7,1,0),IF(GoalEntryData!$C$7=\">=\",IF($B23>=GoalEntryData!$D$7,1,0),\"\")))","v":""},"",{"$f":"IF($B23=\"\",\"\",IF(GoalEntryData!$C$8=\"<=\",IF($B23<=GoalEntryData!$D$8,1,0),IF(GoalEntryData!$C$8=\">=\",IF($B23>=GoalEntryData!$D$8,1,0),\"\")))","v":""},"",{"$f":"IF($B23=\"\",\"\",IF(GoalEntryData!$C$6=\"<=\",IF($B23<=GoalEntryData!$D$6,1,0),IF(GoalEntryData!$C$6=\">=\",IF($B23>=GoalEntryData!$D$6,1,0),\"\")))","v":""},"",null,null,null,{"$f":"IF($M23=\"\",\"\",IF(GoalEntryData!$C$10=\"<=\",IF($M23<=GoalEntryData!$D$10,1,0),IF(GoalEntryData!$C$10=\">=\",IF($M23>=GoalEntryData!$D$10,1,0),\"\")))","v":""},"",{"$f":"IF($M23=\"\",\"\",IF(GoalEntryData!$C$11=\"<=\",IF($M23<=GoalEntryData!$D$11,1,0),IF(GoalEntryData!$C$11=\">=\",IF($M23>=GoalEntryData!$D$11,1,0),\"\")))","v":""},"",{"$f":"IF($M23=\"\",\"\",IF(GoalEntryData!$C$12=\"<=\",IF($M23<=GoalEntryData!$D$12,1,0),IF(GoalEntryData!$C$10=\">=\",IF($M23>=GoalEntryData!$D$12,1,0),\"\")))","v":""},"",{"$f":"IF($M23=\"\",\"\",IF(GoalEntryData!$C$10=\"<=\",IF($M23<=GoalEntryData!$D$10,1,0),IF(GoalEntryData!$C$10=\">=\",IF($M23>=GoalEntryData!$D$10,1,0),\"\")))","v":""},""]
[null,null,null,{"$f":"IF($B24=\"\",\"\",IF(GoalEntryData!$C$6=\"<=\",IF($B24<=GoalEntryData!$D$6,1,0),IF(GoalEntryData!$C$6=\">=\",IF($B24>=GoalEntryData!$D$6,1,0),\"\")))","v":""},"",{"$f":"IF($B24=\"\",\"\",IF(GoalEntryData!$C$7=\"<=\",IF($B24<=GoalEntryData!$D$7,1,0),IF(GoalEntryData!$C$7=\">=\",IF($B24>=GoalEntryData!$D$7,1,0),\"\")))","v":""},"",{"$f":"IF($B24=\"\",\"\",IF(GoalEntryData!$C$8=\"<=\",IF($B24<=GoalEntryData!$D$8,1,0),IF(GoalEntryData!$C$8=\">=\",IF($B24>=GoalEntryData!$D$8,1,0),\"\")))","v":""},"",{"$f":"IF($B24=\"\",\"\",IF(GoalEntryData!$C$6=\"<=\",IF($B24<=GoalEntryData!$D$6,1,0),IF(GoalEntryData!$C$6=\">=\",IF($B24>=GoalEntryData!$D$6,1,0),\"\")))","v":""},"",null,null,null,{"$f":"IF($M24=\"\",\"\",IF(GoalEntryData!$C$10=\"<=\",IF($M24<=GoalEntryData!$D$10,1,0),IF(GoalEntryData!$C$10=\">=\",IF($M24>=GoalEntryData!$D$10,1,0),\"\")))","v":""},"",{"$f":"IF($M24=\"\",\"\",IF(GoalEntryData!$C$11=\"<=\",IF($M24<=GoalEntryData!$D$11,1,0),IF(GoalEntryData!$C$11=\">=\",IF($M24>=GoalEntryData!$D$11,1,0),\"\")))","v":""},"",{"$f":"IF($M24=\"\",\"\",IF(GoalEntryData!$C$12=\"<=\",IF($M24<=GoalEntryData!$D$12,1,0),IF(GoalEntryData!$C$10=\">=\",IF($M24>=GoalEntryData!$D$12,1,0),\"\")))","v":""},"",{"$f":"IF($M24=\"\",\"\",IF(GoalEntryData!$C$10=\"<=\",IF($M24<=GoalEntryData!$D$10,1,0),IF(GoalEntryData!$C$10=\">=\",IF($M24>=GoalEntryData!$D$10,1,0),\"\")))","v":""},""]
[null,null,null,{"$f":"IF($B25=\"\",\"\",IF(GoalEntryData!$C$6=\"<=\",IF($B25<=GoalEntryData!$D$6,1,0),IF(GoalEntryData!$C$6=\">=\",IF($B25>=GoalEntryData!$D$6,1,0),\"\")))","v":""},"",{"$f":"IF($B25=\"\",\"\",IF(GoalEntryData!$C$7=\"<=\",IF($B25<=GoalEntryData!$D$7,1,0),IF(GoalEntryData!$C$7=\">=\",IF($B25>=GoalEntryData!$D$7,1,0),\"\")))","v":""},"",{"$f":"IF($B25=\"\",\"\",IF(GoalEntryData!$C$8=\"<=\",IF($B25<=GoalEntryData!$D$8,1,0),IF(GoalEntryData!$C$8=\">=\",IF($B25>=GoalEntryData!$D$8,1,0),\"\")))","v":""},"",{"$f":"IF($B25=\"\",\"\",IF(GoalEntryData!$C$6=\"<=\",IF($B25<=GoalEntryData!$D$6,1,0),IF(GoalEntryData!$C$6=\">=\",IF($B25>=GoalEntryData!$D$6,1,0),\"\")))","v":""},"",null,null,null,{"$f":"IF($M25=\"\",\"\",IF(GoalEntryData!$C$10=\"<=\",IF($M25<=GoalEntryData!$D$10,1,0),IF(GoalEntryData!$C$10=\">=\",IF($M25>=GoalEntryData!$D$10,1,0),\"\")))","v":""},"",{"$f":"IF($M25=\"\",\"\",IF(GoalEntryData!$C$11=\"<=\",IF($M25<=GoalEntryData!$D$11,1,0),IF(GoalEntryData!$C$11=\">=\",IF($M25>=GoalEntryData!$D$11,1,0),\"\")))","v":""},"",{"$f":"IF($M25=\"\",\"\",IF(GoalEntryData!$C$12=\"<=\",IF($M25<=GoalEntryData!$D$12,1,0),IF(GoalEntryData!$C$10=\">=\",IF($M25>=GoalEntryData!$D$12,1,0),\"\")))","v":""},"",{"$f":"IF($M25=\"\",\"\",IF(GoalEntryData!$C$10=\"<=\",IF($M25<=GoalEntryData!$D$10,1,0),IF(GoalEntryData!$C$10=\">=\",IF($M25>=GoalEntryData!$D$10,1,0),\"\")))","v":""},""]
[null,null,null,{"$f":"IF($B26=\"\",\"\",IF(GoalEntryData!$C$6=\"<=\",IF($B26<=GoalEntryData!$D$6,1,0),IF(GoalEntryData!$C$6=\">=\",IF($B26>=GoalEntryData!$D$6,1,0),\"\")))","v":""},"",{"$f":"IF($B26=\"\",\"\",IF(GoalEntryData!$C$7=\"<=\",IF($B26<=GoalEntryData!$D$7,1,0),IF(GoalEntryData!$C$7=\">=\",IF($B26>=GoalEntryData!$D$7,1,0),\"\")))","v":""},"",{"$f":"IF($B26=\"\",\"\",IF(GoalEntryData!$C$8=\"<=\",IF($B26<=GoalEntryData!$D$8,1,0),IF(GoalEntryData!$C$8=\">=\",IF($B26>=GoalEntryData!$D$8,1,0),\"\")))","v":""},"",{"$f":"IF($B26=\"\",\"\",IF(GoalEntryData!$C$6=\"<=\",IF($B26<=GoalEntryData!$D$6,1,0),IF(GoalEntryData!$C$6=\">=\",IF($B26>=GoalEntryData!$D$6,1,0),\"\")))","v":""},"",null,null,null,{"$f":"IF($M26=\"\",\"\",IF(GoalEntryData!$C$10=\"<=\",IF($M26<=GoalEntryData!$D$10,1,0),IF(GoalEntryData!$C$10=\">=\",IF($M26>=GoalEntryData!$D$10,1,0),\"\")))","v":""},"",{"$f":"IF($M26=\"\",\"\",IF(GoalEntryData!$C$11=\"<=\",IF($M26<=GoalEntryData!$D$11,1,0),IF(GoalEntryData!$C$11=\">=\",IF($M26>=GoalEntryData!$D$11,1,0),\"\")))","v":""},"",{"$f":"IF($M26=\"\",\"\",IF(GoalEntryData!$C$12=\"<=\",IF($M26<=GoalEntryData!$D$12,1,0),IF(GoalEntryData!$C$10=\">=\",IF($M26>=GoalEntryData!$D$12,1,0),\"\")))","v":""},"",{"$f":"IF($M26=\"\",\"\",IF(GoalEntryData!$C$10=\"<=\",IF($M26<=GoalEntryData!$D$10,1,0),IF(GoalEntryData!$C$10=\">=\",IF($M26>=GoalEntryData!$D$10,1,0),\"\")))","v":""},""]
[null,null,null,{"$f":"IF($B27=\"\",\"\",IF(GoalEntryData!$C$6=\"<=\",IF($B27<=GoalEntryData!$D$6,1,0),IF(GoalEntryData!$C$6=\">=\",IF($B27>=GoalEntryData!$D$6,1,0),\"\")))","v":""},"",{"$f":"IF($B27=\"\",\"\",IF(GoalEntryData!$C$7=\"<=\",IF($B27<=GoalEntryData!$D$7,1,0),IF(GoalEntryData!$C$7=\">=\",IF($B27>=GoalEntryData!$D$7,1,0),\"\")))","v":""},"",{"$f":"IF($B27=\"\",\"\",IF(GoalEntryData!$C$8=\"<=\",IF($B27<=GoalEntryData!$D$8,1,0),IF(GoalEntryData!$C$8=\">=\",IF($B27>=GoalEntryData!$D$8,1,0),\"\")))","v":""},"",{"$f":"IF($B27=\"\",\"\",IF(GoalEntryData!$C$6=\"<=\",IF($B27<=GoalEntryData!$D$6,1,0),IF(GoalEntryData!$C$6=\">=\",IF($B27>=GoalEntryData!$D$6,1,0),\"\")))","v":""},"",null,null,null,{"$f":"IF($M27=\"\",\"\",IF(GoalEntryData!$C$10=\"<=\",IF($M27<=GoalEntryData!$D$10,1,0),IF(GoalEntryData!$C$10=\">=\",IF($M27>=GoalEntryData!$D$10,1,0),\"\")))","v":""},"",{"$f":"IF($M27=\"\",\"\",IF(GoalEntryData!$C$11=\"<=\",IF($M27<=GoalEntryData!$D$11,1,0),IF(GoalEntryData!$C$11=\">=\",IF($M27>=GoalEntryData!$D$11,1,0),\"\")))","v":""},"",{"$f":"IF($M27=\"\",\"\",IF(GoalEntryData!$C$12=\"<=\",IF($M27<=GoalEntryData!$D$12,1,0),IF(GoalEntryData!$C$10=\">=\",IF($M27>=GoalEntryData!$D$12,1,0),\"\")))","v":""},"",{"$f":"IF($M27=\"\",\"\",IF(GoalEntryData!$C$10=\"<=\",IF($M27<=GoalEntryData!$D$10,1,0),IF(GoalEntryData!$C$10=\">=\",IF($M27>=GoalEntryData!$D$10,1,0),\"\")))","v":""},""]
[null,null,null,{"$f":"IF($B28=\"\",\"\",IF(GoalEntryData!$C$6=\"<=\",IF($B28<=GoalEntryData!$D$6,1,0),IF(GoalEntryData!$C$6=\">=\",IF($B28>=GoalEntryData!$D$6,1,0),\"\")))","v":""},"",{"$f":"IF($B28=\"\",\"\",IF(GoalEntryData!$C$7=\"<=\",IF($B28<=GoalEntryData!$D$7,1,0),IF(GoalEntryData!$C$7=\">=\",IF($B28>=GoalEntryData!$D$7,1,0),\"\")))","v":""},"",{"$f":"IF($B28=\"\",\"\",IF(GoalEntryData!$C$8=\"<=\",IF($B28<=GoalEntryData!$D$8,1,0),IF(GoalEntryData!$C$8=\">=\",IF($B28>=GoalEntryData!$D$8,1,0),\"\")))","v":""},"",{"$f":"IF($B28=\"\",\"\",IF(GoalEntryData!$C$6=\"<=\",IF($B28<=GoalEntryData!$D$6,1,0),IF(GoalEntryData!$C$6=\">=\",IF($B28>=GoalEntryData!$D$6,1,0),\"\")))","v":""},"",null,null,null,{"$f":"IF($M28=\"\",\"\",IF(GoalEntryData!$C$10=\"<=\",IF($M28<=GoalEntryData!$D$10,1,0),IF(GoalEntryData!$C$10=\">=\",IF($M28>=GoalEntryData!$D$10,1,0),\"\")))","v":""},"",{"$f":"IF($M28=\"\",\"\",IF(GoalEntryData!$C$11=\"<=\",IF($M28<=GoalEntryData!$D$11,1,0),IF(GoalEntryData!$C$11=\">=\",IF($M28>=GoalEntryData!$D$11,1,0),\"\")))","v":""},"",{"$f":"IF($M28=\"\",\"\",IF(GoalEntryData!$C$12=\"<=\",IF($M28<=GoalEntryData!$D$12,1,0),IF(GoalEntryData!$C$10=\">=\",IF($M28>=GoalEntryData!$D$12,1,0),\"\")))","v":""},"",{"$f":"IF($M28=\"\",\"\",IF(GoalEntryData!$C$10=\"<=\",IF($M28<=GoalEntryData!$D$10,1,0),IF(GoalEntryData!$C$10=\">=\",IF($M28>=GoalEntryData!$D$10,1,0),\"\")))","v":""},""]
[null,null,null,{"$f":"IF($B29=\"\",\"\",IF(GoalEntryData!$C$6=\"<=\",IF($B29<=GoalEntryData!$D$6,1,0),IF(GoalEntryData!$C$6=\">=\",IF($B29>=GoalEntryData!$D$6,1,0),\"\")))","v":""},"",{"$f":"IF($B29=\"\",\"\",IF(GoalEntryData!$C$7=\"<=\",IF($B29<=GoalEntryData!$D$7,1,0),IF(GoalEntryData!$C$7=\">=\",IF($B29>=GoalEntryData!$D$7,1,0),\"\")))","v":""},"",{"$f":"IF($B29=\"\",\"\",IF(GoalEntryData!$C$8=\"<=\",IF($B29<=GoalEntryData!$D$8,1,0),IF(GoalEntryData!$C$8=\">=\",IF($B29>=GoalEntryData!$D$8,1,0),\"\")))","v":""},"",{"$f":"IF($B29=\"\",\"\",IF(GoalEntryData!$C$6=\"<=\",IF($B29<=GoalEntryData!$D$6,1,0),IF(GoalEntryData!$C$6=\">=\",IF($B29>=GoalEntryData!$D$6,1,0),\"\")))","v":""},"",null,null,null,{"$f":"IF($M29=\"\",\"\",IF(GoalEntryData!$C$10=\"<=\",IF($M29<=GoalEntryData!$D$10,1,0),IF(GoalEntryData!$C$10=\">=\",IF($M29>=GoalEntryData!$D$10,1,0),\"\")))","v":""},"",{"$f":"IF($M29=\"\",\"\",IF(GoalEntryData!$C$11=\"<=\",IF($M29<=GoalEntryData!$D$11,1,0),IF(GoalEntryData!$C$11=\">=\",IF($M29>=GoalEntryData!$D$11,1,0),\"\")))","v":""},"",{"$f":"IF($M29=\"\",\"\",IF(GoalEntryData!$C$12=\"<=\",IF($M29<=GoalEntryData!$D$12,1,0),IF(GoalEntryData!$C$10=\">=\",IF($M29>=GoalEntryData!$D$12,1,0),\"\")))","v":""},"",{"$f":"IF($M29=\"\",\"\",IF(GoalEntryData!$C$10=\"<=\",IF($M29<=GoalEntryData!$D$10,1,0),IF(GoalEntryData!$C$10=\">=\",IF($M29>=GoalEntryData!$D$10,1,0),\"\")))","v":""},""]
[null,null,null,{"$f":"IF($B30=\"\",\"\",IF(GoalEntryData!$C$6=\"<=\",IF($B30<=GoalEntryData!$D$6,1,0),IF(GoalEntryData!$C$6=\">=\",IF($B30>=GoalEntryData!$D$6,1,0),\"\")))","v":""},"",{"$f":"IF($B30=\"\",\"\",IF(GoalEntryData!$C$7=\"<=\",IF($B30<=GoalEntryData!$D$7,1,0),IF(GoalEntryData!$C$7=\">=\",IF($B30>=GoalEntryData!$D$7,1,0),\"\")))","v":""},"",{"$f":"IF($B30=\"\",\"\",IF(GoalEntryData!$C$8=\"<=\",IF($B30<=GoalEntryData!$D$8,1,0),IF(GoalEntryData!$C$8=\">=\",IF($B30>=GoalEntryData!$D$8,1,0),\"\")))","v":""},"",{"$f":"IF($B30=\"\",\"\",IF(GoalEntryData!$C$6=\"<=\",IF($B30<=GoalEntryData!$D$6,1,0),IF(GoalEntryData!$C$6=\">=\",IF($B30>=GoalEntryData!$D$6,1,0),\"\")))","v":""},"",null,null,null,{"$f":"IF($M30=\"\",\"\",IF(GoalEntryData!$C$10=\"<=\",IF($M30<=GoalEntryData!$D$10,1,0),IF(GoalEntryData!$C$10=\">=\",IF($M30>=GoalEntryData!$D$10,1,0),\"\")))","v":""},"",{"$f":"IF($M30=\"\",\"\",IF(GoalEntryData!$C$11=\"<=\",IF($M30<=GoalEntryData!$D$11,1,0),IF(GoalEntryData!$C$11=\">=\",IF($M30>=GoalEntryData!$D$11,1,0),\"\")))","v":""},"",{"$f":"IF($M30=\"\",\"\",IF(GoalEntryData!$C$12=\"<=\",IF($M30<=GoalEntryData!$D$12,1,0),IF(GoalEntryData!$C$10=\">=\",IF($M30>=GoalEntryData!$D$12,1,0),\"\")))","v":""},"",{"$f":"IF($M30=\"\",\"\",IF(GoalEntryData!$C$10=\"<=\",IF($M30<=GoalEntryData!$D$10,1,0),IF(GoalEntryData!$C$10=\">=\",IF($M30>=GoalEntryData!$D$10,1,0),\"\")))","v":""},""]
[null,null,null,{"$f":"IF($B31=\"\",\"\",IF(GoalEntryData!$C$6=\"<=\",IF($B31<=GoalEntryData!$D$6,1,0),IF(GoalEntryData!$C$6=\">=\",IF($B31>=GoalEntryData!$D$6,1,0),\"\")))","v":""},"",{"$f":"IF($B31=\"\",\"\",IF(GoalEntryData!$C$7=\"<=\",IF($B31<=GoalEntryData!$D$7,1,0),IF(GoalEntryData!$C$7=\">=\",IF($B31>=GoalEntryData!$D$7,1,0),\"\")))","v":""},"",{"$f":"IF($B31=\"\",\"\",IF(GoalEntryData!$C$8=\"<=\",IF($B31<=GoalEntryData!$D$8,1,0),IF(GoalEntryData!$C$8=\">=\",IF($B31>=GoalEntryData!$D$8,1,0),\"\")))","v":""},"",{"$f":"IF($B31=\"\",\"\",IF(GoalEntryData!$C$6=\"<=\",IF($B31<=GoalEntryData!$D$6,1,0),IF(GoalEntryData!$C$6=\">=\",IF($B31>=GoalEntryData!$D$6,1,0),\"\")))","v":""},"",null,null,null,{"$f":"IF($M31=\"\",\"\",IF(GoalEntryData!$C$10=\"<=\",IF($M31<=GoalEntryData!$D$10,1,0),IF(GoalEntryData!$C$10=\">=\",IF($M31>=GoalEntryData!$D$10,1,0),\"\")))","v":""},"",{"$f":"IF($M31=\"\",\"\",IF(GoalEntryData!$C$11=\"<=\",IF($M31<=GoalEntryData!$D$11,1,0),IF(GoalEntryData!$C$11=\">=\",IF($M31>=GoalEntryData!$D$11,1,0),\"\")))","v":""},"",{"$f":"IF($M31=\"\",\"\",IF(GoalEntryData!$C$12=\"<=\",IF($M31<=GoalEntryData!$D$12,1,0),IF(GoalEntryData!$C$10=\">=\",IF($M31>=GoalEntryData!$D$12,1,0),\"\")))","v":""},"",{"$f":"IF($M31=\"\",\"\",IF(GoalEntryData!$C$10=\"<=\",IF($M31<=GoalEntryData!$D$10,1,0),IF(GoalEntryData!$C$10=\">=\",IF($M31>=GoalEntryData!$D$10,1,0),\"\")))","v":""},""]
[null,null,null,{"$f":"IF($B32=\"\",\"\",IF(GoalEntryData!$C$6=\"<=\",IF($B32<=GoalEntryData!$D$6,1,0),IF(GoalEntryData!$C$6=\">=\",IF($B32>=GoalEntryData!$D$6,1,0),\"\")))","v":""},"",{"$f":"IF($B32=\"\",\"\",IF(GoalEntryData!$C$7=\"<=\",IF($B32<=GoalEntryData!$D$7,1,0),IF(GoalEntryData!$C$7=\">=\",IF($B32>=GoalEntryData!$D$7,1,0),\"\")))","v":""},"",{"$f":"IF($B32=\"\",\"\",IF(GoalEntryData!$C$8=\"<=\",IF($B32<=GoalEntryData!$D$8,1,0),IF(GoalEntryData!$C$8=\">=\",IF($B32>=GoalEntryData!$D$8,1,0),\"\")))","v":""},"",{"$f":"IF($B32=\"\",\"\",IF(GoalEntryData!$C$6=\"<=\",IF($B32<=GoalEntryData!$D$6,1,0),IF(GoalEntryData!$C$6=\">=\",IF($B32>=GoalEntryData!$D$6,1,0),\"\")))","v":""},"",null,null,null,{"$f":"IF($M32=\"\",\"\",IF(GoalEntryData!$C$10=\"<=\",IF($M32<=GoalEntryData!$D$10,1,0),IF(GoalEntryData!$C$10=\">=\",IF($M32>=GoalEntryData!$D$10,1,0),\"\")))","v":""},"",{"$f":"IF($M32=\"\",\"\",IF(GoalEntryData!$C$11=\"<=\",IF($M32<=GoalEntryData!$D$11,1,0),IF(GoalEntryData!$C$11=\">=\",IF($M32>=GoalEntryData!$D$11,1,0),\"\")))","v":""},"",{"$f":"IF($M32=\"\",\"\",IF(GoalEntryData!$C$12=\"<=\",IF($M32<=GoalEntryData!$D$12,1,0),IF(GoalEntryData!$C$10=\">=\",IF($M32>=GoalEntryData!$D$12,1,0),\"\")))","v":""},"",{"$f":"IF($M32=\"\",\"\",IF(GoalEntryData!$C$10=\"<=\",IF($M32<=GoalEntryData!$D$10,1,0),IF(GoalEntryData!$C$10=\">=\",IF($M32>=GoalEntryData!$D$10,1,0),\"\")))","v":""},""]
[null,null,null,{"$f":"IF($B33=\"\",\"\",IF(GoalEntryData!$C$6=\"<=\",IF($B33<=GoalEntryData!$D$6,1,0),IF(GoalEntryData!$C$6=\">=\",IF($B33>=GoalEntryData!$D$6,1,0),\"\")))","v":""},"",{"$f":"IF($B33=\"\",\"\",IF(GoalEntryData!$C$7=\"<=\",IF($B33<=GoalEntryData!$D$7,1,0),IF(GoalEntryData!$C$7=\">=\",IF($B33>=GoalEntryData!$D$7,1,0),\"\")))","v":""},"",{"$f":"IF($B33=\"\",\"\",IF(GoalEntryData!$C$8=\"<=\",IF($B33<=GoalEntryData!$D$8,1,0),IF(GoalEntryData!$C$8=\">=\",IF($B33>=GoalEntryData!$D$8,1,0),\"\")))","v":""},"",{"$f":"IF($B33=\"\",\"\",IF(GoalEntryData!$C$6=\"<=\",IF($B33<=GoalEntryData!$D$6,1,0),IF(GoalEntryData!$C$6=\">=\",IF($B33>=GoalEntryData!$D$6,1,0),\"\")))","v":""},"",null,null,null,{"$f":"IF($M33=\"\",\"\",IF(GoalEntryData!$C$10=\"<=\",IF($M33<=GoalEntryData!$D$10,1,0),IF(GoalEntryData!$C$10=\">=\",IF($M33>=GoalEntryData!$D$10,1,0),\"\")))","v":""},"",{"$f":"IF($M33=\"\",\"\",IF(GoalEntryData!$C$11=\"<=\",IF($M33<=GoalEntryData!$D$11,1,0),IF(GoalEntryData!$C$11=\">=\",IF($M33>=GoalEntryData!$D$11,1,0),\"\")))","v":""},"",{"$f":"IF($M33=\"\",\"\",IF(GoalEntryData!$C$12=\"<=\",IF($M33<=GoalEntryData!$D$12,1,0),IF(GoalEntryData!$C$10=\">=\",IF($M33>=GoalEntryData!$D$12,1,0),\"\")))","v":""},"",{"$f":"IF($M33=\"\",\"\",IF(GoalEntryData!$C$10=\"<=\",IF($M33<=GoalEntryData!$D$10,1,0),IF(GoalEntryData!$C$10=\">=\",IF($M33>=GoalEntryData!$D$10,1,0),\"\")))","v":""},""]
[null,null,null,{"$f":"IF($B34=\"\",\"\",IF(GoalEntryData!$C$6=\"<=\",IF($B34<=GoalEntryData!$D$6,1,0),IF(GoalEntryData!$C$6=\">=\",IF($B34>=GoalEntryData!$D$6,1,0),\"\")))","v":""},"",{"$f":"IF($B34=\"\",\"\",IF(GoalEntryData!$C$7=\"<=\",IF($B34<=GoalEntryData!$D$7,1,0),IF(GoalEntryData!$C$7=\">=\",IF($B34>=GoalEntryData!$D$7,1,0),\"\")))","v":""},"",{"$f":"IF($B34=\"\",\"\",IF(GoalEntryData!$C$8=\"<=\",IF($B34<=GoalEntryData!$D$8,1,0),IF(GoalEntryData!$C$8=\">=\",IF($B34>=GoalEntryData!$D$8,1,0),\"\")))","v":""},"",{"$f":"IF($B34=\"\",\"\",IF(GoalEntryData!$C$6=\"<=\",IF($B34<=GoalEntryData!$D$6,1,0),IF(GoalEntryData!$C$6=\">=\",IF($B34>=GoalEntryData!$D$6,1,0),\"\")))","v":""},"",null,null,null,{"$f":"IF($M34=\"\",\"\",IF(GoalEntryData!$C$10=\"<=\",IF($M34<=GoalEntryData!$D$10,1,0),IF(GoalEntryData!$C$10=\">=\",IF($M34>=GoalEntryData!$D$10,1,0),\"\")))","v":""},"",{"$f":"IF($M34=\"\",\"\",IF(GoalEntryData!$C$11=\"<=\",IF($M34<=GoalEntryData!$D$11,1,0),IF(GoalEntryData!$C$11=\">=\",IF($M34>=GoalEntryData!$D$11,1,0),\"\")))","v":""},"",{"$f":"IF($M34=\"\",\"\",IF(GoalEntryData!$C$12=\"<=\",IF($M34<=GoalEntryData!$D$12,1,0),IF(GoalEntryData!$C$10=\">=\",IF($M34>=GoalEntryData!$D$12,1,0),\"\")))","v":""},"",{"$f":"IF($M34=\"\",\"\",IF(GoalEntryData!$C$10=\"<=\",IF($M34<=GoalEntryData!$D$10,1,0),IF(GoalEntryData!$C$10=\">=\",IF($M34>=GoalEntryData!$D$10,1,0),\"\")))","v":""},""]
[null,null,null,{"$f":"IF($B35=\"\",\"\",IF(GoalEntryData!$C$6=\"<=\",IF($B35<=GoalEntryData!$D$6,1,0),IF(GoalEntryData!$C$6=\">=\",IF($B35>=GoalEntryData!$D$6,1,0),\"\")))","v":""},"",{"$f":"IF($B35=\"\",\"\",IF(GoalEntryData!$C$7=\"<=\",IF($B35<=GoalEntryData!$D$7,1,0),IF(GoalEntryData!$C$7=\">=\",IF($B35>=GoalEntryData!$D$7,1,0),\"\")))","v":""},"",{"$f":"IF($B35=\"\",\"\",IF(GoalEntryData!$C$8=\"<=\",IF($B35<=GoalEntryData!$D$8,1,0),IF(GoalEntryData!$C$8=\">=\",IF($B35>=GoalEntryData!$D$8,1,0),\"\")))","v":""},"",{"$f":"IF($B35=\"\",\"\",IF(GoalEntryData!$C$6=\"<=\",IF($B35<=GoalEntryData!$D$6,1,0),IF(GoalEntryData!$C$6=\">=\",IF($B35>=GoalEntryData!$D$6,1,0),\"\")))","v":""},"",null,null,null,{"$f":"IF($M35=\"\",\"\",IF(GoalEntryData!$C$10=\"<=\",IF($M35<=GoalEntryData!$D$10,1,0),IF(GoalEntryData!$C$10=\">=\",IF($M35>=GoalEntryData!$D$10,1,0),\"\")))","v":""},"",{"$f":"IF($M35=\"\",\"\",IF(GoalEntryData!$C$11=\"<=\",IF($M35<=GoalEntryData!$D$11,1,0),IF(GoalEntryData!$C$11=\">=\",IF($M35>=GoalEntryData!$D$11,1,0),\"\")))","v":""},"",{"$f":"IF($M35=\"\",\"\",IF(GoalEntryData!$C$12=\"<=\",IF($M35<=GoalEntryData!$D$12,1,0),IF(GoalEntryData!$C$10=\">=\",IF($M35>=GoalEntryData!$D$12,1,0),\"\")))","v":""},"",{"$f":"IF($M35=\"\",\"\",IF(GoalEntryData!$C$10=\"<=\",IF($M35<=GoalEntryData!$D$10,1,0),IF(GoalEntryData!$C$10=\">=\",IF($M35>=GoalEntryData!$D$10,1,0),\"\")))","v":""},""]
[null,null,null,{"$f":"IF($B36=\"\",\"\",IF(GoalEntryData!$C$6=\"<=\",IF($B36<=GoalEntryData!$D$6,1,0),IF(GoalEntryData!$C$6=\">=\",IF($B36>=GoalEntryData!$D$6,1,0),\"\")))","v":""},"",{"$f":"IF($B36=\"\",\"\",IF(GoalEntryData!$C$7=\"<=\",IF($B36<=GoalEntryData!$D$7,1,0),IF(GoalEntryData!$C$7=\">=\",IF($B36>=GoalEntryData!$D$7,1,0),\"\")))","v":""},"",{"$f":"IF($B36=\"\",\"\",IF(GoalEntryData!$C$8=\"<=\",IF($B36<=GoalEntryData!$D$8,1,0),IF(GoalEntryData!$C$8=\">=\",IF($B36>=GoalEntryData!$D$8,1,0),\"\")))","v":""},"",{"$f":"IF($B36=\"\",\"\",IF(GoalEntryData!$C$6=\"<=\",IF($B36<=GoalEntryData!$D$6,1,0),IF(GoalEntryData!$C$6=\">=\",IF($B36>=GoalEntryData!$D$6,1,0),\"\")))","v":""},"",null,null,null,{"$f":"IF($M36=\"\",\"\",IF(GoalEntryData!$C$10=\"<=\",IF($M36<=GoalEntryData!$D$10,1,0),IF(GoalEntryData!$C$10=\">=\",IF($M36>=GoalEntryData!$D$10,1,0),\"\")))","v":""},"",{"$f":"IF($M36=\"\",\"\",IF(GoalEntryData!$C$11=\"<=\",IF($M36<=GoalEntryData!$D$11,1,0),IF(GoalEntryData!$C$11=\">=\",IF($M36>=GoalEntryData!$D$11,1,0),\"\")))","v":""},"",{"$f":"IF($M36=\"\",\"\",IF(GoalEntryData!$C$12=\"<=\",IF($M36<=GoalEntryData!$D$12,1,0),IF(GoalEntryData!$C$10=\">=\",IF($M36>=GoalEntryData!$D$12,1,0),\"\")))","v":""},"",{"$f":"IF($M36=\"\",\"\",IF(GoalEntryData!$C$10=\"<=\",IF($M36<=GoalEntryData!$D$10,1,0),IF(GoalEntryData!$C$10=\">=\",IF($M36>=GoalEntryData!$D$10,1,0),\"\")))","v":""},""]
[null,null,null,{"$f":"IF($B37=\"\",\"\",IF(GoalEntryData!$C$6=\"<=\",IF($B37<=GoalEntryData!$D$6,1,0),IF(GoalEntryData!$C$6=\">=\",IF($B37>=GoalEntryData!$D$6,1,0),\"\")))","v":""},"",{"$f":"IF($B37=\"\",\"\",IF(GoalEntryData!$C$7=\"<=\",IF($B37<=GoalEntryData!$D$7,1,0),IF(GoalEntryData!$C$7=\">=\",IF($B37>=GoalEntryData!$D$7,1,0),\"\")))","v":""},"",{"$f":"IF($B37=\"\",\"\",IF(GoalEntryData!$C$8=\"<=\",IF($B37<=GoalEntryData!$D$8,1,0),IF(GoalEntryData!$C$8=\">=\",IF($B37>=GoalEntryData!$D$8,1,0),\"\")))","v":""},"",{"$f":"IF($B37=\"\",\"\",IF(GoalEntryData!$C$6=\"<=\",IF($B37<=GoalEntryData!$D$6,1,0),IF(GoalEntryData!$C$6=\">=\",IF($B37>=GoalEntryData!$D$6,1,0),\"\")))","v":""},"",null,null,null,{"$f":"IF($M37=\"\",\"\",IF(GoalEntryData!$C$10=\"<=\",IF($M37<=GoalEntryData!$D$10,1,0),IF(GoalEntryData!$C$10=\">=\",IF($M37>=GoalEntryData!$D$10,1,0),\"\")))","v":""},"",{"$f":"IF($M37=\"\",\"\",IF(GoalEntryData!$C$11=\"<=\",IF($M37<=GoalEntryData!$D$11,1,0),IF(GoalEntryData!$C$11=\">=\",IF($M37>=GoalEntryData!$D$11,1,0),\"\")))","v":""},"",{"$f":"IF($M37=\"\",\"\",IF(GoalEntryData!$C$12=\"<=\",IF($M37<=GoalEntryData!$D$12,1,0),IF(GoalEntryData!$C$10=\">=\",IF($M37>=GoalEntryData!$D$12,1,0),\"\")))","v":""},"",{"$f":"IF($M37=\"\",\"\",IF(GoalEntryData!$C$10=\"<=\",IF($M37<=GoalEntryData!$D$10,1,0),IF(GoalEntryData!$C$10=\">=\",IF($M37>=GoalEntryData!$D$10,1,0),\"\")))","v":""},""]
[null,null,null,{"$f":"IF($B38=\"\",\"\",IF(GoalEntryData!$C$6=\"<=\",IF($B38<=GoalEntryData!$D$6,1,0),IF(GoalEntryData!$C$6=\">=\",IF($B38>=GoalEntryData!$D$6,1,0),\"\")))","v":""},"",{"$f":"IF($B38=\"\",\"\",IF(GoalEntryData!$C$7=\"<=\",IF($B38<=GoalEntryData!$D$7,1,0),IF(GoalEntryData!$C$7=\">=\",IF($B38>=GoalEntryData!$D$7,1,0),\"\")))","v":""},"",{"$f":"IF($B38=\"\",\"\",IF(GoalEntryData!$C$8=\"<=\",IF($B38<=GoalEntryData!$D$8,1,0),IF(GoalEntryData!$C$8=\">=\",IF($B38>=GoalEntryData!$D$8,1,0),\"\")))","v":""},"",{"$f":"IF($B38=\"\",\"\",IF(GoalEntryData!$C$6=\"<=\",IF($B38<=GoalEntryData!$D$6,1,0),IF(GoalEntryData!$C$6=\">=\",IF($B38>=GoalEntryData!$D$6,1,0),\"\")))","v":""},"",null,null,null,{"$f":"IF($M38=\"\",\"\",IF(GoalEntryData!$C$10=\"<=\",IF($M38<=GoalEntryData!$D$10,1,0),IF(GoalEntryData!$C$10=\">=\",IF($M38>=GoalEntryData!$D$10,1,0),\"\")))","v":""},"",{"$f":"IF($M38=\"\",\"\",IF(GoalEntryData!$C$11=\"<=\",IF($M38<=GoalEntryData!$D$11,1,0),IF(GoalEntryData!$C$11=\">=\",IF($M38>=GoalEntryData!$D$11,1,0),\"\")))","v":""},"",{"$f":"IF($M38=\"\",\"\",IF(GoalEntryData!$C$12=\"<=\",IF($M38<=GoalEntryData!$D$12,1,0),IF(GoalEntryData!$C$10=\">=\",IF($M38>=GoalEntryData!$D$12,1,0),\"\")))","v":""},"",{"$f":"IF($M38=\"\",\"\",IF(GoalEntryData!$C$10=\"<=\",IF($M38<=GoalEntryData!$D$10,1,0),IF(GoalEntryData!$C$10=\">=\",IF($M38>=GoalEntryData!$D$10,1,0),\"\")))","v":""},""]
[null,null,null,{"$f":"IF($B39=\"\",\"\",IF(GoalEntryData!$C$6=\"<=\",IF($B39<=GoalEntryData!$D$6,1,0),IF(GoalEntryData!$C$6=\">=\",IF($B39>=GoalEntryData!$D$6,1,0),\"\")))","v":""},"",{"$f":"IF($B39=\"\",\"\",IF(GoalEntryData!$C$7=\"<=\",IF($B39<=GoalEntryData!$D$7,1,0),IF(GoalEntryData!$C$7=\">=\",IF($B39>=GoalEntryData!$D$7,1,0),\"\")))","v":""},"",{"$f":"IF($B39=\"\",\"\",IF(GoalEntryData!$C$8=\"<=\",IF($B39<=GoalEntryData!$D$8,1,0),IF(GoalEntryData!$C$8=\">=\",IF($B39>=GoalEntryData!$D$8,1,0),\"\")))","v":""},"",{"$f":"IF($B39=\"\",\"\",IF(GoalEntryData!$C$6=\"<=\",IF($B39<=GoalEntryData!$D$6,1,0),IF(GoalEntryData!$C$6=\">=\",IF($B39>=GoalEntryData!$D$6,1,0),\"\")))","v":""},"",null,null,null,{"$f":"IF($M39=\"\",\"\",IF(GoalEntryData!$C$10=\"<=\",IF($M39<=GoalEntryData!$D$10,1,0),IF(GoalEntryData!$C$10=\">=\",IF($M39>=GoalEntryData!$D$10,1,0),\"\")))","v":""},"",{"$f":"IF($M39=\"\",\"\",IF(GoalEntryData!$C$11=\"<=\",IF($M39<=GoalEntryData!$D$11,1,0),IF(GoalEntryData!$C$11=\">=\",IF($M39>=GoalEntryData!$D$11,1,0),\"\")))","v":""},"",{"$f":"IF($M39=\"\",\"\",IF(GoalEntryData!$C$12=\"<=\",IF($M39<=GoalEntryData!$D$12,1,0),IF(GoalEntryData!$C$10=\">=\",IF($M39>=GoalEntryData!$D$12,1,0),\"\")))","v":""},"",{"$f":"IF($M39=\"\",\"\",IF(GoalEntryData!$C$10=\"<=\",IF($M39<=GoalEntryData!$D$10,1,0),IF(GoalEntryData!$C$10=\">=\",IF($M39>=GoalEntryData!$D$10,1,0),\"\")))","v":""},""]
[null,null,null,{"$f":"IF($B40=\"\",\"\",IF(GoalEntryData!$C$6=\"<=\",IF($B40<=GoalEntryData!$D$6,1,0),IF(GoalEntryData!$C$6=\">=\",IF($B40>=GoalEntryData!$D$6,1,0),\"\")))","v":""},"",{"$f":"IF($B40=\"\",\"\",IF(GoalEntryData!$C$7=\"<=\",IF($B40<=GoalEntryData!$D$7,1,0),IF(GoalEntryData!$C$7=\">=\",IF($B40>=GoalEntryData!$D$7,1,0),\"\")))","v":""},"",{"$f":"IF($B40=\"\",\"\",IF(GoalEntryData!$C$8=\"<=\",IF($B40<=GoalEntryData!$D$8,1,0),IF(GoalEntryData!$C$8=\">=\",IF($B40>=GoalEntryData!$D$8,1,0),\"\")))","v":""},"",{"$f":"IF($B40=\"\",\"\",IF(GoalEntryData!$C$6=\"<=\",IF($B40<=GoalEntryData!$D$6,1,0),IF(GoalEntryData!$C$6=\">=\",IF($B40>=GoalEntryData!$D$6,1,0),\"\")))","v":""},"",null,null,null,{"$f":"IF($M40=\"\",\"\",IF(GoalEntryData!$C$10=\"<=\",IF($M40<=GoalEntryData!$D$10,1,0),IF(GoalEntryData!$C$10=\">=\",IF($M40>=GoalEntryData!$D$10,1,0),\"\")))","v":""},"",{"$f":"IF($M40=\"\",\"\",IF(GoalEntryData!$C$11=\"<=\",IF($M40<=GoalEntryData!$D$11,1,0),IF(GoalEntryData!$C$11=\">=\",IF($M40>=GoalEntryData!$D$11,1,0),\"\")))","v":""},"",{"$f":"IF($M40=\"\",\"\",IF(GoalEntryData!$C$12=\"<=\",IF($M40<=GoalEntryData!$D$12,1,0),IF(GoalEntryData!$C$10=\">=\",IF($M40>=GoalEntryData!$D$12,1,0),\"\")))","v":""},"",{"$f":"IF($M40=\"\",\"\",IF(GoalEntryData!$C$10=\"<=\",IF($M40<=GoalEntryData!$D$10,1,0),IF(GoalEntryData!$C$10=\">=\",IF($M40>=GoalEntryData!$D$10,1,0),\"\")))","v":""},""]
[null,null,null,{"$f":"IF($B41=\"\",\"\",IF(GoalEntryData!$C$6=\"<=\",IF($B41<=GoalEntryData!$D$6,1,0),IF(GoalEntryData!$C$6=\">=\",IF($B41>=GoalEntryData!$D$6,1,0),\"\")))","v":""},"",{"$f":"IF($B41=\"\",\"\",IF(GoalEntryData!$C$7=\"<=\",IF($B41<=GoalEntryData!$D$7,1,0),IF(GoalEntryData!$C$7=\">=\",IF($B41>=GoalEntryData!$D$7,1,0),\"\")))","v":""},"",{"$f":"IF($B41=\"\",\"\",IF(GoalEntryData!$C$8=\"<=\",IF($B41<=GoalEntryData!$D$8,1,0),IF(GoalEntryData!$C$8=\">=\",IF($B41>=GoalEntryData!$D$8,1,0),\"\")))","v":""},"",{"$f":"IF($B41=\"\",\"\",IF(GoalEntryData!$C$6=\"<=\",IF($B41<=GoalEntryData!$D$6,1,0),IF(GoalEntryData!$C$6=\">=\",IF($B41>=GoalEntryData!$D$6,1,0),\"\")))","v":""},"",null,null,null,{"$f":"IF($M41=\"\",\"\",IF(GoalEntryData!$C$10=\"<=\",IF($M41<=GoalEntryData!$D$10,1,0),IF(GoalEntryData!$C$10=\">=\",IF($M41>=GoalEntryData!$D$10,1,0),\"\")))","v":""},"",{"$f":"IF($M41=\"\",\"\",IF(GoalEntryData!$C$11=\"<=\",IF($M41<=GoalEntryData!$D$11,1,0),IF(GoalEntryData!$C$11=\">=\",IF($M41>=GoalEntryData!$D$11,1,0),\"\")))","v":""},"",{"$f":"IF($M41=\"\",\"\",IF(GoalEntryData!$C$12=\"<=\",IF($M41<=GoalEntryData!$D$12,1,0),IF(GoalEntryData!$C$10=\">=\",IF($M41>=GoalEntryData!$D$12,1,0),\"\")))","v":""},"",{"$f":"IF($M41=\"\",\"\",IF(GoalEntryData!$C$10=\"<=\",IF($M41<=GoalEntryData!$D$10,1,0),IF(GoalEntryData!$C$10=\">=\",IF($M41>=GoalEntryData!$D$10,1,0),\"\")))","v":""},""]
[null,null,null,{"$f":"IF($B42=\"\",\"\",IF(GoalEntryData!$C$6=\"<=\",IF($B42<=GoalEntryData!$D$6,1,0),IF(GoalEntryData!$C$6=\">=\",IF($B42>=GoalEntryData!$D$6,1,0),\"\")))","v":""},"",{"$f":"IF($B42=\"\",\"\",IF(GoalEntryData!$C$7=\"<=\",IF($B42<=GoalEntryData!$D$7,1,0),IF(GoalEntryData!$C$7=\">=\",IF($B42>=GoalEntryData!$D$7,1,0),\"\")))","v":""},"",{"$f":"IF($B42=\"\",\"\",IF(GoalEntryData!$C$8=\"<=\",IF($B42<=GoalEntryData!$D$8,1,0),IF(GoalEntryData!$C$8=\">=\",IF($B42>=GoalEntryData!$D$8,1,0),\"\")))","v":""},"",{"$f":"IF($B42=\"\",\"\",IF(GoalEntryData!$C$6=\"<=\",IF($B42<=GoalEntryData!$D$6,1,0),IF(GoalEntryData!$C$6=\">=\",IF($B42>=GoalEntryData!$D$6,1,0),\"\")))","v":""},"",null,null,null,{"$f":"IF($M42=\"\",\"\",IF(GoalEntryData!$C$10=\"<=\",IF($M42<=GoalEntryData!$D$10,1,0),IF(GoalEntryData!$C$10=\">=\",IF($M42>=GoalEntryData!$D$10,1,0),\"\")))","v":""},"",{"$f":"IF($M42=\"\",\"\",IF(GoalEntryData!$C$11=\"<=\",IF($M42<=GoalEntryData!$D$11,1,0),IF(GoalEntryData!$C$11=\">=\",IF($M42>=GoalEntryData!$D$11,1,0),\"\")))","v":""},"",{"$f":"IF($M42=\"\",\"\",IF(GoalEntryData!$C$12=\"<=\",IF($M42<=GoalEntryData!$D$12,1,0),IF(GoalEntryData!$C$10=\">=\",IF($M42>=GoalEntryData!$D$12,1,0),\"\")))","v":""},"",{"$f":"IF($M42=\"\",\"\",IF(GoalEntryData!$C$10=\"<=\",IF($M42<=GoalEntryData!$D$10,1,0),IF(GoalEntryData!$C$10=\">=\",IF($M42>=GoalEntryData!$D$10,1,0),\"\")))","v":""},""]
[null,null,null,{"$f":"IF($B43=\"\",\"\",IF(GoalEntryData!$C$6=\"<=\",IF($B43<=GoalEntryData!$D$6,1,0),IF(GoalEntryData!$C$6=\">=\",IF($B43>=GoalEntryData!$D$6,1,0),\"\")))","v":""},"",{"$f":"IF($B43=\"\",\"\",IF(GoalEntryData!$C$7=\"<=\",IF($B43<=GoalEntryData!$D$7,1,0),IF(GoalEntryData!$C$7=\">=\",IF($B43>=GoalEntryData!$D$7,1,0),\"\")))","v":""},"",{"$f":"IF($B43=\"\",\"\",IF(GoalEntryData!$C$8=\"<=\",IF($B43<=GoalEntryData!$D$8,1,0),IF(GoalEntryData!$C$8=\">=\",IF($B43>=GoalEntryData!$D$8,1,0),\"\")))","v":""},"",{"$f":"IF($B43=\"\",\"\",IF(GoalEntryData!$C$6=\"<=\",IF($B43<=GoalEntryData!$D$6,1,0),IF(GoalEntryData!$C$6=\">=\",IF($B43>=GoalEntryData!$D$6,1,0),\"\")))","v":""},"",null,null,null,{"$f":"IF($M43=\"\",\"\",IF(GoalEntryData!$C$10=\"<=\",IF($M43<=GoalEntryData!$D$10,1,0),IF(GoalEntryData!$C$10=\">=\",IF($M43>=GoalEntryData!$D$10,1,0),\"\")))","v":""},"",{"$f":"IF($M43=\"\",\"\",IF(GoalEntryData!$C$11=\"<=\",IF($M43<=GoalEntryData!$D$11,1,0),IF(GoalEntryData!$C$11=\">=\",IF($M43>=GoalEntryData!$D$11,1,0),\"\")))","v":""},"",{"$f":"IF($M43=\"\",\"\",IF(GoalEntryData!$C$12=\"<=\",IF($M43<=GoalEntryData!$D$12,1,0),IF(GoalEntryData!$C$10=\">=\",IF($M43>=GoalEntryData!$D$12,1,0),\"\")))","v":""},"",{"$f":"IF($M43=\"\",\"\",IF(GoalEntryData!$C$10=\"<=\",IF($M43<=GoalEntryData!$D$10,1,0),IF(GoalEntryData!$C$10=\">=\",IF($M43>=GoalEntryData!$D$10,1,0),\"\")))","v":""},""]
[null,null,null,{"$f":"IF($B44=\"\",\"\",IF(GoalEntryData!$C$6=\"<=\",IF($B44<=GoalEntryData!$D$6,1,0),IF(GoalEntryData!$C$6=\">=\",IF($B44>=GoalEntryData!$D$6,1,0),\"\")))","v":""},"",{"$f":"IF($B44=\"\",\"\",IF(GoalEntryData!$C$7=\"<=\",IF($B44<=GoalEntryData!$D$7,1,0),IF(GoalEntryData!$C$7=\">=\",IF($B44>=GoalEntryData!$D$7,1,0),\"\")))","v":""},"",{"$f":"IF($B44=\"\",\"\",IF(GoalEntryData!$C$8=\"<=\",IF($B44<=GoalEntryData!$D$8,1,0),IF(GoalEntryData!$C$8=\">=\",IF($B44>=GoalEntryData!$D$8,1,0),\"\")))","v":""},"",{"$f":"IF($B44=\"\",\"\",IF(GoalEntryData!$C$6=\"<=\",IF($B44<=GoalEntryData!$D$6,1,0),IF(GoalEntryData!$C$6=\">=\",IF($B44>=GoalEntryData!$D$6,1,0),\"\")))","v":""},"",null,null,null,{"$f":"IF($M44=\"\",\"\",IF(GoalEntryData!$C$10=\"<=\",IF($M44<=GoalEntryData!$D$10,1,0),IF(GoalEntryData!$C$10=\">=\",IF($M44>=GoalEntryData!$D$10,1,0),\"\")))","v":""},"",{"$f":"IF($M44=\"\",\"\",IF(GoalEntryData!$C$11=\"<=\",IF($M44<=GoalEntryData!$D$11,1,0),IF(GoalEntryData!$C$11=\">=\",IF($M44>=GoalEntryData!$D$11,1,0),\"\")))","v":""},"",{"$f":"IF($M44=\"\",\"\",IF(GoalEntryData!$C$12=\"<=\",IF($M44<=GoalEntryData!$D$12,1,0),IF(GoalEntryData!$C$10=\">=\",IF($M44>=GoalEntryData!$D$12,1,0),\"\")))","v":""},"",{"$f":"IF($M44=\"\",\"\",IF(GoalEntryData!$C$10=\"<=\",IF($M44<=GoalEntryData!$D$10,1,0),IF(GoalEntryData!$C$10=\">=\",IF($M44>=GoalEntryData!$D$10,1,0),\"\")))","v":""},""]
[null,null,null,{"$f":"IF($B45=\"\",\"\",IF(GoalEntryData!$C$6=\"<=\",IF($B45<=GoalEntryData!$D$6,1,0),IF(GoalEntryData!$C$6=\">=\",IF($B45>=GoalEntryData!$D$6,1,0),\"\")))","v":""},"",{"$f":"IF($B45=\"\",\"\",IF(GoalEntryData!$C$7=\"<=\",IF($B45<=GoalEntryData!$D$7,1,0),IF(GoalEntryData!$C$7=\">=\",IF($B45>=GoalEntryData!$D$7,1,0),\"\")))","v":""},"",{"$f":"IF($B45=\"\",\"\",IF(GoalEntryData!$C$8=\"<=\",IF($B45<=GoalEntryData!$D$8,1,0),IF(GoalEntryData!$C$8=\">=\",IF($B45>=GoalEntryData!$D$8,1,0),\"\")))","v":""},"",{"$f":"IF($B45=\"\",\"\",IF(GoalEntryData!$C$6=\"<=\",IF($B45<=GoalEntryData!$D$6,1,0),IF(GoalEntryData!$C$6=\">=\",IF($B45>=GoalEntryData!$D$6,1,0),\"\")))","v":""},"",null,null,null,{"$f":"IF($M45=\"\",\"\",IF(GoalEntryData!$C$10=\"<=\",IF($M45<=GoalEntryData!$D$10,1,0),IF(GoalEntryData!$C$10=\">=\",IF($M45>=GoalEntryData!$D$10,1,0),\"\")))","v":""},"",{"$f":"IF($M45=\"\",\"\",IF(GoalEntryData!$C$11=\"<=\",IF($M45<=GoalEntryData!$D$11,1,0),IF(GoalEntryData!$C$11=\">=\",IF($M45>=GoalEntryData!$D$11,1,0),\"\")))","v":""},"",{"$f":"IF($M45=\"\",\"\",IF(GoalEntryData!$C$12=\"<=\",IF($M45<=GoalEntryData!$D$12,1,0),IF(GoalEntryData!$C$10=\">=\",IF($M45>=GoalEntryData!$D$12,1,0),\"\")))","v":""},"",{"$f":"IF($M45=\"\",\"\",IF(GoalEntryData!$C$10=\"<=\",IF($M45<=GoalEntryData!$D$10,1,0),IF(GoalEntryData!$C$10=\">=\",IF($M45>=GoalEntryData!$D$10,1,0),\"\")))","v":""},""]
[null,null,null,{"$f":"IF($B46=\"\",\"\",IF(GoalEntryData!$C$6=\"<=\",IF($B46<=GoalEntryData!$D$6,1,0),IF(GoalEntryData!$C$6=\">=\",IF($B46>=GoalEntryData!$D$6,1,0),\"\")))","v":""},"",{"$f":"IF($B46=\"\",\"\",IF(GoalEntryData!$C$7=\"<=\",IF($B46<=GoalEntryData!$D$7,1,0),IF(GoalEntryData!$C$7=\">=\",IF($B46>=GoalEntryData!$D$7,1,0),\"\")))","v":""},"",{"$f":"IF($B46=\"\",\"\",IF(GoalEntryData!$C$8=\"<=\",IF($B46<=GoalEntryData!$D$8,1,0),IF(GoalEntryData!$C$8=\">=\",IF($B46>=GoalEntryData!$D$8,1,0),\"\")))","v":""},"",{"$f":"IF($B46=\"\",\"\",IF(GoalEntryData!$C$6=\"<=\",IF($B46<=GoalEntryData!$D$6,1,0),IF(GoalEntryData!$C$6=\">=\",IF($B46>=GoalEntryData!$D$6,1,0),\"\")))","v":""},"",null,null,null,{"$f":"IF($M46=\"\",\"\",IF(GoalEntryData!$C$10=\"<=\",IF($M46<=GoalEntryData!$D$10,1,0),IF(GoalEntryData!$C$10=\">=\",IF($M46>=GoalEntryData!$D$10,1,0),\"\")))","v":""},"",{"$f":"IF($M46=\"\",\"\",IF(GoalEntryData!$C$11=\"<=\",IF($M46<=GoalEntryData!$D$11,1,0),IF(GoalEntryData!$C$11=\">=\",IF($M46>=GoalEntryData!$D$11,1,0),\"\")))","v":""},"",{"$f":"IF($M46=\"\",\"\",IF(GoalEntryData!$C$12=\"<=\",IF($M46<=GoalEntryData!$D$12,1,0),IF(GoalEntryData!$C$10=\">=\",IF($M46>=GoalEntryData!$D$12,1,0),\"\")))","v":""},"",{"$f":"IF($M46=\"\",\"\",IF(GoalEntryData!$C$10=\"<=\",IF($M46<=GoalEntryData!$D$10,1,0),IF(GoalEntryData!$C$10=\">=\",IF($M46>=GoalEntryData!$D$10,1,0),\"\")))","v":""},""]
[null,null,null,{"$f":"IF($B47=\"\",\"\",IF(GoalEntryData!$C$6=\"<=\",IF($B47<=GoalEntryData!$D$6,1,0),IF(GoalEntryData!$C$6=\">=\",IF($B47>=GoalEntryData!$D$6,1,0),\"\")))","v":""},"",{"$f":"IF($B47=\"\",\"\",IF(GoalEntryData!$C$7=\"<=\",IF($B47<=GoalEntryData!$D$7,1,0),IF(GoalEntryData!$C$7=\">=\",IF($B47>=GoalEntryData!$D$7,1,0),\"\")))","v":""},"",{"$f":"IF($B47=\"\",\"\",IF(GoalEntryData!$C$8=\"<=\",IF($B47<=GoalEntryData!$D$8,1,0),IF(GoalEntryData!$C$8=\">=\",IF($B47>=GoalEntryData!$D$8,1,0),\"\")))","v":""},"",{"$f":"IF($B47=\"\",\"\",IF(GoalEntryData!$C$6=\"<=\",IF($B47<=GoalEntryData!$D$6,1,0),IF(GoalEntryData!$C$6=\">=\",IF($B47>=GoalEntryData!$D$6,1,0),\"\")))","v":""},"",null,null,null,{"$f":"IF($M47=\"\",\"\",IF(GoalEntryData!$C$10=\"<=\",IF($M47<=GoalEntryData!$D$10,1,0),IF(GoalEntryData!$C$10=\">=\",IF($M47>=GoalEntryData!$D$10,1,0),\"\")))","v":""},"",{"$f":"IF($M47=\"\",\"\",IF(GoalEntryData!$C$11=\"<=\",IF($M47<=GoalEntryData!$D$11,1,0),IF(GoalEntryData!$C$11=\">=\",IF($M47>=GoalEntryData!$D$11,1,0),\"\")))","v":""},"",{"$f":"IF($M47=\"\",\"\",IF(GoalEntryData!$C$12=\"<=\",IF($M47<=GoalEntryData!$D$12,1,0),IF(GoalEntryData!$C$10=\">=\",IF($M47>=GoalEntryData!$D$12,1,0),\"\")))","v":""},"",{"$f":"IF($M47=\"\",\"\",IF(GoalEntryData!$C$10=\"<=\",IF($M47<=GoalEntryData!$D$10,1,0),IF(GoalEntryData!$C$10=\">=\",IF($M47>=GoalEntryData!$D$10,1,0),\"\")))","v":""},""]
[null,null,null,{"$f":"IF($B48=\"\",\"\",IF(GoalEntryData!$C$6=\"<=\",IF($B48<=GoalEntryData!$D$6,1,0),IF(GoalEntryData!$C$6=\">=\",IF($B48>=GoalEntryData!$D$6,1,0),\"\")))","v":""},"",{"$f":"IF($B48=\"\",\"\",IF(GoalEntryData!$C$7=\"<=\",IF($B48<=GoalEntryData!$D$7,1,0),IF(GoalEntryData!$C$7=\">=\",IF($B48>=GoalEntryData!$D$7,1,0),\"\")))","v":""},"",{"$f":"IF($B48=\"\",\"\",IF(GoalEntryData!$C$8=\"<=\",IF($B48<=GoalEntryData!$D$8,1,0),IF(GoalEntryData!$C$8=\">=\",IF($B48>=GoalEntryData!$D$8,1,0),\"\")))","v":""},"",{"$f":"IF($B48=\"\",\"\",IF(GoalEntryData!$C$6=\"<=\",IF($B48<=GoalEntryData!$D$6,1,0),IF(GoalEntryData!$C$6=\">=\",IF($B48>=GoalEntryData!$D$6,1,0),\"\")))","v":""},"",null,null,null,{"$f":"IF($M48=\"\",\"\",IF(GoalEntryData!$C$10=\"<=\",IF($M48<=GoalEntryData!$D$10,1,0),IF(GoalEntryData!$C$10=\">=\",IF($M48>=GoalEntryData!$D$10,1,0),\"\")))","v":""},"",{"$f":"IF($M48=\"\",\"\",IF(GoalEntryData!$C$11=\"<=\",IF($M48<=GoalEntryData!$D$11,1,0),IF(GoalEntryData!$C$11=\">=\",IF($M48>=GoalEntryData!$D$11,1,0),\"\")))","v":""},"",{"$f":"IF($M48=\"\",\"\",IF(GoalEntryData!$C$12=\"<=\",IF($M48<=GoalEntryData!$D$12,1,0),IF(GoalEntryData!$C$10=\">=\",IF($M48>=GoalEntryData!$D$12,1,0),\"\")))","v":""},"",{"$f":"IF($M48=\"\",\"\",IF(GoalEntryData!$C$10=\"<=\",IF($M48<=GoalEntryData!$D$10,1,0),IF(GoalEntryData!$C$10=\">=\",IF($M48>=GoalEntryData!$D$10,1,0),\"\")))","v":""},""]
[null,null,null,{"$f":"IF($B49=\"\",\"\",IF(GoalEntryData!$C$6=\"<=\",IF($B49<=GoalEntryData!$D$6,1,0),IF(GoalEntryData!$C$6=\">=\",IF($B49>=GoalEntryData!$D$6,1,0),\"\")))","v":""},"",{"$f":"IF($B49=\"\",\"\",IF(GoalEntryData!$C$7=\"<=\",IF($B49<=GoalEntryData!$D$7,1,0),IF(GoalEntryData!$C$7=\">=\",IF($B49>=GoalEntryData!$D$7,1,0),\"\")))","v":""},"",{"$f":"IF($B49=\"\",\"\",IF(GoalEntryData!$C$8=\"<=\",IF($B49<=GoalEntryData!$D$8,1,0),IF(GoalEntryData!$C$8=\">=\",IF($B49>=GoalEntryData!$D$8,1,0),\"\")))","v":""},"",{"$f":"IF($B49=\"\",\"\",IF(GoalEntryData!$C$6=\"<=\",IF($B49<=GoalEntryData!$D$6,1,0),IF(GoalEntryData!$C$6=\">=\",IF($B49>=GoalEntryData!$D$6,1,0),\"\")))","v":""},"",null,null,null,{"$f":"IF($M49=\"\",\"\",IF(GoalEntryData!$C$10=\"<=\",IF($M49<=GoalEntryData!$D$10,1,0),IF(GoalEntryData!$C$10=\">=\",IF($M49>=GoalEntryData!$D$10,1,0),\"\")))","v":""},"",{"$f":"IF($M49=\"\",\"\",IF(GoalEntryData!$C$11=\"<=\",IF($M49<=GoalEntryData!$D$11,1,0),IF(GoalEntryData!$C$11=\">=\",IF($M49>=GoalEntryData!$D$11,1,0),\"\")))","v":""},"",{"$f":"IF($M49=\"\",\"\",IF(GoalEntryData!$C$12=\"<=\",IF($M49<=GoalEntryData!$D$12,1,0),IF(GoalEntryData!$C$10=\">=\",IF($M49>=GoalEntryData!$D$12,1,0),\"\")))","v":""},"",{"$f":"IF($M49=\"\",\"\",IF(GoalEntryData!$C$10=\"<=\",IF($M49<=GoalEntryData!$D$10,1,0),IF(GoalEntryData!$C$10=\">=\",IF($M49>=GoalEntryData!$D$10,1,0),\"\")))","v":""},""]
[null,null,null,{"$f":"IF($B50=\"\",\"\",IF(GoalEntryData!$C$6=\"<=\",IF($B50<=GoalEntryData!$D$6,1,0),IF(GoalEntryData!$C$6=\">=\",IF($B50>=GoalEntryData!$D$6,1,0),\"\")))","v":""},"",{"$f":"IF($B50=\"\",\"\",IF(GoalEntryData!$C$7=\"<=\",IF($B50<=GoalEntryData!$D$7,1,0),IF(GoalEntryData!$C$7=\">=\",IF($B50>=GoalEntryData!$D$7,1,0),\"\")))","v":""},"",{"$f":"IF($B50=\"\",\"\",IF(GoalEntryData!$C$8=\"<=\",IF($B50<=GoalEntryData!$D$8,1,0),IF(GoalEntryData!$C$8=\">=\",IF($B50>=GoalEntryData!$D$8,1,0),\"\")))","v":""},"",{"$f":"IF($B50=\"\",\"\",IF(GoalEntryData!$C$6=\"<=\",IF($B50<=GoalEntryData!$D$6,1,0),IF(GoalEntryData!$C$6=\">=\",IF($B50>=GoalEntryData!$D$6,1,0),\"\")))","v":""},"",null,null,null,{"$f":"IF($M50=\"\",\"\",IF(GoalEntryData!$C$10=\"<=\",IF($M50<=GoalEntryData!$D$10,1,0),IF(GoalEntryData!$C$10=\">=\",IF($M50>=GoalEntryData!$D$10,1,0),\"\")))","v":""},"",{"$f":"IF($M50=\"\",\"\",IF(GoalEntryData!$C$11=\"<=\",IF($M50<=GoalEntryData!$D$11,1,0),IF(GoalEntryData!$C$11=\">=\",IF($M50>=GoalEntryData!$D$11,1,0),\"\")))","v":""},"",{"$f":"IF($M50=\"\",\"\",IF(GoalEntryData!$C$12=\"<=\",IF($M50<=GoalEntryData!$D$12,1,0),IF(GoalEntryData!$C$10=\">=\",IF($M50>=GoalEntryData!$D$12,1,0),\"\")))","v":""},"",{"$f":"IF($M50=\"\",\"\",IF(GoalEntryData!$C$10=\"<=\",IF($M50<=GoalEntryData!$D$10,1,0),IF(GoalEntryData!$C$10=\">=\",IF($M50>=GoalEntryData!$D$10,1,0),\"\")))","v":""},""]
[null,null,null,{"$f":"IF($B51=\"\",\"\",IF(GoalEntryData!$C$6=\"<=\",IF($B51<=GoalEntryData!$D$6,1,0),IF(GoalEntryData!$C$6=\">=\",IF($B51>=GoalEntryData!$D$6,1,0),\"\")))","v":""},"",{"$f":"IF($B51=\"\",\"\",IF(GoalEntryData!$C$7=\"<=\",IF($B51<=GoalEntryData!$D$7,1,0),IF(GoalEntryData!$C$7=\">=\",IF($B51>=GoalEntryData!$D$7,1,0),\"\")))","v":""},"",{"$f":"IF($B51=\"\",\"\",IF(GoalEntryData!$C$8=\"<=\",IF($B51<=GoalEntryData!$D$8,1,0),IF(GoalEntryData!$C$8=\">=\",IF($B51>=GoalEntryData!$D$8,1,0),\"\")))","v":""},"",{"$f":"IF($B51=\"\",\"\",IF(GoalEntryData!$C$6=\"<=\",IF($B51<=GoalEntryData!$D$6,1,0),IF(GoalEntryData!$C$6=\">=\",IF($B51>=GoalEntryData!$D$6,1,0),\"\")))","v":""},"",null,null,null,{"$f":"IF($M51=\"\",\"\",IF(GoalEntryData!$C$10=\"<=\",IF($M51<=GoalEntryData!$D$10,1,0),IF(GoalEntryData!$C$10=\">=\",IF($M51>=GoalEntryData!$D$10,1,0),\"\")))","v":""},"",{"$f":"IF($M51=\"\",\"\",IF(GoalEntryData!$C$11=\"<=\",IF($M51<=GoalEntryData!$D$11,1,0),IF(GoalEntryData!$C$11=\">=\",IF($M51>=GoalEntryData!$D$11,1,0),\"\")))","v":""},"",{"$f":"IF($M51=\"\",\"\",IF(GoalEntryData!$C$12=\"<=\",IF($M51<=GoalEntryData!$D$12,1,0),IF(GoalEntryData!$C$10=\">=\",IF($M51>=GoalEntryData!$D$12,1,0),\"\")))","v":""},"",{"$f":"IF($M51=\"\",\"\",IF(GoalEntryData!$C$10=\"<=\",IF($M51<=GoalEntryData!$D$10,1,0),IF(GoalEntryData!$C$10=\">=\",IF($M51>=GoalEntryData!$D$10,1,0),\"\")))","v":""},""]
[null,null,null,{"$f":"IF($B52=\"\",\"\",IF(GoalEntryData!$C$6=\"<=\",IF($B52<=GoalEntryData!$D$6,1,0),IF(GoalEntryData!$C$6=\">=\",IF($B52>=GoalEntryData!$D$6,1,0),\"\")))","v":""},"",{"$f":"IF($B52=\"\",\"\",IF(GoalEntryData!$C$7=\"<=\",IF($B52<=GoalEntryData!$D$7,1,0),IF(GoalEntryData!$C$7=\">=\",IF($B52>=GoalEntryData!$D$7,1,0),\"\")))","v":""},"",{"$f":"IF($B52=\"\",\"\",IF(GoalEntryData!$C$8=\"<=\",IF($B52<=GoalEntryData!$D$8,1,0),IF(GoalEntryData!$C$8=\">=\",IF($B52>=GoalEntryData!$D$8,1,0),\"\")))","v":""},"",{"$f":"IF($B52=\"\",\"\",IF(GoalEntryData!$C$6=\"<=\",IF($B52<=GoalEntryData!$D$6,1,0),IF(GoalEntryData!$C$6=\">=\",IF($B52>=GoalEntryData!$D$6,1,0),\"\")))","v":""},"",null,null,null,{"$f":"IF($M52=\"\",\"\",IF(GoalEntryData!$C$10=\"<=\",IF($M52<=GoalEntryData!$D$10,1,0),IF(GoalEntryData!$C$10=\">=\",IF($M52>=GoalEntryData!$D$10,1,0),\"\")))","v":""},"",{"$f":"IF($M52=\"\",\"\",IF(GoalEntryData!$C$11=\"<=\",IF($M52<=GoalEntryData!$D$11,1,0),IF(GoalEntryData!$C$11=\">=\",IF($M52>=GoalEntryData!$D$11,1,0),\"\")))","v":""},"",{"$f":"IF($M52=\"\",\"\",IF(GoalEntryData!$C$12=\"<=\",IF($M52<=GoalEntryData!$D$12,1,0),IF(GoalEntryData!$C$10=\">=\",IF($M52>=GoalEntryData!$D$12,1,0),\"\")))","v":""},"",{"$f":"IF($M52=\"\",\"\",IF(GoalEntryData!$C$10=\"<=\",IF($M52<=GoalEntryData!$D$10,1,0),IF(GoalEntryData!$C$10=\">=\",IF($M52>=GoalEntryData!$D$10,1,0),\"\")))","v":""},""]
[null,null,null,{"$f":"IF($B53=\"\",\"\",IF(GoalEntryData!$C$6=\"<=\",IF($B53<=GoalEntryData!$D$6,1,0),IF(GoalEntryData!$C$6=\">=\",IF($B53>=GoalEntryData!$D$6,1,0),\"\")))","v":""},"",{"$f":"IF($B53=\"\",\"\",IF(GoalEntryData!$C$7=\"<=\",IF($B53<=GoalEntryData!$D$7,1,0),IF(GoalEntryData!$C$7=\">=\",IF($B53>=GoalEntryData!$D$7,1,0),\"\")))","v":""},"",{"$f":"IF($B53=\"\",\"\",IF(GoalEntryData!$C$8=\"<=\",IF($B53<=GoalEntryData!$D$8,1,0),IF(GoalEntryData!$C$8=\">=\",IF($B53>=GoalEntryData!$D$8,1,0),\"\")))","v":""},"",{"$f":"IF($B53=\"\",\"\",IF(GoalEntryData!$C$6=\"<=\",IF($B53<=GoalEntryData!$D$6,1,0),IF(GoalEntryData!$C$6=\">=\",IF($B53>=GoalEntryData!$D$6,1,0),\"\")))","v":""},"",null,null,null,{"$f":"IF($M53=\"\",\"\",IF(GoalEntryData!$C$10=\"<=\",IF($M53<=GoalEntryData!$D$10,1,0),IF(GoalEntryData!$C$10=\">=\",IF($M53>=GoalEntryData!$D$10,1,0),\"\")))","v":""},"",{"$f":"IF($M53=\"\",\"\",IF(GoalEntryData!$C$11=\"<=\",IF($M53<=GoalEntryData!$D$11,1,0),IF(GoalEntryData!$C$11=\">=\",IF($M53>=GoalEntryData!$D$11,1,0),\"\")))","v":""},"",{"$f":"IF($M53=\"\",\"\",IF(GoalEntryData!$C$12=\"<=\",IF($M53<=GoalEntryData!$D$12,1,0),IF(GoalEntryData!$C$10=\">=\",IF($M53>=GoalEntryData!$D$12,1,0),\"\")))","v":""},"",{"$f":"IF($M53=\"\",\"\",IF(GoalEntryData!$C$10=\"<=\",IF($M53<=GoalEntryData!$D$10,1,0),IF(GoalEntryData!$C$10=\">=\",IF($M53>=GoalEntryData!$D$10,1,0),\"\")))","v":""},""]
[null,null,null,{"$f":"IF($B54=\"\",\"\",IF(GoalEntryData!$C$6=\"<=\",IF($B54<=GoalEntryData!$D$6,1,0),IF(GoalEntryData!$C$6=\">=\",IF($B54>=GoalEntryData!$D$6,1,0),\"\")))","v":""},"",{"$f":"IF($B54=\"\",\"\",IF(GoalEntryData!$C$7=\"<=\",IF($B54<=GoalEntryData!$D$7,1,0),IF(GoalEntryData!$C$7=\">=\",IF($B54>=GoalEntryData!$D$7,1,0),\"\")))","v":""},"",{"$f":"IF($B54=\"\",\"\",IF(GoalEntryData!$C$8=\"<=\",IF($B54<=GoalEntryData!$D$8,1,0),IF(GoalEntryData!$C$8=\">=\",IF($B54>=GoalEntryData!$D$8,1,0),\"\")))","v":""},"",{"$f":"IF($B54=\"\",\"\",IF(GoalEntryData!$C$6=\"<=\",IF($B54<=GoalEntryData!$D$6,1,0),IF(GoalEntryData!$C$6=\">=\",IF($B54>=GoalEntryData!$D$6,1,0),\"\")))","v":""},"",null,null,null,{"$f":"IF($M54=\"\",\"\",IF(GoalEntryData!$C$10=\"<=\",IF($M54<=GoalEntryData!$D$10,1,0),IF(GoalEntryData!$C$10=\">=\",IF($M54>=GoalEntryData!$D$10,1,0),\"\")))","v":""},"",{"$f":"IF($M54=\"\",\"\",IF(GoalEntryData!$C$11=\"<=\",IF($M54<=GoalEntryData!$D$11,1,0),IF(GoalEntryData!$C$11=\">=\",IF($M54>=GoalEntryData!$D$11,1,0),\"\")))","v":""},"",{"$f":"IF($M54=\"\",\"\",IF(GoalEntryData!$C$12=\"<=\",IF($M54<=GoalEntryData!$D$12,1,0),IF(GoalEntryData!$C$10=\">=\",IF($M54>=GoalEntryData!$D$12,1,0),\"\")))","v":""},"",{"$f":"IF($M54=\"\",\"\",IF(GoalEntryData!$C$10=\"<=\",IF($M54<=GoalEntryData!$D$10,1,0),IF(GoalEntryData!$C$10=\">=\",IF($M54>=GoalEntryData!$D$10,1,0),\"\")))","v":""},""]
[null,null,null,{"$f":"IF($B55=\"\",\"\",IF(GoalEntryData!$C$6=\"<=\",IF($B55<=GoalEntryData!$D$6,1,0),IF(GoalEntryData!$C$6=\">=\",IF($B55>=GoalEntryData!$D$6,1,0),\"\")))","v":""},"",{"$f":"IF($B55=\"\",\"\",IF(GoalEntryData!$C$7=\"<=\",IF($B55<=GoalEntryData!$D$7,1,0),IF(GoalEntryData!$C$7=\">=\",IF($B55>=GoalEntryData!$D$7,1,0),\"\")))","v":""},"",{"$f":"IF($B55=\"\",\"\",IF(GoalEntryData!$C$8=\"<=\",IF($B55<=GoalEntryData!$D$8,1,0),IF(GoalEntryData!$C$8=\">=\",IF($B55>=GoalEntryData!$D$8,1,0),\"\")))","v":""},"",{"$f":"IF($B55=\"\",\"\",IF(GoalEntryData!$C$6=\"<=\",IF($B55<=GoalEntryData!$D$6,1,0),IF(GoalEntryData!$C$6=\">=\",IF($B55>=GoalEntryData!$D$6,1,0),\"\")))","v":""},"",null,null,null,{"$f":"IF($M55=\"\",\"\",IF(GoalEntryData!$C$10=\"<=\",IF($M55<=GoalEntryData!$D$10,1,0),IF(GoalEntryData!$C$10=\">=\",IF($M55>=GoalEntryData!$D$10,1,0),\"\")))","v":""},"",{"$f":"IF($M55=\"\",\"\",IF(GoalEntryData!$C$11=\"<=\",IF($M55<=GoalEntryData!$D$11,1,0),IF(GoalEntryData!$C$11=\">=\",IF($M55>=GoalEntryData!$D$11,1,0),\"\")))","v":""},"",{"$f":"IF($M55=\"\",\"\",IF(GoalEntryData!$C$12=\"<=\",IF($M55<=GoalEntryData!$D$12,1,0),IF(GoalEntryData!$C$10=\">=\",IF($M55>=GoalEntryData!$D$12,1,0),\"\")))","v":""},"",{"$f":"IF($M55=\"\",\"\",IF(GoalEntryData!$C$10=\"<=\",IF($M55<=GoalEntryData!$D$10,1,0),IF(GoalEntryData!$C$10=\">=\",IF($M55>=GoalEntryData!$D$10,1,0),\"\")))","v":""},""]
[null,null,null,{"$f":"IF($B56=\"\",\"\",IF(GoalEntryData!$C$6=\"<=\",IF($B56<=GoalEntryData!$D$6,1,0),IF(GoalEntryData!$C$6=\">=\",IF($B56>=GoalEntryData!$D$6,1,0),\"\")))","v":""},"",{"$f":"IF($B56=\"\",\"\",IF(GoalEntryData!$C$7=\"<=\",IF($B56<=GoalEntryData!$D$7,1,0),IF(GoalEntryData!$C$7=\">=\",IF($B56>=GoalEntryData!$D$7,1,0),\"\")))","v":""},"",{"$f":"IF($B56=\"\",\"\",IF(GoalEntryData!$C$8=\"<=\",IF($B56<=GoalEntryData!$D$8,1,0),IF(GoalEntryData!$C$8=\">=\",IF($B56>=GoalEntryData!$D$8,1,0),\"\")))","v":""},"",{"$f":"IF($B56=\"\",\"\",IF(GoalEntryData!$C$6=\"<=\",IF($B56<=GoalEntryData!$D$6,1,0),IF(GoalEntryData!$C$6=\">=\",IF($B56>=GoalEntryData!$D$6,1,0),\"\")))","v":""},"",null,null,null,{"$f":"IF($M56=\"\",\"\",IF(GoalEntryData!$C$10=\"<=\",IF($M56<=GoalEntryData!$D$10,1,0),IF(GoalEntryData!$C$10=\">=\",IF($M56>=GoalEntryData!$D$10,1,0),\"\")))","v":""},"",{"$f":"IF($M56=\"\",\"\",IF(GoalEntryData!$C$11=\"<=\",IF($M56<=GoalEntryData!$D$11,1,0),IF(GoalEntryData!$C$11=\">=\",IF($M56>=GoalEntryData!$D$11,1,0),\"\")))","v":""},"",{"$f":"IF($M56=\"\",\"\",IF(GoalEntryData!$C$12=\"<=\",IF($M56<=GoalEntryData!$D$12,1,0),IF(GoalEntryData!$C$10=\">=\",IF($M56>=GoalEntryData!$D$12,1,0),\"\")))","v":""},"",{"$f":"IF($M56=\"\",\"\",IF(GoalEntryData!$C$10=\"<=\",IF($M56<=GoalEntryData!$D$10,1,0),IF(GoalEntryData!$C$10=\">=\",IF($M56>=GoalEntryData!$D$10,1,0),\"\")))","v":""},""]
[null,null,null,{"$f":"IF($B57=\"\",\"\",IF(GoalEntryData!$C$6=\"<=\",IF($B57<=GoalEntryData!$D$6,1,0),IF(GoalEntryData!$C$6=\">=\",IF($B57>=GoalEntryData!$D$6,1,0),\"\")))","v":""},"",{"$f":"IF($B57=\"\",\"\",IF(GoalEntryData!$C$7=\"<=\",IF($B57<=GoalEntryData!$D$7,1,0),IF(GoalEntryData!$C$7=\">=\",IF($B57>=GoalEntryData!$D$7,1,0),\"\")))","v":""},"",{"$f":"IF($B57=\"\",\"\",IF(GoalEntryData!$C$8=\"<=\",IF($B57<=GoalEntryData!$D$8,1,0),IF(GoalEntryData!$C$8=\">=\",IF($B57>=GoalEntryData!$D$8,1,0),\"\")))","v":""},"",{"$f":"IF($B57=\"\",\"\",IF(GoalEntryData!$C$6=\"<=\",IF($B57<=GoalEntryData!$D$6,1,0),IF(GoalEntryData!$C$6=\">=\",IF($B57>=GoalEntryData!$D$6,1,0),\"\")))","v":""},"",null,null,null,{"$f":"IF($M57=\"\",\"\",IF(GoalEntryData!$C$10=\"<=\",IF($M57<=GoalEntryData!$D$10,1,0),IF(GoalEntryData!$C$10=\">=\",IF($M57>=GoalEntryData!$D$10,1,0),\"\")))","v":""},"",{"$f":"IF($M57=\"\",\"\",IF(GoalEntryData!$C$11=\"<=\",IF($M57<=GoalEntryData!$D$11,1,0),IF(GoalEntryData!$C$11=\">=\",IF($M57>=GoalEntryData!$D$11,1,0),\"\")))","v":""},"",{"$f":"IF($M57=\"\",\"\",IF(GoalEntryData!$C$12=\"<=\",IF($M57<=GoalEntryData!$D$12,1,0),IF(GoalEntryData!$C$10=\">=\",IF($M57>=GoalEntryData!$D$12,1,0),\"\")))","v":""},"",{"$f":"IF($M57=\"\",\"\",IF(GoalEntryData!$C$10=\"<=\",IF($M57<=GoalEntryData!$D$10,1,0),IF(GoalEntryData!$C$10=\">=\",IF($M57>=GoalEntryData!$D$10,1,0),\"\")))","v":""},""]
[null,null,null,{"$f":"IF($B58=\"\",\"\",IF(GoalEntryData!$C$6=\"<=\",IF($B58<=GoalEntryData!$D$6,1,0),IF(GoalEntryData!$C$6=\">=\",IF($B58>=GoalEntryData!$D$6,1,0),\"\")))","v":""},"",{"$f":"IF($B58=\"\",\"\",IF(GoalEntryData!$C$7=\"<=\",IF($B58<=GoalEntryData!$D$7,1,0),IF(GoalEntryData!$C$7=\">=\",IF($B58>=GoalEntryData!$D$7,1,0),\"\")))","v":""},"",{"$f":"IF($B58=\"\",\"\",IF(GoalEntryData!$C$8=\"<=\",IF($B58<=GoalEntryData!$D$8,1,0),IF(GoalEntryData!$C$8=\">=\",IF($B58>=GoalEntryData!$D$8,1,0),\"\")))","v":""},"",{"$f":"IF($B58=\"\",\"\",IF(GoalEntryData!$C$6=\"<=\",IF($B58<=GoalEntryData!$D$6,1,0),IF(GoalEntryData!$C$6=\">=\",IF($B58>=GoalEntryData!$D$6,1,0),\"\")))","v":""},"",null,null,null,{"$f":"IF($M58=\"\",\"\",IF(GoalEntryData!$C$10=\"<=\",IF($M58<=GoalEntryData!$D$10,1,0),IF(GoalEntryData!$C$10=\">=\",IF($M58>=GoalEntryData!$D$10,1,0),\"\")))","v":""},"",{"$f":"IF($M58=\"\",\"\",IF(GoalEntryData!$C$11=\"<=\",IF($M58<=GoalEntryData!$D$11,1,0),IF(GoalEntryData!$C$11=\">=\",IF($M58>=GoalEntryData!$D$11,1,0),\"\")))","v":""},"",{"$f":"IF($M58=\"\",\"\",IF(GoalEntryData!$C$12=\"<=\",IF($M58<=GoalEntryData!$D$12,1,0),IF(GoalEntryData!$C$10=\">=\",IF($M58>=GoalEntryData!$D$12,1,0),\"\")))","v":""},"",{"$f":"IF($M58=\"\",\"\",IF(GoalEntryData!$C$10=\"<=\",IF($M58<=GoalEntryData!$D$10,1,0),IF(GoalEntryData!$C$10=\">=\",IF($M58>=GoalEntryData!$D$10,1,0),\"\")))","v":""},""]
[null,null,null,{"$f":"IF($B59=\"\",\"\",IF(GoalEntryData!$C$6=\"<=\",IF($B59<=GoalEntryData!$D$6,1,0),IF(GoalEntryData!$C$6=\">=\",IF($B59>=GoalEntryData!$D$6,1,0),\"\")))","v":""},"",{"$f":"IF($B59=\"\",\"\",IF(GoalEntryData!$C$7=\"<=\",IF($B59<=GoalEntryData!$D$7,1,0),IF(GoalEntryData!$C$7=\">=\",IF($B59>=GoalEntryData!$D$7,1,0),\"\")))","v":""},"",{"$f":"IF($B59=\"\",\"\",IF(GoalEntryData!$C$8=\"<=\",IF($B59<=GoalEntryData!$D$8,1,0),IF(GoalEntryData!$C$8=\">=\",IF($B59>=GoalEntryData!$D$8,1,0),\"\")))","v":""},"",{"$f":"IF($B59=\"\",\"\",IF(GoalEntryData!$C$6=\"<=\",IF($B59<=GoalEntryData!$D$6,1,0),IF(GoalEntryData!$C$6=\">=\",IF($B59>=GoalEntryData!$D$6,1,0),\"\")))","v":""},"",null,null,null,{"$f":"IF($M59=\"\",\"\",IF(GoalEntryData!$C$10=\"<=\",IF($M59<=GoalEntryData!$D$10,1,0),IF(GoalEntryData!$C$10=\">=\",IF($M59>=GoalEntryData!$D$10,1,0),\"\")))","v":""},"",{"$f":"IF($M59=\"\",\"\",IF(GoalEntryData!$C$11=\"<=\",IF($M59<=GoalEntryData!$D$11,1,0),IF(GoalEntryData!$C$11=\">=\",IF($M59>=GoalEntryData!$D$11,1,0),\"\")))","v":""},"",{"$f":"IF($M59=\"\",\"\",IF(GoalEntryData!$C$12=\"<=\",IF($M59<=GoalEntryData!$D$12,1,0),IF(GoalEntryData!$C$10=\">=\",IF($M59>=GoalEntryData!$D$12,1,0),\"\")))","v":""},"",{"$f":"IF($M59=\"\",\"\",IF(GoalEntryData!$C$10=\"<=\",IF($M59<=GoalEntryData!$D$10,1,0),IF(GoalEntryData!$C$10=\">=\",IF($M59>=GoalEntryData!$D$10,1,0),\"\")))","v":""},""]
[null,null,null,{"$f":"IF($B60=\"\",\"\",IF(GoalEntryData!$C$6=\"<=\",IF($B60<=GoalEntryData!$D$6,1,0),IF(GoalEntryData!$C$6=\">=\",IF($B60>=GoalEntryData!$D$6,1,0),\"\")))","v":""},"",{"$f":"IF($B60=\"\",\"\",IF(GoalEntryData!$C$7=\"<=\",IF($B60<=GoalEntryData!$D$7,1,0),IF(GoalEntryData!$C$7=\">=\",IF($B60>=GoalEntryData!$D$7,1,0),\"\")))","v":""},"",{"$f":"IF($B60=\"\",\"\",IF(GoalEntryData!$C$8=\"<=\",IF($B60<=GoalEntryData!$D$8,1,0),IF(GoalEntryData!$C$8=\">=\",IF($B60>=GoalEntryData!$D$8,1,0),\"\")))","v":""},"",{"$f":"IF($B60=\"\",\"\",IF(GoalEntryData!$C$6=\"<=\",IF($B60<=GoalEntryData!$D$6,1,0),IF(GoalEntryData!$C$6=\">=\",IF($B60>=GoalEntryData!$D$6,1,0),\"\")))","v":""},"",null,null,null,{"$f":"IF($M60=\"\",\"\",IF(GoalEntryData!$C$10=\"<=\",IF($M60<=GoalEntryData!$D$10,1,0),IF(GoalEntryData!$C$10=\">=\",IF($M60>=GoalEntryData!$D$10,1,0),\"\")))","v":""},"",{"$f":"IF($M60=\"\",\"\",IF(GoalEntryData!$C$11=\"<=\",IF($M60<=GoalEntryData!$D$11,1,0),IF(GoalEntryData!$C$11=\">=\",IF($M60>=GoalEntryData!$D$11,1,0),\"\")))","v":""},"",{"$f":"IF($M60=\"\",\"\",IF(GoalEntryData!$C$12=\"<=\",IF($M60<=GoalEntryData!$D$12,1,0),IF(GoalEntryData!$C$10=\">=\",IF($M60>=GoalEntryData!$D$12,1,0),\"\")))","v":""},"",{"$f":"IF($M60=\"\",\"\",IF(GoalEntryData!$C$10=\"<=\",IF($M60<=GoalEntryData!$D$10,1,0),IF(GoalEntryData!$C$10=\">=\",IF($M60>=GoalEntryData!$D$10,1,0),\"\")))","v":""},""]
[null,null,null,{"$f":"IF($B61=\"\",\"\",IF(GoalEntryData!$C$6=\"<=\",IF($B61<=GoalEntryData!$D$6,1,0),IF(GoalEntryData!$C$6=\">=\",IF($B61>=GoalEntryData!$D$6,1,0),\"\")))","v":""},"",{"$f":"IF($B61=\"\",\"\",IF(GoalEntryData!$C$7=\"<=\",IF($B61<=GoalEntryData!$D$7,1,0),IF(GoalEntryData!$C$7=\">=\",IF($B61>=GoalEntryData!$D$7,1,0),\"\")))","v":""},"",{"$f":"IF($B61=\"\",\"\",IF(GoalEntryData!$C$8=\"<=\",IF($B61<=GoalEntryData!$D$8,1,0),IF(GoalEntryData!$C$8=\">=\",IF($B61>=GoalEntryData!$D$8,1,0),\"\")))","v":""},"",{"$f":"IF($B61=\"\",\"\",IF(GoalEntryData!$C$6=\"<=\",IF($B61<=GoalEntryData!$D$6,1,0),IF(GoalEntryData!$C$6=\">=\",IF($B61>=GoalEntryData!$D$6,1,0),\"\")))","v":""},"",null,null,null,{"$f":"IF($M61=\"\",\"\",IF(GoalEntryData!$C$10=\"<=\",IF($M61<=GoalEntryData!$D$10,1,0),IF(GoalEntryData!$C$10=\">=\",IF($M61>=GoalEntryData!$D$10,1,0),\"\")))","v":""},"",{"$f":"IF($M61=\"\",\"\",IF(GoalEntryData!$C$11=\"<=\",IF($M61<=GoalEntryData!$D$11,1,0),IF(GoalEntryData!$C$11=\">=\",IF($M61>=GoalEntryData!$D$11,1,0),\"\")))","v":""},"",{"$f":"IF($M61=\"\",\"\",IF(GoalEntryData!$C$12=\"<=\",IF($M61<=GoalEntryData!$D$12,1,0),IF(GoalEntryData!$C$10=\">=\",IF($M61>=GoalEntryData!$D$12,1,0),\"\")))","v":""},"",{"$f":"IF($M61=\"\",\"\",IF(GoalEntryData!$C$10=\"<=\",IF($M61<=GoalEntryData!$D$10,1,0),IF(GoalEntryData!$C$10=\">=\",IF($M61>=GoalEntryData!$D$10,1,0),\"\")))","v":""},""]
[null,null,null,{"$f":"IF($B62=\"\",\"\",IF(GoalEntryData!$C$6=\"<=\",IF($B62<=GoalEntryData!$D$6,1,0),IF(GoalEntryData!$C$6=\">=\",IF($B62>=GoalEntryData!$D$6,1,0),\"\")))","v":""},"",{"$f":"IF($B62=\"\",\"\",IF(GoalEntryData!$C$7=\"<=\",IF($B62<=GoalEntryData!$D$7,1,0),IF(GoalEntryData!$C$7=\">=\",IF($B62>=GoalEntryData!$D$7,1,0),\"\")))","v":""},"",{"$f":"IF($B62=\"\",\"\",IF(GoalEntryData!$C$8=\"<=\",IF($B62<=GoalEntryData!$D$8,1,0),IF(GoalEntryData!$C$8=\">=\",IF($B62>=GoalEntryData!$D$8,1,0),\"\")))","v":""},"",{"$f":"IF($B62=\"\",\"\",IF(GoalEntryData!$C$6=\"<=\",IF($B62<=GoalEntryData!$D$6,1,0),IF(GoalEntryData!$C$6=\">=\",IF($B62>=GoalEntryData!$D$6,1,0),\"\")))","v":""},"",null,null,null,{"$f":"IF($M62=\"\",\"\",IF(GoalEntryData!$C$10=\"<=\",IF($M62<=GoalEntryData!$D$10,1,0),IF(GoalEntryData!$C$10=\">=\",IF($M62>=GoalEntryData!$D$10,1,0),\"\")))","v":""},"",{"$f":"IF($M62=\"\",\"\",IF(GoalEntryData!$C$11=\"<=\",IF($M62<=GoalEntryData!$D$11,1,0),IF(GoalEntryData!$C$11=\">=\",IF($M62>=GoalEntryData!$D$11,1,0),\"\")))","v":""},"",{"$f":"IF($M62=\"\",\"\",IF(GoalEntryData!$C$12=\"<=\",IF($M62<=GoalEntryData!$D$12,1,0),IF(GoalEntryData!$C$10=\">=\",IF($M62>=GoalEntryData!$D$12,1,0),\"\")))","v":""},"",{"$f":"IF($M62=\"\",\"\",IF(GoalEntryData!$C$10=\"<=\",IF($M62<=GoalEntryData!$D$10,1,0),IF(GoalEntryData!$C$10=\">=\",IF($M62>=GoalEntryData!$D$10,1,0),\"\")))","v":""},""]
[null,null,null,{"$f":"IF($B63=\"\",\"\",IF(GoalEntryData!$C$6=\"<=\",IF($B63<=GoalEntryData!$D$6,1,0),IF(GoalEntryData!$C$6=\">=\",IF($B63>=GoalEntryData!$D$6,1,0),\"\")))","v":""},"",{"$f":"IF($B63=\"\",\"\",IF(GoalEntryData!$C$7=\"<=\",IF($B63<=GoalEntryData!$D$7,1,0),IF(GoalEntryData!$C$7=\">=\",IF($B63>=GoalEntryData!$D$7,1,0),\"\")))","v":""},"",{"$f":"IF($B63=\"\",\"\",IF(GoalEntryData!$C$8=\"<=\",IF($B63<=GoalEntryData!$D$8,1,0),IF(GoalEntryData!$C$8=\">=\",IF($B63>=GoalEntryData!$D$8,1,0),\"\")))","v":""},"",{"$f":"IF($B63=\"\",\"\",IF(GoalEntryData!$C$6=\"<=\",IF($B63<=GoalEntryData!$D$6,1,0),IF(GoalEntryData!$C$6=\">=\",IF($B63>=GoalEntryData!$D$6,1,0),\"\")))","v":""},"",null,null,null,{"$f":"IF($M63=\"\",\"\",IF(GoalEntryData!$C$10=\"<=\",IF($M63<=GoalEntryData!$D$10,1,0),IF(GoalEntryData!$C$10=\">=\",IF($M63>=GoalEntryData!$D$10,1,0),\"\")))","v":""},"",{"$f":"IF($M63=\"\",\"\",IF(GoalEntryData!$C$11=\"<=\",IF($M63<=GoalEntryData!$D$11,1,0),IF(GoalEntryData!$C$11=\">=\",IF($M63>=GoalEntryData!$D$11,1,0),\"\")))","v":""},"",{"$f":"IF($M63=\"\",\"\",IF(GoalEntryData!$C$12=\"<=\",IF($M63<=GoalEntryData!$D$12,1,0),IF(GoalEntryData!$C$10=\">=\",IF($M63>=GoalEntryData!$D$12,1,0),\"\")))","v":""},"",{"$f":"IF($M63=\"\",\"\",IF(GoalEntryData!$C$10=\"<=\",IF($M63<=GoalEntryData!$D$10,1,0),IF(GoalEntryData!$C$10=\">=\",IF($M63>=GoalEntryData!$D$10,1,0),\"\")))","v":""},""]
[null,null,null,{"$f":"IF($B64=\"\",\"\",IF(GoalEntryData!$C$6=\"<=\",IF($B64<=GoalEntryData!$D$6,1,0),IF(GoalEntryData!$C$6=\">=\",IF($B64>=GoalEntryData!$D$6,1,0),\"\")))","v":""},"",{"$f":"IF($B64=\"\",\"\",IF(GoalEntryData!$C$7=\"<=\",IF($B64<=GoalEntryData!$D$7,1,0),IF(GoalEntryData!$C$7=\">=\",IF($B64>=GoalEntryData!$D$7,1,0),\"\")))","v":""},"",{"$f":"IF($B64=\"\",\"\",IF(GoalEntryData!$C$8=\"<=\",IF($B64<=GoalEntryData!$D$8,1,0),IF(GoalEntryData!$C$8=\">=\",IF($B64>=GoalEntryData!$D$8,1,0),\"\")))","v":""},"",{"$f":"IF($B64=\"\",\"\",IF(GoalEntryData!$C$6=\"<=\",IF($B64<=GoalEntryData!$D$6,1,0),IF(GoalEntryData!$C$6=\">=\",IF($B64>=GoalEntryData!$D$6,1,0),\"\")))","v":""},"",null,null,null,{"$f":"IF($M64=\"\",\"\",IF(GoalEntryData!$C$10=\"<=\",IF($M64<=GoalEntryData!$D$10,1,0),IF(GoalEntryData!$C$10=\">=\",IF($M64>=GoalEntryData!$D$10,1,0),\"\")))","v":""},"",{"$f":"IF($M64=\"\",\"\",IF(GoalEntryData!$C$11=\"<=\",IF($M64<=GoalEntryData!$D$11,1,0),IF(GoalEntryData!$C$11=\">=\",IF($M64>=GoalEntryData!$D$11,1,0),\"\")))","v":""},"",{"$f":"IF($M64=\"\",\"\",IF(GoalEntryData!$C$12=\"<=\",IF($M64<=GoalEntryData!$D$12,1,0),IF(GoalEntryData!$C$10=\">=\",IF($M64>=GoalEntryData!$D$12,1,0),\"\")))","v":""},"",{"$f":"IF($M64=\"\",\"\",IF(GoalEntryData!$C$10=\"<=\",IF($M64<=GoalEntryData!$D$10,1,0),IF(GoalEntryData!$C$10=\">=\",IF($M64>=GoalEntryData!$D$10,1,0),\"\")))","v":""},""]
[null,null,null,{"$f":"IF($B65=\"\",\"\",IF(GoalEntryData!$C$6=\"<=\",IF($B65<=GoalEntryData!$D$6,1,0),IF(GoalEntryData!$C$6=\">=\",IF($B65>=GoalEntryData!$D$6,1,0),\"\")))","v":""},"",{"$f":"IF($B65=\"\",\"\",IF(GoalEntryData!$C$7=\"<=\",IF($B65<=GoalEntryData!$D$7,1,0),IF(GoalEntryData!$C$7=\">=\",IF($B65>=GoalEntryData!$D$7,1,0),\"\")))","v":""},"",{"$f":"IF($B65=\"\",\"\",IF(GoalEntryData!$C$8=\"<=\",IF($B65<=GoalEntryData!$D$8,1,0),IF(GoalEntryData!$C$8=\">=\",IF($B65>=GoalEntryData!$D$8,1,0),\"\")))","v":""},"",{"$f":"IF($B65=\"\",\"\",IF(GoalEntryData!$C$6=\"<=\",IF($B65<=GoalEntryData!$D$6,1,0),IF(GoalEntryData!$C$6=\">=\",IF($B65>=GoalEntryData!$D$6,1,0),\"\")))","v":""},"",null,null,null,{"$f":"IF($M65=\"\",\"\",IF(GoalEntryData!$C$10=\"<=\",IF($M65<=GoalEntryData!$D$10,1,0),IF(GoalEntryData!$C$10=\">=\",IF($M65>=GoalEntryData!$D$10,1,0),\"\")))","v":""},"",{"$f":"IF($M65=\"\",\"\",IF(GoalEntryData!$C$11=\"<=\",IF($M65<=GoalEntryData!$D$11,1,0),IF(GoalEntryData!$C$11=\">=\",IF($M65>=GoalEntryData!$D$11,1,0),\"\")))","v":""},"",{"$f":"IF($M65=\"\",\"\",IF(GoalEntryData!$C$12=\"<=\",IF($M65<=GoalEntryData!$D$12,1,0),IF(GoalEntryData!$C$10=\">=\",IF($M65>=GoalEntryData!$D$12,1,0),\"\")))","v":""},"",{"$f":"IF($M65=\"\",\"\",IF(GoalEntryData!$C$10=\"<=\",IF($M65<=GoalEntryData!$D$10,1,0),IF(GoalEntryData!$C$10=\">=\",IF($M65>=GoalEntryData!$D$10,1,0),\"\")))","v":""},""]
[null,null,null,{"$f":"IF($B66=\"\",\"\",IF(GoalEntryData!$C$6=\"<=\",IF($B66<=GoalEntryData!$D$6,1,0),IF(GoalEntryData!$C$6=\">=\",IF($B66>=GoalEntryData!$D$6,1,0),\"\")))","v":""},"",{"$f":"IF($B66=\"\",\"\",IF(GoalEntryData!$C$7=\"<=\",IF($B66<=GoalEntryData!$D$7,1,0),IF(GoalEntryData!$C$7=\">=\",IF($B66>=GoalEntryData!$D$7,1,0),\"\")))","v":""},"",{"$f":"IF($B66=\"\",\"\",IF(GoalEntryData!$C$8=\"<=\",IF($B66<=GoalEntryData!$D$8,1,0),IF(GoalEntryData!$C$8=\">=\",IF($B66>=GoalEntryData!$D$8,1,0),\"\")))","v":""},"",{"$f":"IF($B66=\"\",\"\",IF(GoalEntryData!$C$6=\"<=\",IF($B66<=GoalEntryData!$D$6,1,0),IF(GoalEntryData!$C$6=\">=\",IF($B66>=GoalEntryData!$D$6,1,0),\"\")))","v":""},"",null,null,null,{"$f":"IF($M66=\"\",\"\",IF(GoalEntryData!$C$10=\"<=\",IF($M66<=GoalEntryData!$D$10,1,0),IF(GoalEntryData!$C$10=\">=\",IF($M66>=GoalEntryData!$D$10,1,0),\"\")))","v":""},"",{"$f":"IF($M66=\"\",\"\",IF(GoalEntryData!$C$11=\"<=\",IF($M66<=GoalEntryData!$D$11,1,0),IF(GoalEntryData!$C$11=\">=\",IF($M66>=GoalEntryData!$D$11,1,0),\"\")))","v":""},"",{"$f":"IF($M66=\"\",\"\",IF(GoalEntryData!$C$12=\"<=\",IF($M66<=GoalEntryData!$D$12,1,0),IF(GoalEntryData!$C$10=\">=\",IF($M66>=GoalEntryData!$D$12,1,0),\"\")))","v":""},"",{"$f":"IF($M66=\"\",\"\",IF(GoalEntryData!$C$10=\"<=\",IF($M66<=GoalEntryData!$D$10,1,0),IF(GoalEntryData!$C$10=\">=\",IF($M66>=GoalEntryData!$D$10,1,0),\"\")))","v":""},""]
[null,null,null,{"$f":"IF($B67=\"\",\"\",IF(GoalEntryData!$C$6=\"<=\",IF($B67<=GoalEntryData!$D$6,1,0),IF(GoalEntryData!$C$6=\">=\",IF($B67>=GoalEntryData!$D$6,1,0),\"\")))","v":""},"",{"$f":"IF($B67=\"\",\"\",IF(GoalEntryData!$C$7=\"<=\",IF($B67<=GoalEntryData!$D$7,1,0),IF(GoalEntryData!$C$7=\">=\",IF($B67>=GoalEntryData!$D$7,1,0),\"\")))","v":""},"",{"$f":"IF($B67=\"\",\"\",IF(GoalEntryData!$C$8=\"<=\",IF($B67<=GoalEntryData!$D$8,1,0),IF(GoalEntryData!$C$8=\">=\",IF($B67>=GoalEntryData!$D$8,1,0),\"\")))","v":""},"",{"$f":"IF($B67=\"\",\"\",IF(GoalEntryData!$C$6=\"<=\",IF($B67<=GoalEntryData!$D$6,1,0),IF(GoalEntryData!$C$6=\">=\",IF($B67>=GoalEntryData!$D$6,1,0),\"\")))","v":""},"",null,null,null,{"$f":"IF($M67=\"\",\"\",IF(GoalEntryData!$C$10=\"<=\",IF($M67<=GoalEntryData!$D$10,1,0),IF(GoalEntryData!$C$10=\">=\",IF($M67>=GoalEntryData!$D$10,1,0),\"\")))","v":""},"",{"$f":"IF($M67=\"\",\"\",IF(GoalEntryData!$C$11=\"<=\",IF($M67<=GoalEntryData!$D$11,1,0),IF(GoalEntryData!$C$11=\">=\",IF($M67>=GoalEntryData!$D$11,1,0),\"\")))","v":""},"",{"$f":"IF($M67=\"\",\"\",IF(GoalEntryData!$C$12=\"<=\",IF($M67<=GoalEntryData!$D$12,1,0),IF(GoalEntryData!$C$10=\">=\",IF($M67>=GoalEntryData!$D$12,1,0),\"\")))","v":""},"",{"$f":"IF($M67=\"\",\"\",IF(GoalEntryData!$C$10=\"<=\",IF($M67<=GoalEntryData!$D$10,1,0),IF(GoalEntryData!$C$10=\">=\",IF($M67>=GoalEntryData!$D$10,1,0),\"\")))","v":""},""]
[null,null,null,{"$f":"IF($B68=\"\",\"\",IF(GoalEntryData!$C$6=\"<=\",IF($B68<=GoalEntryData!$D$6,1,0),IF(GoalEntryData!$C$6=\">=\",IF($B68>=GoalEntryData!$D$6,1,0),\"\")))","v":""},{"$f":"IF(AND(E67>=1,D68=1),E67+1,D68)","v":""},{"$f":"IF($B68=\"\",\"\",IF(GoalEntryData!$C$7=\"<=\",IF($B68<=GoalEntryData!$D$7,1,0),IF(GoalEntryData!$C$7=\">=\",IF($B68>=GoalEntryData!$D$7,1,0),\"\")))","v":""},{"$f":"IF(AND(G67>=1,F68=1),G67+1,F68)","v":""},{"$f":"IF($B68=\"\",\"\",IF(GoalEntryData!$C$8=\"<=\",IF($B68<=GoalEntryData!$D$8,1,0),IF(GoalEntryData!$C$8=\">=\",IF($B68>=GoalEntryData!$D$8,1,0),\"\")))","v":""},{"$f":"IF(AND(I67>=1,H68=1),I67+1,H68)","v":""},{"$f":"IF($B68=\"\",\"\",IF(GoalEntryData!$C$6=\"<=\",IF($B68<=GoalEntryData!$D$6,1,0),IF(GoalEntryData!$C$6=\">=\",IF($B68>=GoalEntryData!$D$6,1,0),\"\")))","v":""},{"$f":"IF(AND(K67>=1,J68=1),K67+1,J68)","v":""},null,null,null,{"$f":"IF($M68=\"\",\"\",IF(GoalEntryData!$C$10=\"<=\",IF($M68<=GoalEntryData!$D$10,1,0),IF(GoalEntryData!$C$10=\">=\",IF($M68>=GoalEntryData!$D$10,1,0),\"\")))","v":""},{"$f":"IF(AND(P67>=1,O68=1),P67+1,O68)","v":""},{"$f":"IF($M68=\"\",\"\",IF(GoalEntryData!$C$11=\"<=\",IF($M68<=GoalEntryData!$D$11,1,0),IF(GoalEntryData!$C$11=\">=\",IF($M68>=GoalEntryData!$D$11,1,0),\"\")))","v":""},{"$f":"IF(AND(R67>=1,Q68=1),R67+1,Q68)","v":""},{"$f":"IF($M68=\"\",\"\",IF(GoalEntryData!$C$12=\"<=\",IF($M68<=GoalEntryData!$D$12,1,0),IF(GoalEntryData!$C$10=\">=\",IF($M68>=GoalEntryData!$D$12,1,0),\"\")))","v":""},{"$f":"IF(AND(T67>=1,S68=1),T67+1,S68)","v":""},{"$f":"IF($M68=\"\",\"\",IF(GoalEntryData!$C$10=\"<=\",IF($M68<=GoalEntryData!$D$10,1,0),IF(GoalEntryData!$C$10=\">=\",IF($M68>=GoalEntryData!$D$10,1,0),\"\")))","v":""},{"$f":"IF(AND(V67>=1,U68=1),V67+1,U68)","v":""}]
[null,null,null,{"$f":"IF($B69=\"\",\"\",IF(GoalEntryData!$C$6=\"<=\",IF($B69<=GoalEntryData!$D$6,1,0),IF(GoalEntryData!$C$6=\">=\",IF($B69>=GoalEntryData!$D$6,1,0),\"\")))","v":""},"",{"$f":"IF($B69=\"\",\"\",IF(GoalEntryData!$C$7=\"<=\",IF($B69<=GoalEntryData!$D$7,1,0),IF(GoalEntryData!$C$7=\">=\",IF($B69>=GoalEntryData!$D$7,1,0),\"\")))","v":""},"",{"$f":"IF($B69=\"\",\"\",IF(GoalEntryData!$C$8=\"<=\",IF($B69<=GoalEntryData!$D$8,1,0),IF(GoalEntryData!$C$8=\">=\",IF($B69>=GoalEntryData!$D$8,1,0),\"\")))","v":""},"",{"$f":"IF($B69=\"\",\"\",IF(GoalEntryData!$C$6=\"<=\",IF($B69<=GoalEntryData!$D$6,1,0),IF(GoalEntryData!$C$6=\">=\",IF($B69>=GoalEntryData!$D$6,1,0),\"\")))","v":""},"",null,null,null,{"$f":"IF($M69=\"\",\"\",IF(GoalEntryData!$C$10=\"<=\",IF($M69<=GoalEntryData!$D$10,1,0),IF(GoalEntryData!$C$10=\">=\",IF($M69>=GoalEntryData!$D$10,1,0),\"\")))","v":""},"",{"$f":"IF($M69=\"\",\"\",IF(GoalEntryData!$C$11=\"<=\",IF($M69<=GoalEntryData!$D$11,1,0),IF(GoalEntryData!$C$11=\">=\",IF($M69>=GoalEntryData!$D$11,1,0),\"\")))","v":""},"",{"$f":"IF($M69=\"\",\"\",IF(GoalEntryData!$C$12=\"<=\",IF($M69<=GoalEntryData!$D$12,1,0),IF(GoalEntryData!$C$10=\">=\",IF($M69>=GoalEntryData!$D$12,1,0),\"\")))","v":""},"",{"$f":"IF($M69=\"\",\"\",IF(GoalEntryData!$C$10=\"<=\",IF($M69<=GoalEntryData!$D$10,1,0),IF(GoalEntryData!$C$10=\">=\",IF($M69>=GoalEntryData!$D$10,1,0),\"\")))","v":""},""]
[null,null,null,{"$f":"IF($B70=\"\",\"\",IF(GoalEntryData!$C$6=\"<=\",IF($B70<=GoalEntryData!$D$6,1,0),IF(GoalEntryData!$C$6=\">=\",IF($B70>=GoalEntryData!$D$6,1,0),\"\")))","v":""},"",{"$f":"IF($B70=\"\",\"\",IF(GoalEntryData!$C$7=\"<=\",IF($B70<=GoalEntryData!$D$7,1,0),IF(GoalEntryData!$C$7=\">=\",IF($B70>=GoalEntryData!$D$7,1,0),\"\")))","v":""},"",{"$f":"IF($B70=\"\",\"\",IF(GoalEntryData!$C$8=\"<=\",IF($B70<=GoalEntryData!$D$8,1,0),IF(GoalEntryData!$C$8=\">=\",IF($B70>=GoalEntryData!$D$8,1,0),\"\")))","v":""},"",{"$f":"IF($B70=\"\",\"\",IF(GoalEntryData!$C$6=\"<=\",IF($B70<=GoalEntryData!$D$6,1,0),IF(GoalEntryData!$C$6=\">=\",IF($B70>=GoalEntryData!$D$6,1,0),\"\")))","v":""},"",null,null,null,{"$f":"IF($M70=\"\",\"\",IF(GoalEntryData!$C$10=\"<=\",IF($M70<=GoalEntryData!$D$10,1,0),IF(GoalEntryData!$C$10=\">=\",IF($M70>=GoalEntryData!$D$10,1,0),\"\")))","v":""},"",{"$f":"IF($M70=\"\",\"\",IF(GoalEntryData!$C$11=\"<=\",IF($M70<=GoalEntryData!$D$11,1,0),IF(GoalEntryData!$C$11=\">=\",IF($M70>=GoalEntryData!$D$11,1,0),\"\")))","v":""},"",{"$f":"IF($M70=\"\",\"\",IF(GoalEntryData!$C$12=\"<=\",IF($M70<=GoalEntryData!$D$12,1,0),IF(GoalEntryData!$C$10=\">=\",IF($M70>=GoalEntryData!$D$12,1,0),\"\")))","v":""},"",{"$f":"IF($M70=\"\",\"\",IF(GoalEntryData!$C$10=\"<=\",IF($M70<=GoalEntryData!$D$10,1,0),IF(GoalEntryData!$C$10=\">=\",IF($M70>=GoalEntryData!$D$10,1,0),\"\")))","v":""},""]
[null,null,null,{"$f":"IF($B71=\"\",\"\",IF(GoalEntryData!$C$6=\"<=\",IF($B71<=GoalEntryData!$D$6,1,0),IF(GoalEntryData!$C$6=\">=\",IF($B71>=GoalEntryData!$D$6,1,0),\"\")))","v":""},"",{"$f":"IF($B71=\"\",\"\",IF(GoalEntryData!$C$7=\"<=\",IF($B71<=GoalEntryData!$D$7,1,0),IF(GoalEntryData!$C$7=\">=\",IF($B71>=GoalEntryData!$D$7,1,0),\"\")))","v":""},"",{"$f":"IF($B71=\"\",\"\",IF(GoalEntryData!$C$8=\"<=\",IF($B71<=GoalEntryData!$D$8,1,0),IF(GoalEntryData!$C$8=\">=\",IF($B71>=GoalEntryData!$D$8,1,0),\"\")))","v":""},"",{"$f":"IF($B71=\"\",\"\",IF(GoalEntryData!$C$6=\"<=\",IF($B71<=GoalEntryData!$D$6,1,0),IF(GoalEntryData!$C$6=\">=\",IF($B71>=GoalEntryData!$D$6,1,0),\"\")))","v":""},"",null,null,null,{"$f":"IF($M71=\"\",\"\",IF(GoalEntryData!$C$10=\"<=\",IF($M71<=GoalEntryData!$D$10,1,0),IF(GoalEntryData!$C$10=\">=\",IF($M71>=GoalEntryData!$D$10,1,0),\"\")))","v":""},"",{"$f":"IF($M71=\"\",\"\",IF(GoalEntryData!$C$11=\"<=\",IF($M71<=GoalEntryData!$D$11,1,0),IF(GoalEntryData!$C$11=\">=\",IF($M71>=GoalEntryData!$D$11,1,0),\"\")))","v":""},"",{"$f":"IF($M71=\"\",\"\",IF(GoalEntryData!$C$12=\"<=\",IF($M71<=GoalEntryData!$D$12,1,0),IF(GoalEntryData!$C$10=\">=\",IF($M71>=GoalEntryData!$D$12,1,0),\"\")))","v":""},"",{"$f":"IF($M71=\"\",\"\",IF(GoalEntryData!$C$10=\"<=\",IF($M71<=GoalEntryData!$D$10,1,0),IF(GoalEntryData!$C$10=\">=\",IF($M71>=GoalEntryData!$D$10,1,0),\"\")))","v":""},""]
[null,null,null,{"$f":"IF($B72=\"\",\"\",IF(GoalEntryData!$C$6=\"<=\",IF($B72<=GoalEntryData!$D$6,1,0),IF(GoalEntryData!$C$6=\">=\",IF($B72>=GoalEntryData!$D$6,1,0),\"\")))","v":""},"",{"$f":"IF($B72=\"\",\"\",IF(GoalEntryData!$C$7=\"<=\",IF($B72<=GoalEntryData!$D$7,1,0),IF(GoalEntryData!$C$7=\">=\",IF($B72>=GoalEntryData!$D$7,1,0),\"\")))","v":""},"",{"$f":"IF($B72=\"\",\"\",IF(GoalEntryData!$C$8=\"<=\",IF($B72<=GoalEntryData!$D$8,1,0),IF(GoalEntryData!$C$8=\">=\",IF($B72>=GoalEntryData!$D$8,1,0),\"\")))","v":""},"",{"$f":"IF($B72=\"\",\"\",IF(GoalEntryData!$C$6=\"<=\",IF($B72<=GoalEntryData!$D$6,1,0),IF(GoalEntryData!$C$6=\">=\",IF($B72>=GoalEntryData!$D$6,1,0),\"\")))","v":""},"",null,null,null,{"$f":"IF($M72=\"\",\"\",IF(GoalEntryData!$C$10=\"<=\",IF($M72<=GoalEntryData!$D$10,1,0),IF(GoalEntryData!$C$10=\">=\",IF($M72>=GoalEntryData!$D$10,1,0),\"\")))","v":""},"",{"$f":"IF($M72=\"\",\"\",IF(GoalEntryData!$C$11=\"<=\",IF($M72<=GoalEntryData!$D$11,1,0),IF(GoalEntryData!$C$11=\">=\",IF($M72>=GoalEntryData!$D$11,1,0),\"\")))","v":""},"",{"$f":"IF($M72=\"\",\"\",IF(GoalEntryData!$C$12=\"<=\",IF($M72<=GoalEntryData!$D$12,1,0),IF(GoalEntryData!$C$10=\">=\",IF($M72>=GoalEntryData!$D$12,1,0),\"\")))","v":""},"",{"$f":"IF($M72=\"\",\"\",IF(GoalEntryData!$C$10=\"<=\",IF($M72<=GoalEntryData!$D$10,1,0),IF(GoalEntryData!$C$10=\">=\",IF($M72>=GoalEntryData!$D$10,1,0),\"\")))","v":""},""]
[null,null,null,{"$f":"IF($B73=\"\",\"\",IF(GoalEntryData!$C$6=\"<=\",IF($B73<=GoalEntryData!$D$6,1,0),IF(GoalEntryData!$C$6=\">=\",IF($B73>=GoalEntryData!$D$6,1,0),\"\")))","v":""},"",{"$f":"IF($B73=\"\",\"\",IF(GoalEntryData!$C$7=\"<=\",IF($B73<=GoalEntryData!$D$7,1,0),IF(GoalEntryData!$C$7=\">=\",IF($B73>=GoalEntryData!$D$7,1,0),\"\")))","v":""},"",{"$f":"IF($B73=\"\",\"\",IF(GoalEntryData!$C$8=\"<=\",IF($B73<=GoalEntryData!$D$8,1,0),IF(GoalEntryData!$C$8=\">=\",IF($B73>=GoalEntryData!$D$8,1,0),\"\")))","v":""},"",{"$f":"IF($B73=\"\",\"\",IF(GoalEntryData!$C$6=\"<=\",IF($B73<=GoalEntryData!$D$6,1,0),IF(GoalEntryData!$C$6=\">=\",IF($B73>=GoalEntryData!$D$6,1,0),\"\")))","v":""},"",null,null,null,{"$f":"IF($M73=\"\",\"\",IF(GoalEntryData!$C$10=\"<=\",IF($M73<=GoalEntryData!$D$10,1,0),IF(GoalEntryData!$C$10=\">=\",IF($M73>=GoalEntryData!$D$10,1,0),\"\")))","v":""},"",{"$f":"IF($M73=\"\",\"\",IF(GoalEntryData!$C$11=\"<=\",IF($M73<=GoalEntryData!$D$11,1,0),IF(GoalEntryData!$C$11=\">=\",IF($M73>=GoalEntryData!$D$11,1,0),\"\")))","v":""},"",{"$f":"IF($M73=\"\",\"\",IF(GoalEntryData!$C$12=\"<=\",IF($M73<=GoalEntryData!$D$12,1,0),IF(GoalEntryData!$C$10=\">=\",IF($M73>=GoalEntryData!$D$12,1,0),\"\")))","v":""},"",{"$f":"IF($M73=\"\",\"\",IF(GoalEntryData!$C$10=\"<=\",IF($M73<=GoalEntryData!$D$10,1,0),IF(GoalEntryData!$C$10=\">=\",IF($M73>=GoalEntryData!$D$10,1,0),\"\")))","v":""},""]
[null,null,null,{"$f":"IF($B74=\"\",\"\",IF(GoalEntryData!$C$6=\"<=\",IF($B74<=GoalEntryData!$D$6,1,0),IF(GoalEntryData!$C$6=\">=\",IF($B74>=GoalEntryData!$D$6,1,0),\"\")))","v":""},"",{"$f":"IF($B74=\"\",\"\",IF(GoalEntryData!$C$7=\"<=\",IF($B74<=GoalEntryData!$D$7,1,0),IF(GoalEntryData!$C$7=\">=\",IF($B74>=GoalEntryData!$D$7,1,0),\"\")))","v":""},"",{"$f":"IF($B74=\"\",\"\",IF(GoalEntryData!$C$8=\"<=\",IF($B74<=GoalEntryData!$D$8,1,0),IF(GoalEntryData!$C$8=\">=\",IF($B74>=GoalEntryData!$D$8,1,0),\"\")))","v":""},"",{"$f":"IF($B74=\"\",\"\",IF(GoalEntryData!$C$6=\"<=\",IF($B74<=GoalEntryData!$D$6,1,0),IF(GoalEntryData!$C$6=\">=\",IF($B74>=GoalEntryData!$D$6,1,0),\"\")))","v":""},"",null,null,null,{"$f":"IF($M74=\"\",\"\",IF(GoalEntryData!$C$10=\"<=\",IF($M74<=GoalEntryData!$D$10,1,0),IF(GoalEntryData!$C$10=\">=\",IF($M74>=GoalEntryData!$D$10,1,0),\"\")))","v":""},"",{"$f":"IF($M74=\"\",\"\",IF(GoalEntryData!$C$11=\"<=\",IF($M74<=GoalEntryData!$D$11,1,0),IF(GoalEntryData!$C$11=\">=\",IF($M74>=GoalEntryData!$D$11,1,0),\"\")))","v":""},"",{"$f":"IF($M74=\"\",\"\",IF(GoalEntryData!$C$12=\"<=\",IF($M74<=GoalEntryData!$D$12,1,0),IF(GoalEntryData!$C$10=\">=\",IF($M74>=GoalEntryData!$D$12,1,0),\"\")))","v":""},"",{"$f":"IF($M74=\"\",\"\",IF(GoalEntryData!$C$10=\"<=\",IF($M74<=GoalEntryData!$D$10,1,0),IF(GoalEntryData!$C$10=\">=\",IF($M74>=GoalEntryData!$D$10,1,0),\"\")))","v":""},""]
[null,null,null,{"$f":"IF($B75=\"\",\"\",IF(GoalEntryData!$C$6=\"<=\",IF($B75<=GoalEntryData!$D$6,1,0),IF(GoalEntryData!$C$6=\">=\",IF($B75>=GoalEntryData!$D$6,1,0),\"\")))","v":""},"",{"$f":"IF($B75=\"\",\"\",IF(GoalEntryData!$C$7=\"<=\",IF($B75<=GoalEntryData!$D$7,1,0),IF(GoalEntryData!$C$7=\">=\",IF($B75>=GoalEntryData!$D$7,1,0),\"\")))","v":""},"",{"$f":"IF($B75=\"\",\"\",IF(GoalEntryData!$C$8=\"<=\",IF($B75<=GoalEntryData!$D$8,1,0),IF(GoalEntryData!$C$8=\">=\",IF($B75>=GoalEntryData!$D$8,1,0),\"\")))","v":""},"",{"$f":"IF($B75=\"\",\"\",IF(GoalEntryData!$C$6=\"<=\",IF($B75<=GoalEntryData!$D$6,1,0),IF(GoalEntryData!$C$6=\">=\",IF($B75>=GoalEntryData!$D$6,1,0),\"\")))","v":""},"",null,null,null,{"$f":"IF($M75=\"\",\"\",IF(GoalEntryData!$C$10=\"<=\",IF($M75<=GoalEntryData!$D$10,1,0),IF(GoalEntryData!$C$10=\">=\",IF($M75>=GoalEntryData!$D$10,1,0),\"\")))","v":""},"",{"$f":"IF($M75=\"\",\"\",IF(GoalEntryData!$C$11=\"<=\",IF($M75<=GoalEntryData!$D$11,1,0),IF(GoalEntryData!$C$11=\">=\",IF($M75>=GoalEntryData!$D$11,1,0),\"\")))","v":""},"",{"$f":"IF($M75=\"\",\"\",IF(GoalEntryData!$C$12=\"<=\",IF($M75<=GoalEntryData!$D$12,1,0),IF(GoalEntryData!$C$10=\">=\",IF($M75>=GoalEntryData!$D$12,1,0),\"\")))","v":""},"",{"$f":"IF($M75=\"\",\"\",IF(GoalEntryData!$C$10=\"<=\",IF($M75<=GoalEntryData!$D$10,1,0),IF(GoalEntryData!$C$10=\">=\",IF($M75>=GoalEntryData!$D$10,1,0),\"\")))","v":""},""]
[null,null,null,{"$f":"IF($B76=\"\",\"\",IF(GoalEntryData!$C$6=\"<=\",IF($B76<=GoalEntryData!$D$6,1,0),IF(GoalEntryData!$C$6=\">=\",IF($B76>=GoalEntryData!$D$6,1,0),\"\")))","v":""},"",{"$f":"IF($B76=\"\",\"\",IF(GoalEntryData!$C$7=\"<=\",IF($B76<=GoalEntryData!$D$7,1,0),IF(GoalEntryData!$C$7=\">=\",IF($B76>=GoalEntryData!$D$7,1,0),\"\")))","v":""},"",{"$f":"IF($B76=\"\",\"\",IF(GoalEntryData!$C$8=\"<=\",IF($B76<=GoalEntryData!$D$8,1,0),IF(GoalEntryData!$C$8=\">=\",IF($B76>=GoalEntryData!$D$8,1,0),\"\")))","v":""},"",{"$f":"IF($B76=\"\",\"\",IF(GoalEntryData!$C$6=\"<=\",IF($B76<=GoalEntryData!$D$6,1,0),IF(GoalEntryData!$C$6=\">=\",IF($B76>=GoalEntryData!$D$6,1,0),\"\")))","v":""},"",null,null,null,{"$f":"IF($M76=\"\",\"\",IF(GoalEntryData!$C$10=\"<=\",IF($M76<=GoalEntryData!$D$10,1,0),IF(GoalEntryData!$C$10=\">=\",IF($M76>=GoalEntryData!$D$10,1,0),\"\")))","v":""},"",{"$f":"IF($M76=\"\",\"\",IF(GoalEntryData!$C$11=\"<=\",IF($M76<=GoalEntryData!$D$11,1,0),IF(GoalEntryData!$C$11=\">=\",IF($M76>=GoalEntryData!$D$11,1,0),\"\")))","v":""},"",{"$f":"IF($M76=\"\",\"\",IF(GoalEntryData!$C$12=\"<=\",IF($M76<=GoalEntryData!$D$12,1,0),IF(GoalEntryData!$C$10=\">=\",IF($M76>=GoalEntryData!$D$12,1,0),\"\")))","v":""},"",{"$f":"IF($M76=\"\",\"\",IF(GoalEntryData!$C$10=\"<=\",IF($M76<=GoalEntryData!$D$10,1,0),IF(GoalEntryData!$C$10=\">=\",IF($M76>=GoalEntryData!$D$10,1,0),\"\")))","v":""},""]
[null,null,null,{"$f":"IF($B77=\"\",\"\",IF(GoalEntryData!$C$6=\"<=\",IF($B77<=GoalEntryData!$D$6,1,0),IF(GoalEntryData!$C$6=\">=\",IF($B77>=GoalEntryData!$D$6,1,0),\"\")))","v":""},"",{"$f":"IF($B77=\"\",\"\",IF(GoalEntryData!$C$7=\"<=\",IF($B77<=GoalEntryData!$D$7,1,0),IF(GoalEntryData!$C$7=\">=\",IF($B77>=GoalEntryData!$D$7,1,0),\"\")))","v":""},"",{"$f":"IF($B77=\"\",\"\",IF(GoalEntryData!$C$8=\"<=\",IF($B77<=GoalEntryData!$D$8,1,0),IF(GoalEntryData!$C$8=\">=\",IF($B77>=GoalEntryData!$D$8,1,0),\"\")))","v":""},"",{"$f":"IF($B77=\"\",\"\",IF(GoalEntryData!$C$6=\"<=\",IF($B77<=GoalEntryData!$D$6,1,0),IF(GoalEntryData!$C$6=\">=\",IF($B77>=GoalEntryData!$D$6,1,0),\"\")))","v":""},"",null,null,null,{"$f":"IF($M77=\"\",\"\",IF(GoalEntryData!$C$10=\"<=\",IF($M77<=GoalEntryData!$D$10,1,0),IF(GoalEntryData!$C$10=\">=\",IF($M77>=GoalEntryData!$D$10,1,0),\"\")))","v":""},"",{"$f":"IF($M77=\"\",\"\",IF(GoalEntryData!$C$11=\"<=\",IF($M77<=GoalEntryData!$D$11,1,0),IF(GoalEntryData!$C$11=\">=\",IF($M77>=GoalEntryData!$D$11,1,0),\"\")))","v":""},"",{"$f":"IF($M77=\"\",\"\",IF(GoalEntryData!$C$12=\"<=\",IF($M77<=GoalEntryData!$D$12,1,0),IF(GoalEntryData!$C$10=\">=\",IF($M77>=GoalEntryData!$D$12,1,0),\"\")))","v":""},"",{"$f":"IF($M77=\"\",\"\",IF(GoalEntryData!$C$10=\"<=\",IF($M77<=GoalEntryData!$D$10,1,0),IF(GoalEntryData!$C$10=\">=\",IF($M77>=GoalEntryData!$D$10,1,0),\"\")))","v":""},""]
[null,null,null,{"$f":"IF($B78=\"\",\"\",IF(GoalEntryData!$C$6=\"<=\",IF($B78<=GoalEntryData!$D$6,1,0),IF(GoalEntryData!$C$6=\">=\",IF($B78>=GoalEntryData!$D$6,1,0),\"\")))","v":""},"",{"$f":"IF($B78=\"\",\"\",IF(GoalEntryData!$C$7=\"<=\",IF($B78<=GoalEntryData!$D$7,1,0),IF(GoalEntryData!$C$7=\">=\",IF($B78>=GoalEntryData!$D$7,1,0),\"\")))","v":""},"",{"$f":"IF($B78=\"\",\"\",IF(GoalEntryData!$C$8=\"<=\",IF($B78<=GoalEntryData!$D$8,1,0),IF(GoalEntryData!$C$8=\">=\",IF($B78>=GoalEntryData!$D$8,1,0),\"\")))","v":""},"",{"$f":"IF($B78=\"\",\"\",IF(GoalEntryData!$C$6=\"<=\",IF($B78<=GoalEntryData!$D$6,1,0),IF(GoalEntryData!$C$6=\">=\",IF($B78>=GoalEntryData!$D$6,1,0),\"\")))","v":""},"",null,null,null,{"$f":"IF($M78=\"\",\"\",IF(GoalEntryData!$C$10=\"<=\",IF($M78<=GoalEntryData!$D$10,1,0),IF(GoalEntryData!$C$10=\">=\",IF($M78>=GoalEntryData!$D$10,1,0),\"\")))","v":""},"",{"$f":"IF($M78=\"\",\"\",IF(GoalEntryData!$C$11=\"<=\",IF($M78<=GoalEntryData!$D$11,1,0),IF(GoalEntryData!$C$11=\">=\",IF($M78>=GoalEntryData!$D$11,1,0),\"\")))","v":""},"",{"$f":"IF($M78=\"\",\"\",IF(GoalEntryData!$C$12=\"<=\",IF($M78<=GoalEntryData!$D$12,1,0),IF(GoalEntryData!$C$10=\">=\",IF($M78>=GoalEntryData!$D$12,1,0),\"\")))","v":""},"",{"$f":"IF($M78=\"\",\"\",IF(GoalEntryData!$C$10=\"<=\",IF($M78<=GoalEntryData!$D$10,1,0),IF(GoalEntryData!$C$10=\">=\",IF($M78>=GoalEntryData!$D$10,1,0),\"\")))","v":""},""]
[null,null,null,{"$f":"IF($B79=\"\",\"\",IF(GoalEntryData!$C$6=\"<=\",IF($B79<=GoalEntryData!$D$6,1,0),IF(GoalEntryData!$C$6=\">=\",IF($B79>=GoalEntryData!$D$6,1,0),\"\")))","v":""},"",{"$f":"IF($B79=\"\",\"\",IF(GoalEntryData!$C$7=\"<=\",IF($B79<=GoalEntryData!$D$7,1,0),IF(GoalEntryData!$C$7=\">=\",IF($B79>=GoalEntryData!$D$7,1,0),\"\")))","v":""},"",{"$f":"IF($B79=\"\",\"\",IF(GoalEntryData!$C$8=\"<=\",IF($B79<=GoalEntryData!$D$8,1,0),IF(GoalEntryData!$C$8=\">=\",IF($B79>=GoalEntryData!$D$8,1,0),\"\")))","v":""},"",{"$f":"IF($B79=\"\",\"\",IF(GoalEntryData!$C$6=\"<=\",IF($B79<=GoalEntryData!$D$6,1,0),IF(GoalEntryData!$C$6=\">=\",IF($B79>=GoalEntryData!$D$6,1,0),\"\")))","v":""},"",null,null,null,{"$f":"IF($M79=\"\",\"\",IF(GoalEntryData!$C$10=\"<=\",IF($M79<=GoalEntryData!$D$10,1,0),IF(GoalEntryData!$C$10=\">=\",IF($M79>=GoalEntryData!$D$10,1,0),\"\")))","v":""},"",{"$f":"IF($M79=\"\",\"\",IF(GoalEntryData!$C$11=\"<=\",IF($M79<=GoalEntryData!$D$11,1,0),IF(GoalEntryData!$C$11=\">=\",IF($M79>=GoalEntryData!$D$11,1,0),\"\")))","v":""},"",{"$f":"IF($M79=\"\",\"\",IF(GoalEntryData!$C$12=\"<=\",IF($M79<=GoalEntryData!$D$12,1,0),IF(GoalEntryData!$C$10=\">=\",IF($M79>=GoalEntryData!$D$12,1,0),\"\")))","v":""},"",{"$f":"IF($M79=\"\",\"\",IF(GoalEntryData!$C$10=\"<=\",IF($M79<=GoalEntryData!$D$10,1,0),IF(GoalEntryData!$C$10=\">=\",IF($M79>=GoalEntryData!$D$10,1,0),\"\")))","v":""},""]
[null,null,null,{"$f":"IF($B80=\"\",\"\",IF(GoalEntryData!$C$6=\"<=\",IF($B80<=GoalEntryData!$D$6,1,0),IF(GoalEntryData!$C$6=\">=\",IF($B80>=GoalEntryData!$D$6,1,0),\"\")))","v":""},"",{"$f":"IF($B80=\"\",\"\",IF(GoalEntryData!$C$7=\"<=\",IF($B80<=GoalEntryData!$D$7,1,0),IF(GoalEntryData!$C$7=\">=\",IF($B80>=GoalEntryData!$D$7,1,0),\"\")))","v":""},"",{"$f":"IF($B80=\"\",\"\",IF(GoalEntryData!$C$8=\"<=\",IF($B80<=GoalEntryData!$D$8,1,0),IF(GoalEntryData!$C$8=\">=\",IF($B80>=GoalEntryData!$D$8,1,0),\"\")))","v":""},"",{"$f":"IF($B80=\"\",\"\",IF(GoalEntryData!$C$6=\"<=\",IF($B80<=GoalEntryData!$D$6,1,0),IF(GoalEntryData!$C$6=\">=\",IF($B80>=GoalEntryData!$D$6,1,0),\"\")))","v":""},"",null,null,null,{"$f":"IF($M80=\"\",\"\",IF(GoalEntryData!$C$10=\"<=\",IF($M80<=GoalEntryData!$D$10,1,0),IF(GoalEntryData!$C$10=\">=\",IF($M80>=GoalEntryData!$D$10,1,0),\"\")))","v":""},"",{"$f":"IF($M80=\"\",\"\",IF(GoalEntryData!$C$11=\"<=\",IF($M80<=GoalEntryData!$D$11,1,0),IF(GoalEntryData!$C$11=\">=\",IF($M80>=GoalEntryData!$D$11,1,0),\"\")))","v":""},"",{"$f":"IF($M80=\"\",\"\",IF(GoalEntryData!$C$12=\"<=\",IF($M80<=GoalEntryData!$D$12,1,0),IF(GoalEntryData!$C$10=\">=\",IF($M80>=GoalEntryData!$D$12,1,0),\"\")))","v":""},"",{"$f":"IF($M80=\"\",\"\",IF(GoalEntryData!$C$10=\"<=\",IF($M80<=GoalEntryData!$D$10,1,0),IF(GoalEntryData!$C$10=\">=\",IF($M80>=GoalEntryData!$D$10,1,0),\"\")))","v":""},""]
[null,null,null,{"$f":"IF($B81=\"\",\"\",IF(GoalEntryData!$C$6=\"<=\",IF($B81<=GoalEntryData!$D$6,1,0),IF(GoalEntryData!$C$6=\">=\",IF($B81>=GoalEntryData!$D$6,1,0),\"\")))","v":""},"",{"$f":"IF($B81=\"\",\"\",IF(GoalEntryData!$C$7=\"<=\",IF($B81<=GoalEntryData!$D$7,1,0),IF(GoalEntryData!$C$7=\">=\",IF($B81>=GoalEntryData!$D$7,1,0),\"\")))","v":""},"",{"$f":"IF($B81=\"\",\"\",IF(GoalEntryData!$C$8=\"<=\",IF($B81<=GoalEntryData!$D$8,1,0),IF(GoalEntryData!$C$8=\">=\",IF($B81>=GoalEntryData!$D$8,1,0),\"\")))","v":""},"",{"$f":"IF($B81=\"\",\"\",IF(GoalEntryData!$C$6=\"<=\",IF($B81<=GoalEntryData!$D$6,1,0),IF(GoalEntryData!$C$6=\">=\",IF($B81>=GoalEntryData!$D$6,1,0),\"\")))","v":""},"",null,null,null,{"$f":"IF($M81=\"\",\"\",IF(GoalEntryData!$C$10=\"<=\",IF($M81<=GoalEntryData!$D$10,1,0),IF(GoalEntryData!$C$10=\">=\",IF($M81>=GoalEntryData!$D$10,1,0),\"\")))","v":""},"",{"$f":"IF($M81=\"\",\"\",IF(GoalEntryData!$C$11=\"<=\",IF($M81<=GoalEntryData!$D$11,1,0),IF(GoalEntryData!$C$11=\">=\",IF($M81>=GoalEntryData!$D$11,1,0),\"\")))","v":""},"",{"$f":"IF($M81=\"\",\"\",IF(GoalEntryData!$C$12=\"<=\",IF($M81<=GoalEntryData!$D$12,1,0),IF(GoalEntryData!$C$10=\">=\",IF($M81>=GoalEntryData!$D$12,1,0),\"\")))","v":""},"",{"$f":"IF($M81=\"\",\"\",IF(GoalEntryData!$C$10=\"<=\",IF($M81<=GoalEntryData!$D$10,1,0),IF(GoalEntryData!$C$10=\">=\",IF($M81>=GoalEntryData!$D$10,1,0),\"\")))","v":""},""]
[null,null,null,{"$f":"IF($B82=\"\",\"\",IF(GoalEntryData!$C$6=\"<=\",IF($B82<=GoalEntryData!$D$6,1,0),IF(GoalEntryData!$C$6=\">=\",IF($B82>=GoalEntryData!$D$6,1,0),\"\")))","v":""},"",{"$f":"IF($B82=\"\",\"\",IF(GoalEntryData!$C$7=\"<=\",IF($B82<=GoalEntryData!$D$7,1,0),IF(GoalEntryData!$C$7=\">=\",IF($B82>=GoalEntryData!$D$7,1,0),\"\")))","v":""},"",{"$f":"IF($B82=\"\",\"\",IF(GoalEntryData!$C$8=\"<=\",IF($B82<=GoalEntryData!$D$8,1,0),IF(GoalEntryData!$C$8=\">=\",IF($B82>=GoalEntryData!$D$8,1,0),\"\")))","v":""},"",{"$f":"IF($B82=\"\",\"\",IF(GoalEntryData!$C$6=\"<=\",IF($B82<=GoalEntryData!$D$6,1,0),IF(GoalEntryData!$C$6=\">=\",IF($B82>=GoalEntryData!$D$6,1,0),\"\")))","v":""},"",null,null,null,{"$f":"IF($M82=\"\",\"\",IF(GoalEntryData!$C$10=\"<=\",IF($M82<=GoalEntryData!$D$10,1,0),IF(GoalEntryData!$C$10=\">=\",IF($M82>=GoalEntryData!$D$10,1,0),\"\")))","v":""},"",{"$f":"IF($M82=\"\",\"\",IF(GoalEntryData!$C$11=\"<=\",IF($M82<=GoalEntryData!$D$11,1,0),IF(GoalEntryData!$C$11=\">=\",IF($M82>=GoalEntryData!$D$11,1,0),\"\")))","v":""},"",{"$f":"IF($M82=\"\",\"\",IF(GoalEntryData!$C$12=\"<=\",IF($M82<=GoalEntryData!$D$12,1,0),IF(GoalEntryData!$C$10=\">=\",IF($M82>=GoalEntryData!$D$12,1,0),\"\")))","v":""},"",{"$f":"IF($M82=\"\",\"\",IF(GoalEntryData!$C$10=\"<=\",IF($M82<=GoalEntryData!$D$10,1,0),IF(GoalEntryData!$C$10=\">=\",IF($M82>=GoalEntryData!$D$10,1,0),\"\")))","v":""},""]
[null,null,null,{"$f":"IF($B83=\"\",\"\",IF(GoalEntryData!$C$6=\"<=\",IF($B83<=GoalEntryData!$D$6,1,0),IF(GoalEntryData!$C$6=\">=\",IF($B83>=GoalEntryData!$D$6,1,0),\"\")))","v":""},"",{"$f":"IF($B83=\"\",\"\",IF(GoalEntryData!$C$7=\"<=\",IF($B83<=GoalEntryData!$D$7,1,0),IF(GoalEntryData!$C$7=\">=\",IF($B83>=GoalEntryData!$D$7,1,0),\"\")))","v":""},"",{"$f":"IF($B83=\"\",\"\",IF(GoalEntryData!$C$8=\"<=\",IF($B83<=GoalEntryData!$D$8,1,0),IF(GoalEntryData!$C$8=\">=\",IF($B83>=GoalEntryData!$D$8,1,0),\"\")))","v":""},"",{"$f":"IF($B83=\"\",\"\",IF(GoalEntryData!$C$6=\"<=\",IF($B83<=GoalEntryData!$D$6,1,0),IF(GoalEntryData!$C$6=\">=\",IF($B83>=GoalEntryData!$D$6,1,0),\"\")))","v":""},"",null,null,null,{"$f":"IF($M83=\"\",\"\",IF(GoalEntryData!$C$10=\"<=\",IF($M83<=GoalEntryData!$D$10,1,0),IF(GoalEntryData!$C$10=\">=\",IF($M83>=GoalEntryData!$D$10,1,0),\"\")))","v":""},"",{"$f":"IF($M83=\"\",\"\",IF(GoalEntryData!$C$11=\"<=\",IF($M83<=GoalEntryData!$D$11,1,0),IF(GoalEntryData!$C$11=\">=\",IF($M83>=GoalEntryData!$D$11,1,0),\"\")))","v":""},"",{"$f":"IF($M83=\"\",\"\",IF(GoalEntryData!$C$12=\"<=\",IF($M83<=GoalEntryData!$D$12,1,0),IF(GoalEntryData!$C$10=\">=\",IF($M83>=GoalEntryData!$D$12,1,0),\"\")))","v":""},"",{"$f":"IF($M83=\"\",\"\",IF(GoalEntryData!$C$10=\"<=\",IF($M83<=GoalEntryData!$D$10,1,0),IF(GoalEntryData!$C$10=\">=\",IF($M83>=GoalEntryData!$D$10,1,0),\"\")))","v":""},""]
[null,null,null,{"$f":"IF($B84=\"\",\"\",IF(GoalEntryData!$C$6=\"<=\",IF($B84<=GoalEntryData!$D$6,1,0),IF(GoalEntryData!$C$6=\">=\",IF($B84>=GoalEntryData!$D$6,1,0),\"\")))","v":""},"",{"$f":"IF($B84=\"\",\"\",IF(GoalEntryData!$C$7=\"<=\",IF($B84<=GoalEntryData!$D$7,1,0),IF(GoalEntryData!$C$7=\">=\",IF($B84>=GoalEntryData!$D$7,1,0),\"\")))","v":""},"",{"$f":"IF($B84=\"\",\"\",IF(GoalEntryData!$C$8=\"<=\",IF($B84<=GoalEntryData!$D$8,1,0),IF(GoalEntryData!$C$8=\">=\",IF($B84>=GoalEntryData!$D$8,1,0),\"\")))","v":""},"",{"$f":"IF($B84=\"\",\"\",IF(GoalEntryData!$C$6=\"<=\",IF($B84<=GoalEntryData!$D$6,1,0),IF(GoalEntryData!$C$6=\">=\",IF($B84>=GoalEntryData!$D$6,1,0),\"\")))","v":""},"",null,null,null,{"$f":"IF($M84=\"\",\"\",IF(GoalEntryData!$C$10=\"<=\",IF($M84<=GoalEntryData!$D$10,1,0),IF(GoalEntryData!$C$10=\">=\",IF($M84>=GoalEntryData!$D$10,1,0),\"\")))","v":""},"",{"$f":"IF($M84=\"\",\"\",IF(GoalEntryData!$C$11=\"<=\",IF($M84<=GoalEntryData!$D$11,1,0),IF(GoalEntryData!$C$11=\">=\",IF($M84>=GoalEntryData!$D$11,1,0),\"\")))","v":""},"",{"$f":"IF($M84=\"\",\"\",IF(GoalEntryData!$C$12=\"<=\",IF($M84<=GoalEntryData!$D$12,1,0),IF(GoalEntryData!$C$10=\">=\",IF($M84>=GoalEntryData!$D$12,1,0),\"\")))","v":""},"",{"$f":"IF($M84=\"\",\"\",IF(GoalEntryData!$C$10=\"<=\",IF($M84<=GoalEntryData!$D$10,1,0),IF(GoalEntryData!$C$10=\">=\",IF($M84>=GoalEntryData!$D$10,1,0),\"\")))","v":""},""]
[null,null,null,{"$f":"IF($B85=\"\",\"\",IF(GoalEntryData!$C$6=\"<=\",IF($B85<=GoalEntryData!$D$6,1,0),IF(GoalEntryData!$C$6=\">=\",IF($B85>=GoalEntryData!$D$6,1,0),\"\")))","v":""},"",{"$f":"IF($B85=\"\",\"\",IF(GoalEntryData!$C$7=\"<=\",IF($B85<=GoalEntryData!$D$7,1,0),IF(GoalEntryData!$C$7=\">=\",IF($B85>=GoalEntryData!$D$7,1,0),\"\")))","v":""},"",{"$f":"IF($B85=\"\",\"\",IF(GoalEntryData!$C$8=\"<=\",IF($B85<=GoalEntryData!$D$8,1,0),IF(GoalEntryData!$C$8=\">=\",IF($B85>=GoalEntryData!$D$8,1,0),\"\")))","v":""},"",{"$f":"IF($B85=\"\",\"\",IF(GoalEntryData!$C$6=\"<=\",IF($B85<=GoalEntryData!$D$6,1,0),IF(GoalEntryData!$C$6=\">=\",IF($B85>=GoalEntryData!$D$6,1,0),\"\")))","v":""},"",null,null,null,{"$f":"IF($M85=\"\",\"\",IF(GoalEntryData!$C$10=\"<=\",IF($M85<=GoalEntryData!$D$10,1,0),IF(GoalEntryData!$C$10=\">=\",IF($M85>=GoalEntryData!$D$10,1,0),\"\")))","v":""},"",{"$f":"IF($M85=\"\",\"\",IF(GoalEntryData!$C$11=\"<=\",IF($M85<=GoalEntryData!$D$11,1,0),IF(GoalEntryData!$C$11=\">=\",IF($M85>=GoalEntryData!$D$11,1,0),\"\")))","v":""},"",{"$f":"IF($M85=\"\",\"\",IF(GoalEntryData!$C$12=\"<=\",IF($M85<=GoalEntryData!$D$12,1,0),IF(GoalEntryData!$C$10=\">=\",IF($M85>=GoalEntryData!$D$12,1,0),\"\")))","v":""},"",{"$f":"IF($M85=\"\",\"\",IF(GoalEntryData!$C$10=\"<=\",IF($M85<=GoalEntryData!$D$10,1,0),IF(GoalEntryData!$C$10=\">=\",IF($M85>=GoalEntryData!$D$10,1,0),\"\")))","v":""},""]
[null,null,null,{"$f":"IF($B86=\"\",\"\",IF(GoalEntryData!$C$6=\"<=\",IF($B86<=GoalEntryData!$D$6,1,0),IF(GoalEntryData!$C$6=\">=\",IF($B86>=GoalEntryData!$D$6,1,0),\"\")))","v":""},"",{"$f":"IF($B86=\"\",\"\",IF(GoalEntryData!$C$7=\"<=\",IF($B86<=GoalEntryData!$D$7,1,0),IF(GoalEntryData!$C$7=\">=\",IF($B86>=GoalEntryData!$D$7,1,0),\"\")))","v":""},"",{"$f":"IF($B86=\"\",\"\",IF(GoalEntryData!$C$8=\"<=\",IF($B86<=GoalEntryData!$D$8,1,0),IF(GoalEntryData!$C$8=\">=\",IF($B86>=GoalEntryData!$D$8,1,0),\"\")))","v":""},"",{"$f":"IF($B86=\"\",\"\",IF(GoalEntryData!$C$6=\"<=\",IF($B86<=GoalEntryData!$D$6,1,0),IF(GoalEntryData!$C$6=\">=\",IF($B86>=GoalEntryData!$D$6,1,0),\"\")))","v":""},"",null,null,null,{"$f":"IF($M86=\"\",\"\",IF(GoalEntryData!$C$10=\"<=\",IF($M86<=GoalEntryData!$D$10,1,0),IF(GoalEntryData!$C$10=\">=\",IF($M86>=GoalEntryData!$D$10,1,0),\"\")))","v":""},"",{"$f":"IF($M86=\"\",\"\",IF(GoalEntryData!$C$11=\"<=\",IF($M86<=GoalEntryData!$D$11,1,0),IF(GoalEntryData!$C$11=\">=\",IF($M86>=GoalEntryData!$D$11,1,0),\"\")))","v":""},"",{"$f":"IF($M86=\"\",\"\",IF(GoalEntryData!$C$12=\"<=\",IF($M86<=GoalEntryData!$D$12,1,0),IF(GoalEntryData!$C$10=\">=\",IF($M86>=GoalEntryData!$D$12,1,0),\"\")))","v":""},"",{"$f":"IF($M86=\"\",\"\",IF(GoalEntryData!$C$10=\"<=\",IF($M86<=GoalEntryData!$D$10,1,0),IF(GoalEntryData!$C$10=\">=\",IF($M86>=GoalEntryData!$D$10,1,0),\"\")))","v":""},""]
[null,null,null,{"$f":"IF($B87=\"\",\"\",IF(GoalEntryData!$C$6=\"<=\",IF($B87<=GoalEntryData!$D$6,1,0),IF(GoalEntryData!$C$6=\">=\",IF($B87>=GoalEntryData!$D$6,1,0),\"\")))","v":""},"",{"$f":"IF($B87=\"\",\"\",IF(GoalEntryData!$C$7=\"<=\",IF($B87<=GoalEntryData!$D$7,1,0),IF(GoalEntryData!$C$7=\">=\",IF($B87>=GoalEntryData!$D$7,1,0),\"\")))","v":""},"",{"$f":"IF($B87=\"\",\"\",IF(GoalEntryData!$C$8=\"<=\",IF($B87<=GoalEntryData!$D$8,1,0),IF(GoalEntryData!$C$8=\">=\",IF($B87>=GoalEntryData!$D$8,1,0),\"\")))","v":""},"",{"$f":"IF($B87=\"\",\"\",IF(GoalEntryData!$C$6=\"<=\",IF($B87<=GoalEntryData!$D$6,1,0),IF(GoalEntryData!$C$6=\">=\",IF($B87>=GoalEntryData!$D$6,1,0),\"\")))","v":""},"",null,null,null,{"$f":"IF($M87=\"\",\"\",IF(GoalEntryData!$C$10=\"<=\",IF($M87<=GoalEntryData!$D$10,1,0),IF(GoalEntryData!$C$10=\">=\",IF($M87>=GoalEntryData!$D$10,1,0),\"\")))","v":""},"",{"$f":"IF($M87=\"\",\"\",IF(GoalEntryData!$C$11=\"<=\",IF($M87<=GoalEntryData!$D$11,1,0),IF(GoalEntryData!$C$11=\">=\",IF($M87>=GoalEntryData!$D$11,1,0),\"\")))","v":""},"",{"$f":"IF($M87=\"\",\"\",IF(GoalEntryData!$C$12=\"<=\",IF($M87<=GoalEntryData!$D$12,1,0),IF(GoalEntryData!$C$10=\">=\",IF($M87>=GoalEntryData!$D$12,1,0),\"\")))","v":""},"",{"$f":"IF($M87=\"\",\"\",IF(GoalEntryData!$C$10=\"<=\",IF($M87<=GoalEntryData!$D$10,1,0),IF(GoalEntryData!$C$10=\">=\",IF($M87>=GoalEntryData!$D$10,1,0),\"\")))","v":""},""]
[null,null,null,{"$f":"IF($B88=\"\",\"\",IF(GoalEntryData!$C$6=\"<=\",IF($B88<=GoalEntryData!$D$6,1,0),IF(GoalEntryData!$C$6=\">=\",IF($B88>=GoalEntryData!$D$6,1,0),\"\")))","v":""},"",{"$f":"IF($B88=\"\",\"\",IF(GoalEntryData!$C$7=\"<=\",IF($B88<=GoalEntryData!$D$7,1,0),IF(GoalEntryData!$C$7=\">=\",IF($B88>=GoalEntryData!$D$7,1,0),\"\")))","v":""},"",{"$f":"IF($B88=\"\",\"\",IF(GoalEntryData!$C$8=\"<=\",IF($B88<=GoalEntryData!$D$8,1,0),IF(GoalEntryData!$C$8=\">=\",IF($B88>=GoalEntryData!$D$8,1,0),\"\")))","v":""},"",{"$f":"IF($B88=\"\",\"\",IF(GoalEntryData!$C$6=\"<=\",IF($B88<=GoalEntryData!$D$6,1,0),IF(GoalEntryData!$C$6=\">=\",IF($B88>=GoalEntryData!$D$6,1,0),\"\")))","v":""},"",null,null,null,{"$f":"IF($M88=\"\",\"\",IF(GoalEntryData!$C$10=\"<=\",IF($M88<=GoalEntryData!$D$10,1,0),IF(GoalEntryData!$C$10=\">=\",IF($M88>=GoalEntryData!$D$10,1,0),\"\")))","v":""},"",{"$f":"IF($M88=\"\",\"\",IF(GoalEntryData!$C$11=\"<=\",IF($M88<=GoalEntryData!$D$11,1,0),IF(GoalEntryData!$C$11=\">=\",IF($M88>=GoalEntryData!$D$11,1,0),\"\")))","v":""},"",{"$f":"IF($M88=\"\",\"\",IF(GoalEntryData!$C$12=\"<=\",IF($M88<=GoalEntryData!$D$12,1,0),IF(GoalEntryData!$C$10=\">=\",IF($M88>=GoalEntryData!$D$12,1,0),\"\")))","v":""},"",{"$f":"IF($M88=\"\",\"\",IF(GoalEntryData!$C$10=\"<=\",IF($M88<=GoalEntryData!$D$10,1,0),IF(GoalEntryData!$C$10=\">=\",IF($M88>=GoalEntryData!$D$10,1,0),\"\")))","v":""},""]
[null,null,null,{"$f":"IF($B89=\"\",\"\",IF(GoalEntryData!$C$6=\"<=\",IF($B89<=GoalEntryData!$D$6,1,0),IF(GoalEntryData!$C$6=\">=\",IF($B89>=GoalEntryData!$D$6,1,0),\"\")))","v":""},"",{"$f":"IF($B89=\"\",\"\",IF(GoalEntryData!$C$7=\"<=\",IF($B89<=GoalEntryData!$D$7,1,0),IF(GoalEntryData!$C$7=\">=\",IF($B89>=GoalEntryData!$D$7,1,0),\"\")))","v":""},"",{"$f":"IF($B89=\"\",\"\",IF(GoalEntryData!$C$8=\"<=\",IF($B89<=GoalEntryData!$D$8,1,0),IF(GoalEntryData!$C$8=\">=\",IF($B89>=GoalEntryData!$D$8,1,0),\"\")))","v":""},"",{"$f":"IF($B89=\"\",\"\",IF(GoalEntryData!$C$6=\"<=\",IF($B89<=GoalEntryData!$D$6,1,0),IF(GoalEntryData!$C$6=\">=\",IF($B89>=GoalEntryData!$D$6,1,0),\"\")))","v":""},"",null,null,null,{"$f":"IF($M89=\"\",\"\",IF(GoalEntryData!$C$10=\"<=\",IF($M89<=GoalEntryData!$D$10,1,0),IF(GoalEntryData!$C$10=\">=\",IF($M89>=GoalEntryData!$D$10,1,0),\"\")))","v":""},"",{"$f":"IF($M89=\"\",\"\",IF(GoalEntryData!$C$11=\"<=\",IF($M89<=GoalEntryData!$D$11,1,0),IF(GoalEntryData!$C$11=\">=\",IF($M89>=GoalEntryData!$D$11,1,0),\"\")))","v":""},"",{"$f":"IF($M89=\"\",\"\",IF(GoalEntryData!$C$12=\"<=\",IF($M89<=GoalEntryData!$D$12,1,0),IF(GoalEntryData!$C$10=\">=\",IF($M89>=GoalEntryData!$D$12,1,0),\"\")))","v":""},"",{"$f":"IF($M89=\"\",\"\",IF(GoalEntryData!$C$10=\"<=\",IF($M89<=GoalEntryData!$D$10,1,0),IF(GoalEntryData!$C$10=\">=\",IF($M89>=GoalEntryData!$D$10,1,0),\"\")))","v":""},""]
[null,null,null,{"$f":"IF($B90=\"\",\"\",IF(GoalEntryData!$C$6=\"<=\",IF($B90<=GoalEntryData!$D$6,1,0),IF(GoalEntryData!$C$6=\">=\",IF($B90>=GoalEntryData!$D$6,1,0),\"\")))","v":""},"",{"$f":"IF($B90=\"\",\"\",IF(GoalEntryData!$C$7=\"<=\",IF($B90<=GoalEntryData!$D$7,1,0),IF(GoalEntryData!$C$7=\">=\",IF($B90>=GoalEntryData!$D$7,1,0),\"\")))","v":""},"",{"$f":"IF($B90=\"\",\"\",IF(GoalEntryData!$C$8=\"<=\",IF($B90<=GoalEntryData!$D$8,1,0),IF(GoalEntryData!$C$8=\">=\",IF($B90>=GoalEntryData!$D$8,1,0),\"\")))","v":""},"",{"$f":"IF($B90=\"\",\"\",IF(GoalEntryData!$C$6=\"<=\",IF($B90<=GoalEntryData!$D$6,1,0),IF(GoalEntryData!$C$6=\">=\",IF($B90>=GoalEntryData!$D$6,1,0),\"\")))","v":""},"",null,null,null,{"$f":"IF($M90=\"\",\"\",IF(GoalEntryData!$C$10=\"<=\",IF($M90<=GoalEntryData!$D$10,1,0),IF(GoalEntryData!$C$10=\">=\",IF($M90>=GoalEntryData!$D$10,1,0),\"\")))","v":""},"",{"$f":"IF($M90=\"\",\"\",IF(GoalEntryData!$C$11=\"<=\",IF($M90<=GoalEntryData!$D$11,1,0),IF(GoalEntryData!$C$11=\">=\",IF($M90>=GoalEntryData!$D$11,1,0),\"\")))","v":""},"",{"$f":"IF($M90=\"\",\"\",IF(GoalEntryData!$C$12=\"<=\",IF($M90<=GoalEntryData!$D$12,1,0),IF(GoalEntryData!$C$10=\">=\",IF($M90>=GoalEntryData!$D$12,1,0),\"\")))","v":""},"",{"$f":"IF($M90=\"\",\"\",IF(GoalEntryData!$C$10=\"<=\",IF($M90<=GoalEntryData!$D$10,1,0),IF(GoalEntryData!$C$10=\">=\",IF($M90>=GoalEntryData!$D$10,1,0),\"\")))","v":""},""]
[null,null,null,{"$f":"IF($B91=\"\",\"\",IF(GoalEntryData!$C$6=\"<=\",IF($B91<=GoalEntryData!$D$6,1,0),IF(GoalEntryData!$C$6=\">=\",IF($B91>=GoalEntryData!$D$6,1,0),\"\")))","v":""},"",{"$f":"IF($B91=\"\",\"\",IF(GoalEntryData!$C$7=\"<=\",IF($B91<=GoalEntryData!$D$7,1,0),IF(GoalEntryData!$C$7=\">=\",IF($B91>=GoalEntryData!$D$7,1,0),\"\")))","v":""},"",{"$f":"IF($B91=\"\",\"\",IF(GoalEntryData!$C$8=\"<=\",IF($B91<=GoalEntryData!$D$8,1,0),IF(GoalEntryData!$C$8=\">=\",IF($B91>=GoalEntryData!$D$8,1,0),\"\")))","v":""},"",{"$f":"IF($B91=\"\",\"\",IF(GoalEntryData!$C$6=\"<=\",IF($B91<=GoalEntryData!$D$6,1,0),IF(GoalEntryData!$C$6=\">=\",IF($B91>=GoalEntryData!$D$6,1,0),\"\")))","v":""},"",null,null,null,{"$f":"IF($M91=\"\",\"\",IF(GoalEntryData!$C$10=\"<=\",IF($M91<=GoalEntryData!$D$10,1,0),IF(GoalEntryData!$C$10=\">=\",IF($M91>=GoalEntryData!$D$10,1,0),\"\")))","v":""},"",{"$f":"IF($M91=\"\",\"\",IF(GoalEntryData!$C$11=\"<=\",IF($M91<=GoalEntryData!$D$11,1,0),IF(GoalEntryData!$C$11=\">=\",IF($M91>=GoalEntryData!$D$11,1,0),\"\")))","v":""},"",{"$f":"IF($M91=\"\",\"\",IF(GoalEntryData!$C$12=\"<=\",IF($M91<=GoalEntryData!$D$12,1,0),IF(GoalEntryData!$C$10=\">=\",IF($M91>=GoalEntryData!$D$12,1,0),\"\")))","v":""},"",{"$f":"IF($M91=\"\",\"\",IF(GoalEntryData!$C$10=\"<=\",IF($M91<=GoalEntryData!$D$10,1,0),IF(GoalEntryData!$C$10=\">=\",IF($M91>=GoalEntryData!$D$10,1,0),\"\")))","v":""},""]
[null,null,null,{"$f":"IF($B92=\"\",\"\",IF(GoalEntryData!$C$6=\"<=\",IF($B92<=GoalEntryData!$D$6,1,0),IF(GoalEntryData!$C$6=\">=\",IF($B92>=GoalEntryData!$D$6,1,0),\"\")))","v":""},"",{"$f":"IF($B92=\"\",\"\",IF(GoalEntryData!$C$7=\"<=\",IF($B92<=GoalEntryData!$D$7,1,0),IF(GoalEntryData!$C$7=\">=\",IF($B92>=GoalEntryData!$D$7,1,0),\"\")))","v":""},"",{"$f":"IF($B92=\"\",\"\",IF(GoalEntryData!$C$8=\"<=\",IF($B92<=GoalEntryData!$D$8,1,0),IF(GoalEntryData!$C$8=\">=\",IF($B92>=GoalEntryData!$D$8,1,0),\"\")))","v":""},"",{"$f":"IF($B92=\"\",\"\",IF(GoalEntryData!$C$6=\"<=\",IF($B92<=GoalEntryData!$D$6,1,0),IF(GoalEntryData!$C$6=\">=\",IF($B92>=GoalEntryData!$D$6,1,0),\"\")))","v":""},"",null,null,null,{"$f":"IF($M92=\"\",\"\",IF(GoalEntryData!$C$10=\"<=\",IF($M92<=GoalEntryData!$D$10,1,0),IF(GoalEntryData!$C$10=\">=\",IF($M92>=GoalEntryData!$D$10,1,0),\"\")))","v":""},"",{"$f":"IF($M92=\"\",\"\",IF(GoalEntryData!$C$11=\"<=\",IF($M92<=GoalEntryData!$D$11,1,0),IF(GoalEntryData!$C$11=\">=\",IF($M92>=GoalEntryData!$D$11,1,0),\"\")))","v":""},"",{"$f":"IF($M92=\"\",\"\",IF(GoalEntryData!$C$12=\"<=\",IF($M92<=GoalEntryData!$D$12,1,0),IF(GoalEntryData!$C$10=\">=\",IF($M92>=GoalEntryData!$D$12,1,0),\"\")))","v":""},"",{"$f":"IF($M92=\"\",\"\",IF(GoalEntryData!$C$10=\"<=\",IF($M92<=GoalEntryData!$D$10,1,0),IF(GoalEntryData!$C$10=\">=\",IF($M92>=GoalEntryData!$D$10,1,0),\"\")))","v":""},""]
[null,null,null,{"$f":"IF($B93=\"\",\"\",IF(GoalEntryData!$C$6=\"<=\",IF($B93<=GoalEntryData!$D$6,1,0),IF(GoalEntryData!$C$6=\">=\",IF($B93>=GoalEntryData!$D$6,1,0),\"\")))","v":""},"",{"$f":"IF($B93=\"\",\"\",IF(GoalEntryData!$C$7=\"<=\",IF($B93<=GoalEntryData!$D$7,1,0),IF(GoalEntryData!$C$7=\">=\",IF($B93>=GoalEntryData!$D$7,1,0),\"\")))","v":""},"",{"$f":"IF($B93=\"\",\"\",IF(GoalEntryData!$C$8=\"<=\",IF($B93<=GoalEntryData!$D$8,1,0),IF(GoalEntryData!$C$8=\">=\",IF($B93>=GoalEntryData!$D$8,1,0),\"\")))","v":""},"",{"$f":"IF($B93=\"\",\"\",IF(GoalEntryData!$C$6=\"<=\",IF($B93<=GoalEntryData!$D$6,1,0),IF(GoalEntryData!$C$6=\">=\",IF($B93>=GoalEntryData!$D$6,1,0),\"\")))","v":""},"",null,null,null,{"$f":"IF($M93=\"\",\"\",IF(GoalEntryData!$C$10=\"<=\",IF($M93<=GoalEntryData!$D$10,1,0),IF(GoalEntryData!$C$10=\">=\",IF($M93>=GoalEntryData!$D$10,1,0),\"\")))","v":""},"",{"$f":"IF($M93=\"\",\"\",IF(GoalEntryData!$C$11=\"<=\",IF($M93<=GoalEntryData!$D$11,1,0),IF(GoalEntryData!$C$11=\">=\",IF($M93>=GoalEntryData!$D$11,1,0),\"\")))","v":""},"",{"$f":"IF($M93=\"\",\"\",IF(GoalEntryData!$C$12=\"<=\",IF($M93<=GoalEntryData!$D$12,1,0),IF(GoalEntryData!$C$10=\">=\",IF($M93>=GoalEntryData!$D$12,1,0),\"\")))","v":""},"",{"$f":"IF($M93=\"\",\"\",IF(GoalEntryData!$C$10=\"<=\",IF($M93<=GoalEntryData!$D$10,1,0),IF(GoalEntryData!$C$10=\">=\",IF($M93>=GoalEntryData!$D$10,1,0),\"\")))","v":""},""]
[null,null,null,{"$f":"IF($B94=\"\",\"\",IF(GoalEntryData!$C$6=\"<=\",IF($B94<=GoalEntryData!$D$6,1,0),IF(GoalEntryData!$C$6=\">=\",IF($B94>=GoalEntryData!$D$6,1,0),\"\")))","v":""},"",{"$f":"IF($B94=\"\",\"\",IF(GoalEntryData!$C$7=\"<=\",IF($B94<=GoalEntryData!$D$7,1,0),IF(GoalEntryData!$C$7=\">=\",IF($B94>=GoalEntryData!$D$7,1,0),\"\")))","v":""},"",{"$f":"IF($B94=\"\",\"\",IF(GoalEntryData!$C$8=\"<=\",IF($B94<=GoalEntryData!$D$8,1,0),IF(GoalEntryData!$C$8=\">=\",IF($B94>=GoalEntryData!$D$8,1,0),\"\")))","v":""},"",{"$f":"IF($B94=\"\",\"\",IF(GoalEntryData!$C$6=\"<=\",IF($B94<=GoalEntryData!$D$6,1,0),IF(GoalEntryData!$C$6=\">=\",IF($B94>=GoalEntryData!$D$6,1,0),\"\")))","v":""},"",null,null,null,{"$f":"IF($M94=\"\",\"\",IF(GoalEntryData!$C$10=\"<=\",IF($M94<=GoalEntryData!$D$10,1,0),IF(GoalEntryData!$C$10=\">=\",IF($M94>=GoalEntryData!$D$10,1,0),\"\")))","v":""},"",{"$f":"IF($M94=\"\",\"\",IF(GoalEntryData!$C$11=\"<=\",IF($M94<=GoalEntryData!$D$11,1,0),IF(GoalEntryData!$C$11=\">=\",IF($M94>=GoalEntryData!$D$11,1,0),\"\")))","v":""},"",{"$f":"IF($M94=\"\",\"\",IF(GoalEntryData!$C$12=\"<=\",IF($M94<=GoalEntryData!$D$12,1,0),IF(GoalEntryData!$C$10=\">=\",IF($M94>=GoalEntryData!$D$12,1,0),\"\")))","v":""},"",{"$f":"IF($M94=\"\",\"\",IF(GoalEntryData!$C$10=\"<=\",IF($M94<=GoalEntryData!$D$10,1,0),IF(GoalEntryData!$C$10=\">=\",IF($M94>=GoalEntryData!$D$10,1,0),\"\")))","v":""},""]
[null,null,null,{"$f":"IF($B95=\"\",\"\",IF(GoalEntryData!$C$6=\"<=\",IF($B95<=GoalEntryData!$D$6,1,0),IF(GoalEntryData!$C$6=\">=\",IF($B95>=GoalEntryData!$D$6,1,0),\"\")))","v":""},"",{"$f":"IF($B95=\"\",\"\",IF(GoalEntryData!$C$7=\"<=\",IF($B95<=GoalEntryData!$D$7,1,0),IF(GoalEntryData!$C$7=\">=\",IF($B95>=GoalEntryData!$D$7,1,0),\"\")))","v":""},"",{"$f":"IF($B95=\"\",\"\",IF(GoalEntryData!$C$8=\"<=\",IF($B95<=GoalEntryData!$D$8,1,0),IF(GoalEntryData!$C$8=\">=\",IF($B95>=GoalEntryData!$D$8,1,0),\"\")))","v":""},"",{"$f":"IF($B95=\"\",\"\",IF(GoalEntryData!$C$6=\"<=\",IF($B95<=GoalEntryData!$D$6,1,0),IF(GoalEntryData!$C$6=\">=\",IF($B95>=GoalEntryData!$D$6,1,0),\"\")))","v":""},"",null,null,null,{"$f":"IF($M95=\"\",\"\",IF(GoalEntryData!$C$10=\"<=\",IF($M95<=GoalEntryData!$D$10,1,0),IF(GoalEntryData!$C$10=\">=\",IF($M95>=GoalEntryData!$D$10,1,0),\"\")))","v":""},"",{"$f":"IF($M95=\"\",\"\",IF(GoalEntryData!$C$11=\"<=\",IF($M95<=GoalEntryData!$D$11,1,0),IF(GoalEntryData!$C$11=\">=\",IF($M95>=GoalEntryData!$D$11,1,0),\"\")))","v":""},"",{"$f":"IF($M95=\"\",\"\",IF(GoalEntryData!$C$12=\"<=\",IF($M95<=GoalEntryData!$D$12,1,0),IF(GoalEntryData!$C$10=\">=\",IF($M95>=GoalEntryData!$D$12,1,0),\"\")))","v":""},"",{"$f":"IF($M95=\"\",\"\",IF(GoalEntryData!$C$10=\"<=\",IF($M95<=GoalEntryData!$D$10,1,0),IF(GoalEntryData!$C$10=\">=\",IF($M95>=GoalEntryData!$D$10,1,0),\"\")))","v":""},""]
[null,null,null,{"$f":"IF($B96=\"\",\"\",IF(GoalEntryData!$C$6=\"<=\",IF($B96<=GoalEntryData!$D$6,1,0),IF(GoalEntryData!$C$6=\">=\",IF($B96>=GoalEntryData!$D$6,1,0),\"\")))","v":""},"",{"$f":"IF($B96=\"\",\"\",IF(GoalEntryData!$C$7=\"<=\",IF($B96<=GoalEntryData!$D$7,1,0),IF(GoalEntryData!$C$7=\">=\",IF($B96>=GoalEntryData!$D$7,1,0),\"\")))","v":""},"",{"$f":"IF($B96=\"\",\"\",IF(GoalEntryData!$C$8=\"<=\",IF($B96<=GoalEntryData!$D$8,1,0),IF(GoalEntryData!$C$8=\">=\",IF($B96>=GoalEntryData!$D$8,1,0),\"\")))","v":""},"",{"$f":"IF($B96=\"\",\"\",IF(GoalEntryData!$C$6=\"<=\",IF($B96<=GoalEntryData!$D$6,1,0),IF(GoalEntryData!$C$6=\">=\",IF($B96>=GoalEntryData!$D$6,1,0),\"\")))","v":""},"",null,null,null,{"$f":"IF($M96=\"\",\"\",IF(GoalEntryData!$C$10=\"<=\",IF($M96<=GoalEntryData!$D$10,1,0),IF(GoalEntryData!$C$10=\">=\",IF($M96>=GoalEntryData!$D$10,1,0),\"\")))","v":""},"",{"$f":"IF($M96=\"\",\"\",IF(GoalEntryData!$C$11=\"<=\",IF($M96<=GoalEntryData!$D$11,1,0),IF(GoalEntryData!$C$11=\">=\",IF($M96>=GoalEntryData!$D$11,1,0),\"\")))","v":""},"",{"$f":"IF($M96=\"\",\"\",IF(GoalEntryData!$C$12=\"<=\",IF($M96<=GoalEntryData!$D$12,1,0),IF(GoalEntryData!$C$10=\">=\",IF($M96>=GoalEntryData!$D$12,1,0),\"\")))","v":""},"",{"$f":"IF($M96=\"\",\"\",IF(GoalEntryData!$C$10=\"<=\",IF($M96<=GoalEntryData!$D$10,1,0),IF(GoalEntryData!$C$10=\">=\",IF($M96>=GoalEntryData!$D$10,1,0),\"\")))","v":""},""]
[null,null,null,{"$f":"IF($B97=\"\",\"\",IF(GoalEntryData!$C$6=\"<=\",IF($B97<=GoalEntryData!$D$6,1,0),IF(GoalEntryData!$C$6=\">=\",IF($B97>=GoalEntryData!$D$6,1,0),\"\")))","v":""},"",{"$f":"IF($B97=\"\",\"\",IF(GoalEntryData!$C$7=\"<=\",IF($B97<=GoalEntryData!$D$7,1,0),IF(GoalEntryData!$C$7=\">=\",IF($B97>=GoalEntryData!$D$7,1,0),\"\")))","v":""},"",{"$f":"IF($B97=\"\",\"\",IF(GoalEntryData!$C$8=\"<=\",IF($B97<=GoalEntryData!$D$8,1,0),IF(GoalEntryData!$C$8=\">=\",IF($B97>=GoalEntryData!$D$8,1,0),\"\")))","v":""},"",{"$f":"IF($B97=\"\",\"\",IF(GoalEntryData!$C$6=\"<=\",IF($B97<=GoalEntryData!$D$6,1,0),IF(GoalEntryData!$C$6=\">=\",IF($B97>=GoalEntryData!$D$6,1,0),\"\")))","v":""},"",null,null,null,{"$f":"IF($M97=\"\",\"\",IF(GoalEntryData!$C$10=\"<=\",IF($M97<=GoalEntryData!$D$10,1,0),IF(GoalEntryData!$C$10=\">=\",IF($M97>=GoalEntryData!$D$10,1,0),\"\")))","v":""},"",{"$f":"IF($M97=\"\",\"\",IF(GoalEntryData!$C$11=\"<=\",IF($M97<=GoalEntryData!$D$11,1,0),IF(GoalEntryData!$C$11=\">=\",IF($M97>=GoalEntryData!$D$11,1,0),\"\")))","v":""},"",{"$f":"IF($M97=\"\",\"\",IF(GoalEntryData!$C$12=\"<=\",IF($M97<=GoalEntryData!$D$12,1,0),IF(GoalEntryData!$C$10=\">=\",IF($M97>=GoalEntryData!$D$12,1,0),\"\")))","v":""},"",{"$f":"IF($M97=\"\",\"\",IF(GoalEntryData!$C$10=\"<=\",IF($M97<=GoalEntryData!$D$10,1,0),IF(GoalEntryData!$C$10=\">=\",IF($M97>=GoalEntryData!$D$10,1,0),\"\")))","v":""},""]
[null,null,null,{"$f":"IF($B98=\"\",\"\",IF(GoalEntryData!$C$6=\"<=\",IF($B98<=GoalEntryData!$D$6,1,0),IF(GoalEntryData!$C$6=\">=\",IF($B98>=GoalEntryData!$D$6,1,0),\"\")))","v":""},"",{"$f":"IF($B98=\"\",\"\",IF(GoalEntryData!$C$7=\"<=\",IF($B98<=GoalEntryData!$D$7,1,0),IF(GoalEntryData!$C$7=\">=\",IF($B98>=GoalEntryData!$D$7,1,0),\"\")))","v":""},"",{"$f":"IF($B98=\"\",\"\",IF(GoalEntryData!$C$8=\"<=\",IF($B98<=GoalEntryData!$D$8,1,0),IF(GoalEntryData!$C$8=\">=\",IF($B98>=GoalEntryData!$D$8,1,0),\"\")))","v":""},"",{"$f":"IF($B98=\"\",\"\",IF(GoalEntryData!$C$6=\"<=\",IF($B98<=GoalEntryData!$D$6,1,0),IF(GoalEntryData!$C$6=\">=\",IF($B98>=GoalEntryData!$D$6,1,0),\"\")))","v":""},"",null,null,null,{"$f":"IF($M98=\"\",\"\",IF(GoalEntryData!$C$10=\"<=\",IF($M98<=GoalEntryData!$D$10,1,0),IF(GoalEntryData!$C$10=\">=\",IF($M98>=GoalEntryData!$D$10,1,0),\"\")))","v":""},"",{"$f":"IF($M98=\"\",\"\",IF(GoalEntryData!$C$11=\"<=\",IF($M98<=GoalEntryData!$D$11,1,0),IF(GoalEntryData!$C$11=\">=\",IF($M98>=GoalEntryData!$D$11,1,0),\"\")))","v":""},"",{"$f":"IF($M98=\"\",\"\",IF(GoalEntryData!$C$12=\"<=\",IF($M98<=GoalEntryData!$D$12,1,0),IF(GoalEntryData!$C$10=\">=\",IF($M98>=GoalEntryData!$D$12,1,0),\"\")))","v":""},"",{"$f":"IF($M98=\"\",\"\",IF(GoalEntryData!$C$10=\"<=\",IF($M98<=GoalEntryData!$D$10,1,0),IF(GoalEntryData!$C$10=\">=\",IF($M98>=GoalEntryData!$D$10,1,0),\"\")))","v":""},""]
[null,null,null,{"$f":"IF($B99=\"\",\"\",IF(GoalEntryData!$C$6=\"<=\",IF($B99<=GoalEntryData!$D$6,1,0),IF(GoalEntryData!$C$6=\">=\",IF($B99>=GoalEntryData!$D$6,1,0),\"\")))","v":""},"",{"$f":"IF($B99=\"\",\"\",IF(GoalEntryData!$C$7=\"<=\",IF($B99<=GoalEntryData!$D$7,1,0),IF(GoalEntryData!$C$7=\">=\",IF($B99>=GoalEntryData!$D$7,1,0),\"\")))","v":""},"",{"$f":"IF($B99=\"\",\"\",IF(GoalEntryData!$C$8=\"<=\",IF($B99<=GoalEntryData!$D$8,1,0),IF(GoalEntryData!$C$8=\">=\",IF($B99>=GoalEntryData!$D$8,1,0),\"\")))","v":""},"",{"$f":"IF($B99=\"\",\"\",IF(GoalEntryData!$C$6=\"<=\",IF($B99<=GoalEntryData!$D$6,1,0),IF(GoalEntryData!$C$6=\">=\",IF($B99>=GoalEntryData!$D$6,1,0),\"\")))","v":""},"",null,null,null,{"$f":"IF($M99=\"\",\"\",IF(GoalEntryData!$C$10=\"<=\",IF($M99<=GoalEntryData!$D$10,1,0),IF(GoalEntryData!$C$10=\">=\",IF($M99>=GoalEntryData!$D$10,1,0),\"\")))","v":""},"",{"$f":"IF($M99=\"\",\"\",IF(GoalEntryData!$C$11=\"<=\",IF($M99<=GoalEntryData!$D$11,1,0),IF(GoalEntryData!$C$11=\">=\",IF($M99>=GoalEntryData!$D$11,1,0),\"\")))","v":""},"",{"$f":"IF($M99=\"\",\"\",IF(GoalEntryData!$C$12=\"<=\",IF($M99<=GoalEntryData!$D$12,1,0),IF(GoalEntryData!$C$10=\">=\",IF($M99>=GoalEntryData!$D$12,1,0),\"\")))","v":""},"",{"$f":"IF($M99=\"\",\"\",IF(GoalEntryData!$C$10=\"<=\",IF($M99<=GoalEntryData!$D$10,1,0),IF(GoalEntryData!$C$10=\">=\",IF($M99>=GoalEntryData!$D$10,1,0),\"\")))","v":""},""]
[null,null,null,{"$f":"IF($B100=\"\",\"\",IF(GoalEntryData!$C$6=\"<=\",IF($B100<=GoalEntryData!$D$6,1,0),IF(GoalEntryData!$C$6=\">=\",IF($B100>=GoalEntryData!$D$6,1,0),\"\")))","v":""},"",{"$f":"IF($B100=\"\",\"\",IF(GoalEntryData!$C$7=\"<=\",IF($B100<=GoalEntryData!$D$7,1,0),IF(GoalEntryData!$C$7=\">=\",IF($B100>=GoalEntryData!$D$7,1,0),\"\")))","v":""},"",{"$f":"IF($B100=\"\",\"\",IF(GoalEntryData!$C$8=\"<=\",IF($B100<=GoalEntryData!$D$8,1,0),IF(GoalEntryData!$C$8=\">=\",IF($B100>=GoalEntryData!$D$8,1,0),\"\")))","v":""},"",{"$f":"IF($B100=\"\",\"\",IF(GoalEntryData!$C$6=\"<=\",IF($B100<=GoalEntryData!$D$6,1,0),IF(GoalEntryData!$C$6=\">=\",IF($B100>=GoalEntryData!$D$6,1,0),\"\")))","v":""},"",null,null,null,{"$f":"IF($M100=\"\",\"\",IF(GoalEntryData!$C$10=\"<=\",IF($M100<=GoalEntryData!$D$10,1,0),IF(GoalEntryData!$C$10=\">=\",IF($M100>=GoalEntryData!$D$10,1,0),\"\")))","v":""},"",{"$f":"IF($M100=\"\",\"\",IF(GoalEntryData!$C$11=\"<=\",IF($M100<=GoalEntryData!$D$11,1,0),IF(GoalEntryData!$C$11=\">=\",IF($M100>=GoalEntryData!$D$11,1,0),\"\")))","v":""},"",{"$f":"IF($M100=\"\",\"\",IF(GoalEntryData!$C$12=\"<=\",IF($M100<=GoalEntryData!$D$12,1,0),IF(GoalEntryData!$C$10=\">=\",IF($M100>=GoalEntryData!$D$12,1,0),\"\")))","v":""},"",{"$f":"IF($M100=\"\",\"\",IF(GoalEntryData!$C$10=\"<=\",IF($M100<=GoalEntryData!$D$10,1,0),IF(GoalEntryData!$C$10=\">=\",IF($M100>=GoalEntryData!$D$10,1,0),\"\")))","v":""},""]
[null,null,null,{"$f":"IF($B101=\"\",\"\",IF(GoalEntryData!$C$6=\"<=\",IF($B101<=GoalEntryData!$D$6,1,0),IF(GoalEntryData!$C$6=\">=\",IF($B101>=GoalEntryData!$D$6,1,0),\"\")))","v":""},"",{"$f":"IF($B101=\"\",\"\",IF(GoalEntryData!$C$7=\"<=\",IF($B101<=GoalEntryData!$D$7,1,0),IF(GoalEntryData!$C$7=\">=\",IF($B101>=GoalEntryData!$D$7,1,0),\"\")))","v":""},"",{"$f":"IF($B101=\"\",\"\",IF(GoalEntryData!$C$8=\"<=\",IF($B101<=GoalEntryData!$D$8,1,0),IF(GoalEntryData!$C$8=\">=\",IF($B101>=GoalEntryData!$D$8,1,0),\"\")))","v":""},"",{"$f":"IF($B101=\"\",\"\",IF(GoalEntryData!$C$6=\"<=\",IF($B101<=GoalEntryData!$D$6,1,0),IF(GoalEntryData!$C$6=\">=\",IF($B101>=GoalEntryData!$D$6,1,0),\"\")))","v":""},"",null,null,null,{"$f":"IF($M101=\"\",\"\",IF(GoalEntryData!$C$10=\"<=\",IF($M101<=GoalEntryData!$D$10,1,0),IF(GoalEntryData!$C$10=\">=\",IF($M101>=GoalEntryData!$D$10,1,0),\"\")))","v":""},"",{"$f":"IF($M101=\"\",\"\",IF(GoalEntryData!$C$11=\"<=\",IF($M101<=GoalEntryData!$D$11,1,0),IF(GoalEntryData!$C$11=\">=\",IF($M101>=GoalEntryData!$D$11,1,0),\"\")))","v":""},"",{"$f":"IF($M101=\"\",\"\",IF(GoalEntryData!$C$12=\"<=\",IF($M101<=GoalEntryData!$D$12,1,0),IF(GoalEntryData!$C$10=\">=\",IF($M101>=GoalEntryData!$D$12,1,0),\"\")))","v":""},"",{"$f":"IF($M101=\"\",\"\",IF(GoalEntryData!$C$10=\"<=\",IF($M101<=GoalEntryData!$D$10,1,0),IF(GoalEntryData!$C$10=\">=\",IF($M101>=GoalEntryData!$D$10,1,0),\"\")))","v":""},""]
[null,null,null,{"$f":"IF($B102=\"\",\"\",IF(GoalEntryData!$C$6=\"<=\",IF($B102<=GoalEntryData!$D$6,1,0),IF(GoalEntryData!$C$6=\">=\",IF($B102>=GoalEntryData!$D$6,1,0),\"\")))","v":""},"",{"$f":"IF($B102=\"\",\"\",IF(GoalEntryData!$C$7=\"<=\",IF($B102<=GoalEntryData!$D$7,1,0),IF(GoalEntryData!$C$7=\">=\",IF($B102>=GoalEntryData!$D$7,1,0),\"\")))","v":""},"",{"$f":"IF($B102=\"\",\"\",IF(GoalEntryData!$C$8=\"<=\",IF($B102<=GoalEntryData!$D$8,1,0),IF(GoalEntryData!$C$8=\">=\",IF($B102>=GoalEntryData!$D$8,1,0),\"\")))","v":""},"",{"$f":"IF($B102=\"\",\"\",IF(GoalEntryData!$C$6=\"<=\",IF($B102<=GoalEntryData!$D$6,1,0),IF(GoalEntryData!$C$6=\">=\",IF($B102>=GoalEntryData!$D$6,1,0),\"\")))","v":""},"",null,null,null,{"$f":"IF($M102=\"\",\"\",IF(GoalEntryData!$C$10=\"<=\",IF($M102<=GoalEntryData!$D$10,1,0),IF(GoalEntryData!$C$10=\">=\",IF($M102>=GoalEntryData!$D$10,1,0),\"\")))","v":""},"",{"$f":"IF($M102=\"\",\"\",IF(GoalEntryData!$C$11=\"<=\",IF($M102<=GoalEntryData!$D$11,1,0),IF(GoalEntryData!$C$11=\">=\",IF($M102>=GoalEntryData!$D$11,1,0),\"\")))","v":""},"",{"$f":"IF($M102=\"\",\"\",IF(GoalEntryData!$C$12=\"<=\",IF($M102<=GoalEntryData!$D$12,1,0),IF(GoalEntryData!$C$10=\">=\",IF($M102>=GoalEntryData!$D$12,1,0),\"\")))","v":""},"",{"$f":"IF($M102=\"\",\"\",IF(GoalEntryData!$C$10=\"<=\",IF($M102<=GoalEntryData!$D$10,1,0),IF(GoalEntryData!$C$10=\">=\",IF($M102>=GoalEntryData!$D$10,1,0),\"\")))","v":""},""]
[null,null,null,{"$f":"IF($B103=\"\",\"\",IF(GoalEntryData!$C$6=\"<=\",IF($B103<=GoalEntryData!$D$6,1,0),IF(GoalEntryData!$C$6=\">=\",IF($B103>=GoalEntryData!$D$6,1,0),\"\")))","v":""},"",{"$f":"IF($B103=\"\",\"\",IF(GoalEntryData!$C$7=\"<=\",IF($B103<=GoalEntryData!$D$7,1,0),IF(GoalEntryData!$C$7=\">=\",IF($B103>=GoalEntryData!$D$7,1,0),\"\")))","v":""},"",{"$f":"IF($B103=\"\",\"\",IF(GoalEntryData!$C$8=\"<=\",IF($B103<=GoalEntryData!$D$8,1,0),IF(GoalEntryData!$C$8=\">=\",IF($B103>=GoalEntryData!$D$8,1,0),\"\")))","v":""},"",{"$f":"IF($B103=\"\",\"\",IF(GoalEntryData!$C$6=\"<=\",IF($B103<=GoalEntryData!$D$6,1,0),IF(GoalEntryData!$C$6=\">=\",IF($B103>=GoalEntryData!$D$6,1,0),\"\")))","v":""},"",null,null,null,{"$f":"IF($M103=\"\",\"\",IF(GoalEntryData!$C$10=\"<=\",IF($M103<=GoalEntryData!$D$10,1,0),IF(GoalEntryData!$C$10=\">=\",IF($M103>=GoalEntryData!$D$10,1,0),\"\")))","v":""},"",{"$f":"IF($M103=\"\",\"\",IF(GoalEntryData!$C$11=\"<=\",IF($M103<=GoalEntryData!$D$11,1,0),IF(GoalEntryData!$C$11=\">=\",IF($M103>=GoalEntryData!$D$11,1,0),\"\")))","v":""},"",{"$f":"IF($M103=\"\",\"\",IF(GoalEntryData!$C$12=\"<=\",IF($M103<=GoalEntryData!$D$12,1,0),IF(GoalEntryData!$C$10=\">=\",IF($M103>=GoalEntryData!$D$12,1,0),\"\")))","v":""},"",{"$f":"IF($M103=\"\",\"\",IF(GoalEntryData!$C$10=\"<=\",IF($M103<=GoalEntryData!$D$10,1,0),IF(GoalEntryData!$C$10=\">=\",IF($M103>=GoalEntryData!$D$10,1,0),\"\")))","v":""},""]
[null,null,null,{"$f":"IF($B104=\"\",\"\",IF(GoalEntryData!$C$6=\"<=\",IF($B104<=GoalEntryData!$D$6,1,0),IF(GoalEntryData!$C$6=\">=\",IF($B104>=GoalEntryData!$D$6,1,0),\"\")))","v":""},"",{"$f":"IF($B104=\"\",\"\",IF(GoalEntryData!$C$7=\"<=\",IF($B104<=GoalEntryData!$D$7,1,0),IF(GoalEntryData!$C$7=\">=\",IF($B104>=GoalEntryData!$D$7,1,0),\"\")))","v":""},"",{"$f":"IF($B104=\"\",\"\",IF(GoalEntryData!$C$8=\"<=\",IF($B104<=GoalEntryData!$D$8,1,0),IF(GoalEntryData!$C$8=\">=\",IF($B104>=GoalEntryData!$D$8,1,0),\"\")))","v":""},"",{"$f":"IF($B104=\"\",\"\",IF(GoalEntryData!$C$6=\"<=\",IF($B104<=GoalEntryData!$D$6,1,0),IF(GoalEntryData!$C$6=\">=\",IF($B104>=GoalEntryData!$D$6,1,0),\"\")))","v":""},"",null,null,null,{"$f":"IF($M104=\"\",\"\",IF(GoalEntryData!$C$10=\"<=\",IF($M104<=GoalEntryData!$D$10,1,0),IF(GoalEntryData!$C$10=\">=\",IF($M104>=GoalEntryData!$D$10,1,0),\"\")))","v":""},"",{"$f":"IF($M104=\"\",\"\",IF(GoalEntryData!$C$11=\"<=\",IF($M104<=GoalEntryData!$D$11,1,0),IF(GoalEntryData!$C$11=\">=\",IF($M104>=GoalEntryData!$D$11,1,0),\"\")))","v":""},"",{"$f":"IF($M104=\"\",\"\",IF(GoalEntryData!$C$12=\"<=\",IF($M104<=GoalEntryData!$D$12,1,0),IF(GoalEntryData!$C$10=\">=\",IF($M104>=GoalEntryData!$D$12,1,0),\"\")))","v":""},"",{"$f":"IF($M104=\"\",\"\",IF(GoalEntryData!$C$10=\"<=\",IF($M104<=GoalEntryData!$D$10,1,0),IF(GoalEntryData!$C$10=\">=\",IF($M104>=GoalEntryData!$D$10,1,0),\"\")))","v":""},""]
[null,null,null,{"$f":"IF($B105=\"\",\"\",IF(GoalEntryData!$C$6=\"<=\",IF($B105<=GoalEntryData!$D$6,1,0),IF(GoalEntryData!$C$6=\">=\",IF($B105>=GoalEntryData!$D$6,1,0),\"\")))","v":""},"",{"$f":"IF($B105=\"\",\"\",IF(GoalEntryData!$C$7=\"<=\",IF($B105<=GoalEntryData!$D$7,1,0),IF(GoalEntryData!$C$7=\">=\",IF($B105>=GoalEntryData!$D$7,1,0),\"\")))","v":""},"",{"$f":"IF($B105=\"\",\"\",IF(GoalEntryData!$C$8=\"<=\",IF($B105<=GoalEntryData!$D$8,1,0),IF(GoalEntryData!$C$8=\">=\",IF($B105>=GoalEntryData!$D$8,1,0),\"\")))","v":""},"",{"$f":"IF($B105=\"\",\"\",IF(GoalEntryData!$C$6=\"<=\",IF($B105<=GoalEntryData!$D$6,1,0),IF(GoalEntryData!$C$6=\">=\",IF($B105>=GoalEntryData!$D$6,1,0),\"\")))","v":""},"",null,null,null,{"$f":"IF($M105=\"\",\"\",IF(GoalEntryData!$C$10=\"<=\",IF($M105<=GoalEntryData!$D$10,1,0),IF(GoalEntryData!$C$10=\">=\",IF($M105>=GoalEntryData!$D$10,1,0),\"\")))","v":""},"",{"$f":"IF($M105=\"\",\"\",IF(GoalEntryData!$C$11=\"<=\",IF($M105<=GoalEntryData!$D$11,1,0),IF(GoalEntryData!$C$11=\">=\",IF($M105>=GoalEntryData!$D$11,1,0),\"\")))","v":""},"",{"$f":"IF($M105=\"\",\"\",IF(GoalEntryData!$C$12=\"<=\",IF($M105<=GoalEntryData!$D$12,1,0),IF(GoalEntryData!$C$10=\">=\",IF($M105>=GoalEntryData!$D$12,1,0),\"\")))","v":""},"",{"$f":"IF($M105=\"\",\"\",IF(GoalEntryData!$C$10=\"<=\",IF($M105<=GoalEntryData!$D$10,1,0),IF(GoalEntryData!$C$10=\">=\",IF($M105>=GoalEntryData!$D$10,1,0),\"\")))","v":""},""]
[null,null,null,{"$f":"IF($B106=\"\",\"\",IF(GoalEntryData!$C$6=\"<=\",IF($B106<=GoalEntryData!$D$6,1,0),IF(GoalEntryData!$C$6=\">=\",IF($B106>=GoalEntryData!$D$6,1,0),\"\")))","v":""},"",{"$f":"IF($B106=\"\",\"\",IF(GoalEntryData!$C$7=\"<=\",IF($B106<=GoalEntryData!$D$7,1,0),IF(GoalEntryData!$C$7=\">=\",IF($B106>=GoalEntryData!$D$7,1,0),\"\")))","v":""},"",{"$f":"IF($B106=\"\",\"\",IF(GoalEntryData!$C$8=\"<=\",IF($B106<=GoalEntryData!$D$8,1,0),IF(GoalEntryData!$C$8=\">=\",IF($B106>=GoalEntryData!$D$8,1,0),\"\")))","v":""},"",{"$f":"IF($B106=\"\",\"\",IF(GoalEntryData!$C$6=\"<=\",IF($B106<=GoalEntryData!$D$6,1,0),IF(GoalEntryData!$C$6=\">=\",IF($B106>=GoalEntryData!$D$6,1,0),\"\")))","v":""},"",null,null,null,{"$f":"IF($M106=\"\",\"\",IF(GoalEntryData!$C$10=\"<=\",IF($M106<=GoalEntryData!$D$10,1,0),IF(GoalEntryData!$C$10=\">=\",IF($M106>=GoalEntryData!$D$10,1,0),\"\")))","v":""},"",{"$f":"IF($M106=\"\",\"\",IF(GoalEntryData!$C$11=\"<=\",IF($M106<=GoalEntryData!$D$11,1,0),IF(GoalEntryData!$C$11=\">=\",IF($M106>=GoalEntryData!$D$11,1,0),\"\")))","v":""},"",{"$f":"IF($M106=\"\",\"\",IF(GoalEntryData!$C$12=\"<=\",IF($M106<=GoalEntryData!$D$12,1,0),IF(GoalEntryData!$C$10=\">=\",IF($M106>=GoalEntryData!$D$12,1,0),\"\")))","v":""},"",{"$f":"IF($M106=\"\",\"\",IF(GoalEntryData!$C$10=\"<=\",IF($M106<=GoalEntryData!$D$10,1,0),IF(GoalEntryData!$C$10=\">=\",IF($M106>=GoalEntryData!$D$10,1,0),\"\")))","v":""},""]
[null,null,null,{"$f":"IF($B107=\"\",\"\",IF(GoalEntryData!$C$6=\"<=\",IF($B107<=GoalEntryData!$D$6,1,0),IF(GoalEntryData!$C$6=\">=\",IF($B107>=GoalEntryData!$D$6,1,0),\"\")))","v":""},"",{"$f":"IF($B107=\"\",\"\",IF(GoalEntryData!$C$7=\"<=\",IF($B107<=GoalEntryData!$D$7,1,0),IF(GoalEntryData!$C$7=\">=\",IF($B107>=GoalEntryData!$D$7,1,0),\"\")))","v":""},"",{"$f":"IF($B107=\"\",\"\",IF(GoalEntryData!$C$8=\"<=\",IF($B107<=GoalEntryData!$D$8,1,0),IF(GoalEntryData!$C$8=\">=\",IF($B107>=GoalEntryData!$D$8,1,0),\"\")))","v":""},"",{"$f":"IF($B107=\"\",\"\",IF(GoalEntryData!$C$6=\"<=\",IF($B107<=GoalEntryData!$D$6,1,0),IF(GoalEntryData!$C$6=\">=\",IF($B107>=GoalEntryData!$D$6,1,0),\"\")))","v":""},"",null,null,null,{"$f":"IF($M107=\"\",\"\",IF(GoalEntryData!$C$10=\"<=\",IF($M107<=GoalEntryData!$D$10,1,0),IF(GoalEntryData!$C$10=\">=\",IF($M107>=GoalEntryData!$D$10,1,0),\"\")))","v":""},"",{"$f":"IF($M107=\"\",\"\",IF(GoalEntryData!$C$11=\"<=\",IF($M107<=GoalEntryData!$D$11,1,0),IF(GoalEntryData!$C$11=\">=\",IF($M107>=GoalEntryData!$D$11,1,0),\"\")))","v":""},"",{"$f":"IF($M107=\"\",\"\",IF(GoalEntryData!$C$12=\"<=\",IF($M107<=GoalEntryData!$D$12,1,0),IF(GoalEntryData!$C$10=\">=\",IF($M107>=GoalEntryData!$D$12,1,0),\"\")))","v":""},"",{"$f":"IF($M107=\"\",\"\",IF(GoalEntryData!$C$10=\"<=\",IF($M107<=GoalEntryData!$D$10,1,0),IF(GoalEntryData!$C$10=\">=\",IF($M107>=GoalEntryData!$D$10,1,0),\"\")))","v":""},""]
[null,null,null,{"$f":"IF($B108=\"\",\"\",IF(GoalEntryData!$C$6=\"<=\",IF($B108<=GoalEntryData!$D$6,1,0),IF(GoalEntryData!$C$6=\">=\",IF($B108>=GoalEntryData!$D$6,1,0),\"\")))","v":""},"",{"$f":"IF($B108=\"\",\"\",IF(GoalEntryData!$C$7=\"<=\",IF($B108<=GoalEntryData!$D$7,1,0),IF(GoalEntryData!$C$7=\">=\",IF($B108>=GoalEntryData!$D$7,1,0),\"\")))","v":""},"",{"$f":"IF($B108=\"\",\"\",IF(GoalEntryData!$C$8=\"<=\",IF($B108<=GoalEntryData!$D$8,1,0),IF(GoalEntryData!$C$8=\">=\",IF($B108>=GoalEntryData!$D$8,1,0),\"\")))","v":""},"",{"$f":"IF($B108=\"\",\"\",IF(GoalEntryData!$C$6=\"<=\",IF($B108<=GoalEntryData!$D$6,1,0),IF(GoalEntryData!$C$6=\">=\",IF($B108>=GoalEntryData!$D$6,1,0),\"\")))","v":""},"",null,null,null,{"$f":"IF($M108=\"\",\"\",IF(GoalEntryData!$C$10=\"<=\",IF($M108<=GoalEntryData!$D$10,1,0),IF(GoalEntryData!$C$10=\">=\",IF($M108>=GoalEntryData!$D$10,1,0),\"\")))","v":""},"",{"$f":"IF($M108=\"\",\"\",IF(GoalEntryData!$C$11=\"<=\",IF($M108<=GoalEntryData!$D$11,1,0),IF(GoalEntryData!$C$11=\">=\",IF($M108>=GoalEntryData!$D$11,1,0),\"\")))","v":""},"",{"$f":"IF($M108=\"\",\"\",IF(GoalEntryData!$C$12=\"<=\",IF($M108<=GoalEntryData!$D$12,1,0),IF(GoalEntryData!$C$10=\">=\",IF($M108>=GoalEntryData!$D$12,1,0),\"\")))","v":""},"",{"$f":"IF($M108=\"\",\"\",IF(GoalEntryData!$C$10=\"<=\",IF($M108<=GoalEntryData!$D$10,1,0),IF(GoalEntryData!$C$10=\">=\",IF($M108>=GoalEntryData!$D$10,1,0),\"\")))","v":""},""]
[null,null,null,{"$f":"IF($B109=\"\",\"\",IF(GoalEntryData!$C$6=\"<=\",IF($B109<=GoalEntryData!$D$6,1,0),IF(GoalEntryData!$C$6=\">=\",IF($B109>=GoalEntryData!$D$6,1,0),\"\")))","v":""},"",{"$f":"IF($B109=\"\",\"\",IF(GoalEntryData!$C$7=\"<=\",IF($B109<=GoalEntryData!$D$7,1,0),IF(GoalEntryData!$C$7=\">=\",IF($B109>=GoalEntryData!$D$7,1,0),\"\")))","v":""},"",{"$f":"IF($B109=\"\",\"\",IF(GoalEntryData!$C$8=\"<=\",IF($B109<=GoalEntryData!$D$8,1,0),IF(GoalEntryData!$C$8=\">=\",IF($B109>=GoalEntryData!$D$8,1,0),\"\")))","v":""},"",{"$f":"IF($B109=\"\",\"\",IF(GoalEntryData!$C$6=\"<=\",IF($B109<=GoalEntryData!$D$6,1,0),IF(GoalEntryData!$C$6=\">=\",IF($B109>=GoalEntryData!$D$6,1,0),\"\")))","v":""},"",null,null,null,{"$f":"IF($M109=\"\",\"\",IF(GoalEntryData!$C$10=\"<=\",IF($M109<=GoalEntryData!$D$10,1,0),IF(GoalEntryData!$C$10=\">=\",IF($M109>=GoalEntryData!$D$10,1,0),\"\")))","v":""},"",{"$f":"IF($M109=\"\",\"\",IF(GoalEntryData!$C$11=\"<=\",IF($M109<=GoalEntryData!$D$11,1,0),IF(GoalEntryData!$C$11=\">=\",IF($M109>=GoalEntryData!$D$11,1,0),\"\")))","v":""},"",{"$f":"IF($M109=\"\",\"\",IF(GoalEntryData!$C$12=\"<=\",IF($M109<=GoalEntryData!$D$12,1,0),IF(GoalEntryData!$C$10=\">=\",IF($M109>=GoalEntryData!$D$12,1,0),\"\")))","v":""},"",{"$f":"IF($M109=\"\",\"\",IF(GoalEntryData!$C$10=\"<=\",IF($M109<=GoalEntryData!$D$10,1,0),IF(GoalEntryData!$C$10=\">=\",IF($M109>=GoalEntryData!$D$10,1,0),\"\")))","v":""},""]
[null,null,null,{"$f":"IF($B110=\"\",\"\",IF(GoalEntryData!$C$6=\"<=\",IF($B110<=GoalEntryData!$D$6,1,0),IF(GoalEntryData!$C$6=\">=\",IF($B110>=GoalEntryData!$D$6,1,0),\"\")))","v":""},"",{"$f":"IF($B110=\"\",\"\",IF(GoalEntryData!$C$7=\"<=\",IF($B110<=GoalEntryData!$D$7,1,0),IF(GoalEntryData!$C$7=\">=\",IF($B110>=GoalEntryData!$D$7,1,0),\"\")))","v":""},"",{"$f":"IF($B110=\"\",\"\",IF(GoalEntryData!$C$8=\"<=\",IF($B110<=GoalEntryData!$D$8,1,0),IF(GoalEntryData!$C$8=\">=\",IF($B110>=GoalEntryData!$D$8,1,0),\"\")))","v":""},"",{"$f":"IF($B110=\"\",\"\",IF(GoalEntryData!$C$6=\"<=\",IF($B110<=GoalEntryData!$D$6,1,0),IF(GoalEntryData!$C$6=\">=\",IF($B110>=GoalEntryData!$D$6,1,0),\"\")))","v":""},"",null,null,null,{"$f":"IF($M110=\"\",\"\",IF(GoalEntryData!$C$10=\"<=\",IF($M110<=GoalEntryData!$D$10,1,0),IF(GoalEntryData!$C$10=\">=\",IF($M110>=GoalEntryData!$D$10,1,0),\"\")))","v":""},"",{"$f":"IF($M110=\"\",\"\",IF(GoalEntryData!$C$11=\"<=\",IF($M110<=GoalEntryData!$D$11,1,0),IF(GoalEntryData!$C$11=\">=\",IF($M110>=GoalEntryData!$D$11,1,0),\"\")))","v":""},"",{"$f":"IF($M110=\"\",\"\",IF(GoalEntryData!$C$12=\"<=\",IF($M110<=GoalEntryData!$D$12,1,0),IF(GoalEntryData!$C$10=\">=\",IF($M110>=GoalEntryData!$D$12,1,0),\"\")))","v":""},"",{"$f":"IF($M110=\"\",\"\",IF(GoalEntryData!$C$10=\"<=\",IF($M110<=GoalEntryData!$D$10,1,0),IF(GoalEntryData!$C$10=\">=\",IF($M110>=GoalEntryData!$D$10,1,0),\"\")))","v":""},""]
[null,null,null,{"$f":"IF($B111=\"\",\"\",IF(GoalEntryData!$C$6=\"<=\",IF($B111<=GoalEntryData!$D$6,1,0),IF(GoalEntryData!$C$6=\">=\",IF($B111>=GoalEntryData!$D$6,1,0),\"\")))","v":""},"",{"$f":"IF($B111=\"\",\"\",IF(GoalEntryData!$C$7=\"<=\",IF($B111<=GoalEntryData!$D$7,1,0),IF(GoalEntryData!$C$7=\">=\",IF($B111>=GoalEntryData!$D$7,1,0),\"\")))","v":""},"",{"$f":"IF($B111=\"\",\"\",IF(GoalEntryData!$C$8=\"<=\",IF($B111<=GoalEntryData!$D$8,1,0),IF(GoalEntryData!$C$8=\">=\",IF($B111>=GoalEntryData!$D$8,1,0),\"\")))","v":""},"",{"$f":"IF($B111=\"\",\"\",IF(GoalEntryData!$C$6=\"<=\",IF($B111<=GoalEntryData!$D$6,1,0),IF(GoalEntryData!$C$6=\">=\",IF($B111>=GoalEntryData!$D$6,1,0),\"\")))","v":""},"",null,null,null,{"$f":"IF($M111=\"\",\"\",IF(GoalEntryData!$C$10=\"<=\",IF($M111<=GoalEntryData!$D$10,1,0),IF(GoalEntryData!$C$10=\">=\",IF($M111>=GoalEntryData!$D$10,1,0),\"\")))","v":""},"",{"$f":"IF($M111=\"\",\"\",IF(GoalEntryData!$C$11=\"<=\",IF($M111<=GoalEntryData!$D$11,1,0),IF(GoalEntryData!$C$11=\">=\",IF($M111>=GoalEntryData!$D$11,1,0),\"\")))","v":""},"",{"$f":"IF($M111=\"\",\"\",IF(GoalEntryData!$C$12=\"<=\",IF($M111<=GoalEntryData!$D$12,1,0),IF(GoalEntryData!$C$10=\">=\",IF($M111>=GoalEntryData!$D$12,1,0),\"\")))","v":""},"",{"$f":"IF($M111=\"\",\"\",IF(GoalEntryData!$C$10=\"<=\",IF($M111<=GoalEntryData!$D$10,1,0),IF(GoalEntryData!$C$10=\">=\",IF($M111>=GoalEntryData!$D$10,1,0),\"\")))","v":""},""]
[null,null,null,{"$f":"IF($B112=\"\",\"\",IF(GoalEntryData!$C$6=\"<=\",IF($B112<=GoalEntryData!$D$6,1,0),IF(GoalEntryData!$C$6=\">=\",IF($B112>=GoalEntryData!$D$6,1,0),\"\")))","v":""},"",{"$f":"IF($B112=\"\",\"\",IF(GoalEntryData!$C$7=\"<=\",IF($B112<=GoalEntryData!$D$7,1,0),IF(GoalEntryData!$C$7=\">=\",IF($B112>=GoalEntryData!$D$7,1,0),\"\")))","v":""},"",{"$f":"IF($B112=\"\",\"\",IF(GoalEntryData!$C$8=\"<=\",IF($B112<=GoalEntryData!$D$8,1,0),IF(GoalEntryData!$C$8=\">=\",IF($B112>=GoalEntryData!$D$8,1,0),\"\")))","v":""},"",{"$f":"IF($B112=\"\",\"\",IF(GoalEntryData!$C$6=\"<=\",IF($B112<=GoalEntryData!$D$6,1,0),IF(GoalEntryData!$C$6=\">=\",IF($B112>=GoalEntryData!$D$6,1,0),\"\")))","v":""},"",null,null,null,{"$f":"IF($M112=\"\",\"\",IF(GoalEntryData!$C$10=\"<=\",IF($M112<=GoalEntryData!$D$10,1,0),IF(GoalEntryData!$C$10=\">=\",IF($M112>=GoalEntryData!$D$10,1,0),\"\")))","v":""},"",{"$f":"IF($M112=\"\",\"\",IF(GoalEntryData!$C$11=\"<=\",IF($M112<=GoalEntryData!$D$11,1,0),IF(GoalEntryData!$C$11=\">=\",IF($M112>=GoalEntryData!$D$11,1,0),\"\")))","v":""},"",{"$f":"IF($M112=\"\",\"\",IF(GoalEntryData!$C$12=\"<=\",IF($M112<=GoalEntryData!$D$12,1,0),IF(GoalEntryData!$C$10=\">=\",IF($M112>=GoalEntryData!$D$12,1,0),\"\")))","v":""},"",{"$f":"IF($M112=\"\",\"\",IF(GoalEntryData!$C$10=\"<=\",IF($M112<=GoalEntryData!$D$10,1,0),IF(GoalEntryData!$C$10=\">=\",IF($M112>=GoalEntryData!$D$10,1,0),\"\")))","v":""},""]
[null,null,null,{"$f":"IF($B113=\"\",\"\",IF(GoalEntryData!$C$6=\"<=\",IF($B113<=GoalEntryData!$D$6,1,0),IF(GoalEntryData!$C$6=\">=\",IF($B113>=GoalEntryData!$D$6,1,0),\"\")))","v":""},"",{"$f":"IF($B113=\"\",\"\",IF(GoalEntryData!$C$7=\"<=\",IF($B113<=GoalEntryData!$D$7,1,0),IF(GoalEntryData!$C$7=\">=\",IF($B113>=GoalEntryData!$D$7,1,0),\"\")))","v":""},"",{"$f":"IF($B113=\"\",\"\",IF(GoalEntryData!$C$8=\"<=\",IF($B113<=GoalEntryData!$D$8,1,0),IF(GoalEntryData!$C$8=\">=\",IF($B113>=GoalEntryData!$D$8,1,0),\"\")))","v":""},"",{"$f":"IF($B113=\"\",\"\",IF(GoalEntryData!$C$6=\"<=\",IF($B113<=GoalEntryData!$D$6,1,0),IF(GoalEntryData!$C$6=\">=\",IF($B113>=GoalEntryData!$D$6,1,0),\"\")))","v":""},"",null,null,null,{"$f":"IF($M113=\"\",\"\",IF(GoalEntryData!$C$10=\"<=\",IF($M113<=GoalEntryData!$D$10,1,0),IF(GoalEntryData!$C$10=\">=\",IF($M113>=GoalEntryData!$D$10,1,0),\"\")))","v":""},"",{"$f":"IF($M113=\"\",\"\",IF(GoalEntryData!$C$11=\"<=\",IF($M113<=GoalEntryData!$D$11,1,0),IF(GoalEntryData!$C$11=\">=\",IF($M113>=GoalEntryData!$D$11,1,0),\"\")))","v":""},"",{"$f":"IF($M113=\"\",\"\",IF(GoalEntryData!$C$12=\"<=\",IF($M113<=GoalEntryData!$D$12,1,0),IF(GoalEntryData!$C$10=\">=\",IF($M113>=GoalEntryData!$D$12,1,0),\"\")))","v":""},"",{"$f":"IF($M113=\"\",\"\",IF(GoalEntryData!$C$10=\"<=\",IF($M113<=GoalEntryData!$D$10,1,0),IF(GoalEntryData!$C$10=\">=\",IF($M113>=GoalEntryData!$D$10,1,0),\"\")))","v":""},""]
[null,null,null,{"$f":"IF($B114=\"\",\"\",IF(GoalEntryData!$C$6=\"<=\",IF($B114<=GoalEntryData!$D$6,1,0),IF(GoalEntryData!$C$6=\">=\",IF($B114>=GoalEntryData!$D$6,1,0),\"\")))","v":""},"",{"$f":"IF($B114=\"\",\"\",IF(GoalEntryData!$C$7=\"<=\",IF($B114<=GoalEntryData!$D$7,1,0),IF(GoalEntryData!$C$7=\">=\",IF($B114>=GoalEntryData!$D$7,1,0),\"\")))","v":""},"",{"$f":"IF($B114=\"\",\"\",IF(GoalEntryData!$C$8=\"<=\",IF($B114<=GoalEntryData!$D$8,1,0),IF(GoalEntryData!$C$8=\">=\",IF($B114>=GoalEntryData!$D$8,1,0),\"\")))","v":""},"",{"$f":"IF($B114=\"\",\"\",IF(GoalEntryData!$C$6=\"<=\",IF($B114<=GoalEntryData!$D$6,1,0),IF(GoalEntryData!$C$6=\">=\",IF($B114>=GoalEntryData!$D$6,1,0),\"\")))","v":""},"",null,null,null,{"$f":"IF($M114=\"\",\"\",IF(GoalEntryData!$C$10=\"<=\",IF($M114<=GoalEntryData!$D$10,1,0),IF(GoalEntryData!$C$10=\">=\",IF($M114>=GoalEntryData!$D$10,1,0),\"\")))","v":""},"",{"$f":"IF($M114=\"\",\"\",IF(GoalEntryData!$C$11=\"<=\",IF($M114<=GoalEntryData!$D$11,1,0),IF(GoalEntryData!$C$11=\">=\",IF($M114>=GoalEntryData!$D$11,1,0),\"\")))","v":""},"",{"$f":"IF($M114=\"\",\"\",IF(GoalEntryData!$C$12=\"<=\",IF($M114<=GoalEntryData!$D$12,1,0),IF(GoalEntryData!$C$10=\">=\",IF($M114>=GoalEntryData!$D$12,1,0),\"\")))","v":""},"",{"$f":"IF($M114=\"\",\"\",IF(GoalEntryData!$C$10=\"<=\",IF($M114<=GoalEntryData!$D$10,1,0),IF(GoalEntryData!$C$10=\">=\",IF($M114>=GoalEntryData!$D$10,1,0),\"\")))","v":""},""]
[null,null,null,{"$f":"IF($B115=\"\",\"\",IF(GoalEntryData!$C$6=\"<=\",IF($B115<=GoalEntryData!$D$6,1,0),IF(GoalEntryData!$C$6=\">=\",IF($B115>=GoalEntryData!$D$6,1,0),\"\")))","v":""},"",{"$f":"IF($B115=\"\",\"\",IF(GoalEntryData!$C$7=\"<=\",IF($B115<=GoalEntryData!$D$7,1,0),IF(GoalEntryData!$C$7=\">=\",IF($B115>=GoalEntryData!$D$7,1,0),\"\")))","v":""},"",{"$f":"IF($B115=\"\",\"\",IF(GoalEntryData!$C$8=\"<=\",IF($B115<=GoalEntryData!$D$8,1,0),IF(GoalEntryData!$C$8=\">=\",IF($B115>=GoalEntryData!$D$8,1,0),\"\")))","v":""},"",{"$f":"IF($B115=\"\",\"\",IF(GoalEntryData!$C$6=\"<=\",IF($B115<=GoalEntryData!$D$6,1,0),IF(GoalEntryData!$C$6=\">=\",IF($B115>=GoalEntryData!$D$6,1,0),\"\")))","v":""},"",null,null,null,{"$f":"IF($M115=\"\",\"\",IF(GoalEntryData!$C$10=\"<=\",IF($M115<=GoalEntryData!$D$10,1,0),IF(GoalEntryData!$C$10=\">=\",IF($M115>=GoalEntryData!$D$10,1,0),\"\")))","v":""},"",{"$f":"IF($M115=\"\",\"\",IF(GoalEntryData!$C$11=\"<=\",IF($M115<=GoalEntryData!$D$11,1,0),IF(GoalEntryData!$C$11=\">=\",IF($M115>=GoalEntryData!$D$11,1,0),\"\")))","v":""},"",{"$f":"IF($M115=\"\",\"\",IF(GoalEntryData!$C$12=\"<=\",IF($M115<=GoalEntryData!$D$12,1,0),IF(GoalEntryData!$C$10=\">=\",IF($M115>=GoalEntryData!$D$12,1,0),\"\")))","v":""},"",{"$f":"IF($M115=\"\",\"\",IF(GoalEntryData!$C$10=\"<=\",IF($M115<=GoalEntryData!$D$10,1,0),IF(GoalEntryData!$C$10=\">=\",IF($M115>=GoalEntryData!$D$10,1,0),\"\")))","v":""},""]
[null,null,null,{"$f":"IF($B116=\"\",\"\",IF(GoalEntryData!$C$6=\"<=\",IF($B116<=GoalEntryData!$D$6,1,0),IF(GoalEntryData!$C$6=\">=\",IF($B116>=GoalEntryData!$D$6,1,0),\"\")))","v":""},"",{"$f":"IF($B116=\"\",\"\",IF(GoalEntryData!$C$7=\"<=\",IF($B116<=GoalEntryData!$D$7,1,0),IF(GoalEntryData!$C$7=\">=\",IF($B116>=GoalEntryData!$D$7,1,0),\"\")))","v":""},"",{"$f":"IF($B116=\"\",\"\",IF(GoalEntryData!$C$8=\"<=\",IF($B116<=GoalEntryData!$D$8,1,0),IF(GoalEntryData!$C$8=\">=\",IF($B116>=GoalEntryData!$D$8,1,0),\"\")))","v":""},"",{"$f":"IF($B116=\"\",\"\",IF(GoalEntryData!$C$6=\"<=\",IF($B116<=GoalEntryData!$D$6,1,0),IF(GoalEntryData!$C$6=\">=\",IF($B116>=GoalEntryData!$D$6,1,0),\"\")))","v":""},"",null,null,null,{"$f":"IF($M116=\"\",\"\",IF(GoalEntryData!$C$10=\"<=\",IF($M116<=GoalEntryData!$D$10,1,0),IF(GoalEntryData!$C$10=\">=\",IF($M116>=GoalEntryData!$D$10,1,0),\"\")))","v":""},"",{"$f":"IF($M116=\"\",\"\",IF(GoalEntryData!$C$11=\"<=\",IF($M116<=GoalEntryData!$D$11,1,0),IF(GoalEntryData!$C$11=\">=\",IF($M116>=GoalEntryData!$D$11,1,0),\"\")))","v":""},"",{"$f":"IF($M116=\"\",\"\",IF(GoalEntryData!$C$12=\"<=\",IF($M116<=GoalEntryData!$D$12,1,0),IF(GoalEntryData!$C$10=\">=\",IF($M116>=GoalEntryData!$D$12,1,0),\"\")))","v":""},"",{"$f":"IF($M116=\"\",\"\",IF(GoalEntryData!$C$10=\"<=\",IF($M116<=GoalEntryData!$D$10,1,0),IF(GoalEntryData!$C$10=\">=\",IF($M116>=GoalEntryData!$D$10,1,0),\"\")))","v":""},""]
[null,null,null,{"$f":"IF($B117=\"\",\"\",IF(GoalEntryData!$C$6=\"<=\",IF($B117<=GoalEntryData!$D$6,1,0),IF(GoalEntryData!$C$6=\">=\",IF($B117>=GoalEntryData!$D$6,1,0),\"\")))","v":""},"",{"$f":"IF($B117=\"\",\"\",IF(GoalEntryData!$C$7=\"<=\",IF($B117<=GoalEntryData!$D$7,1,0),IF(GoalEntryData!$C$7=\">=\",IF($B117>=GoalEntryData!$D$7,1,0),\"\")))","v":""},"",{"$f":"IF($B117=\"\",\"\",IF(GoalEntryData!$C$8=\"<=\",IF($B117<=GoalEntryData!$D$8,1,0),IF(GoalEntryData!$C$8=\">=\",IF($B117>=GoalEntryData!$D$8,1,0),\"\")))","v":""},"",{"$f":"IF($B117=\"\",\"\",IF(GoalEntryData!$C$6=\"<=\",IF($B117<=GoalEntryData!$D$6,1,0),IF(GoalEntryData!$C$6=\">=\",IF($B117>=GoalEntryData!$D$6,1,0),\"\")))","v":""},"",null,null,null,{"$f":"IF($M117=\"\",\"\",IF(GoalEntryData!$C$10=\"<=\",IF($M117<=GoalEntryData!$D$10,1,0),IF(GoalEntryData!$C$10=\">=\",IF($M117>=GoalEntryData!$D$10,1,0),\"\")))","v":""},"",{"$f":"IF($M117=\"\",\"\",IF(GoalEntryData!$C$11=\"<=\",IF($M117<=GoalEntryData!$D$11,1,0),IF(GoalEntryData!$C$11=\">=\",IF($M117>=GoalEntryData!$D$11,1,0),\"\")))","v":""},"",{"$f":"IF($M117=\"\",\"\",IF(GoalEntryData!$C$12=\"<=\",IF($M117<=GoalEntryData!$D$12,1,0),IF(GoalEntryData!$C$10=\">=\",IF($M117>=GoalEntryData!$D$12,1,0),\"\")))","v":""},"",{"$f":"IF($M117=\"\",\"\",IF(GoalEntryData!$C$10=\"<=\",IF($M117<=GoalEntryData!$D$10,1,0),IF(GoalEntryData!$C$10=\">=\",IF($M117>=GoalEntryData!$D$10,1,0),\"\")))","v":""},""]
[null,null,null,{"$f":"IF($B118=\"\",\"\",IF(GoalEntryData!$C$6=\"<=\",IF($B118<=GoalEntryData!$D$6,1,0),IF(GoalEntryData!$C$6=\">=\",IF($B118>=GoalEntryData!$D$6,1,0),\"\")))","v":""},"",{"$f":"IF($B118=\"\",\"\",IF(GoalEntryData!$C$7=\"<=\",IF($B118<=GoalEntryData!$D$7,1,0),IF(GoalEntryData!$C$7=\">=\",IF($B118>=GoalEntryData!$D$7,1,0),\"\")))","v":""},"",{"$f":"IF($B118=\"\",\"\",IF(GoalEntryData!$C$8=\"<=\",IF($B118<=GoalEntryData!$D$8,1,0),IF(GoalEntryData!$C$8=\">=\",IF($B118>=GoalEntryData!$D$8,1,0),\"\")))","v":""},"",{"$f":"IF($B118=\"\",\"\",IF(GoalEntryData!$C$6=\"<=\",IF($B118<=GoalEntryData!$D$6,1,0),IF(GoalEntryData!$C$6=\">=\",IF($B118>=GoalEntryData!$D$6,1,0),\"\")))","v":""},"",null,null,null,{"$f":"IF($M118=\"\",\"\",IF(GoalEntryData!$C$10=\"<=\",IF($M118<=GoalEntryData!$D$10,1,0),IF(GoalEntryData!$C$10=\">=\",IF($M118>=GoalEntryData!$D$10,1,0),\"\")))","v":""},"",{"$f":"IF($M118=\"\",\"\",IF(GoalEntryData!$C$11=\"<=\",IF($M118<=GoalEntryData!$D$11,1,0),IF(GoalEntryData!$C$11=\">=\",IF($M118>=GoalEntryData!$D$11,1,0),\"\")))","v":""},"",{"$f":"IF($M118=\"\",\"\",IF(GoalEntryData!$C$12=\"<=\",IF($M118<=GoalEntryData!$D$12,1,0),IF(GoalEntryData!$C$10=\">=\",IF($M118>=GoalEntryData!$D$12,1,0),\"\")))","v":""},"",{"$f":"IF($M118=\"\",\"\",IF(GoalEntryData!$C$10=\"<=\",IF($M118<=GoalEntryData!$D$10,1,0),IF(GoalEntryData!$C$10=\">=\",IF($M118>=GoalEntryData!$D$10,1,0),\"\")))","v":""},""]
[null,null,null,{"$f":"IF($B119=\"\",\"\",IF(GoalEntryData!$C$6=\"<=\",IF($B119<=GoalEntryData!$D$6,1,0),IF(GoalEntryData!$C$6=\">=\",IF($B119>=GoalEntryData!$D$6,1,0),\"\")))","v":""},"",{"$f":"IF($B119=\"\",\"\",IF(GoalEntryData!$C$7=\"<=\",IF($B119<=GoalEntryData!$D$7,1,0),IF(GoalEntryData!$C$7=\">=\",IF($B119>=GoalEntryData!$D$7,1,0),\"\")))","v":""},"",{"$f":"IF($B119=\"\",\"\",IF(GoalEntryData!$C$8=\"<=\",IF($B119<=GoalEntryData!$D$8,1,0),IF(GoalEntryData!$C$8=\">=\",IF($B119>=GoalEntryData!$D$8,1,0),\"\")))","v":""},"",{"$f":"IF($B119=\"\",\"\",IF(GoalEntryData!$C$6=\"<=\",IF($B119<=GoalEntryData!$D$6,1,0),IF(GoalEntryData!$C$6=\">=\",IF($B119>=GoalEntryData!$D$6,1,0),\"\")))","v":""},"",null,null,null,{"$f":"IF($M119=\"\",\"\",IF(GoalEntryData!$C$10=\"<=\",IF($M119<=GoalEntryData!$D$10,1,0),IF(GoalEntryData!$C$10=\">=\",IF($M119>=GoalEntryData!$D$10,1,0),\"\")))","v":""},"",{"$f":"IF($M119=\"\",\"\",IF(GoalEntryData!$C$11=\"<=\",IF($M119<=GoalEntryData!$D$11,1,0),IF(GoalEntryData!$C$11=\">=\",IF($M119>=GoalEntryData!$D$11,1,0),\"\")))","v":""},"",{"$f":"IF($M119=\"\",\"\",IF(GoalEntryData!$C$12=\"<=\",IF($M119<=GoalEntryData!$D$12,1,0),IF(GoalEntryData!$C$10=\">=\",IF($M119>=GoalEntryData!$D$12,1,0),\"\")))","v":""},"",{"$f":"IF($M119=\"\",\"\",IF(GoalEntryData!$C$10=\"<=\",IF($M119<=GoalEntryData!$D$10,1,0),IF(GoalEntryData!$C$10=\">=\",IF($M119>=GoalEntryData!$D$10,1,0),\"\")))","v":""},""]
[null,null,null,{"$f":"IF($B120=\"\",\"\",IF(GoalEntryData!$C$6=\"<=\",IF($B120<=GoalEntryData!$D$6,1,0),IF(GoalEntryData!$C$6=\">=\",IF($B120>=GoalEntryData!$D$6,1,0),\"\")))","v":""},"",{"$f":"IF($B120=\"\",\"\",IF(GoalEntryData!$C$7=\"<=\",IF($B120<=GoalEntryData!$D$7,1,0),IF(GoalEntryData!$C$7=\">=\",IF($B120>=GoalEntryData!$D$7,1,0),\"\")))","v":""},"",{"$f":"IF($B120=\"\",\"\",IF(GoalEntryData!$C$8=\"<=\",IF($B120<=GoalEntryData!$D$8,1,0),IF(GoalEntryData!$C$8=\">=\",IF($B120>=GoalEntryData!$D$8,1,0),\"\")))","v":""},"",{"$f":"IF($B120=\"\",\"\",IF(GoalEntryData!$C$6=\"<=\",IF($B120<=GoalEntryData!$D$6,1,0),IF(GoalEntryData!$C$6=\">=\",IF($B120>=GoalEntryData!$D$6,1,0),\"\")))","v":""},"",null,null,null,{"$f":"IF($M120=\"\",\"\",IF(GoalEntryData!$C$10=\"<=\",IF($M120<=GoalEntryData!$D$10,1,0),IF(GoalEntryData!$C$10=\">=\",IF($M120>=GoalEntryData!$D$10,1,0),\"\")))","v":""},"",{"$f":"IF($M120=\"\",\"\",IF(GoalEntryData!$C$11=\"<=\",IF($M120<=GoalEntryData!$D$11,1,0),IF(GoalEntryData!$C$11=\">=\",IF($M120>=GoalEntryData!$D$11,1,0),\"\")))","v":""},"",{"$f":"IF($M120=\"\",\"\",IF(GoalEntryData!$C$12=\"<=\",IF($M120<=GoalEntryData!$D$12,1,0),IF(GoalEntryData!$C$10=\">=\",IF($M120>=GoalEntryData!$D$12,1,0),\"\")))","v":""},"",{"$f":"IF($M120=\"\",\"\",IF(GoalEntryData!$C$10=\"<=\",IF($M120<=GoalEntryData!$D$10,1,0),IF(GoalEntryData!$C$10=\">=\",IF($M120>=GoalEntryData!$D$10,1,0),\"\")))","v":""},""]
[null,null,null,{"$f":"IF($B121=\"\",\"\",IF(GoalEntryData!$C$6=\"<=\",IF($B121<=GoalEntryData!$D$6,1,0),IF(GoalEntryData!$C$6=\">=\",IF($B121>=GoalEntryData!$D$6,1,0),\"\")))","v":""},"",{"$f":"IF($B121=\"\",\"\",IF(GoalEntryData!$C$7=\"<=\",IF($B121<=GoalEntryData!$D$7,1,0),IF(GoalEntryData!$C$7=\">=\",IF($B121>=GoalEntryData!$D$7,1,0),\"\")))","v":""},"",{"$f":"IF($B121=\"\",\"\",IF(GoalEntryData!$C$8=\"<=\",IF($B121<=GoalEntryData!$D$8,1,0),IF(GoalEntryData!$C$8=\">=\",IF($B121>=GoalEntryData!$D$8,1,0),\"\")))","v":""},"",{"$f":"IF($B121=\"\",\"\",IF(GoalEntryData!$C$6=\"<=\",IF($B121<=GoalEntryData!$D$6,1,0),IF(GoalEntryData!$C$6=\">=\",IF($B121>=GoalEntryData!$D$6,1,0),\"\")))","v":""},"",null,null,null,{"$f":"IF($M121=\"\",\"\",IF(GoalEntryData!$C$10=\"<=\",IF($M121<=GoalEntryData!$D$10,1,0),IF(GoalEntryData!$C$10=\">=\",IF($M121>=GoalEntryData!$D$10,1,0),\"\")))","v":""},"",{"$f":"IF($M121=\"\",\"\",IF(GoalEntryData!$C$11=\"<=\",IF($M121<=GoalEntryData!$D$11,1,0),IF(GoalEntryData!$C$11=\">=\",IF($M121>=GoalEntryData!$D$11,1,0),\"\")))","v":""},"",{"$f":"IF($M121=\"\",\"\",IF(GoalEntryData!$C$12=\"<=\",IF($M121<=GoalEntryData!$D$12,1,0),IF(GoalEntryData!$C$10=\">=\",IF($M121>=GoalEntryData!$D$12,1,0),\"\")))","v":""},"",{"$f":"IF($M121=\"\",\"\",IF(GoalEntryData!$C$10=\"<=\",IF($M121<=GoalEntryData!$D$10,1,0),IF(GoalEntryData!$C$10=\">=\",IF($M121>=GoalEntryData!$D$10,1,0),\"\")))","v":""},""]
[null,null,null,{"$f":"IF($B122=\"\",\"\",IF(GoalEntryData!$C$6=\"<=\",IF($B122<=GoalEntryData!$D$6,1,0),IF(GoalEntryData!$C$6=\">=\",IF($B122>=GoalEntryData!$D$6,1,0),\"\")))","v":""},"",{"$f":"IF($B122=\"\",\"\",IF(GoalEntryData!$C$7=\"<=\",IF($B122<=GoalEntryData!$D$7,1,0),IF(GoalEntryData!$C$7=\">=\",IF($B122>=GoalEntryData!$D$7,1,0),\"\")))","v":""},"",{"$f":"IF($B122=\"\",\"\",IF(GoalEntryData!$C$8=\"<=\",IF($B122<=GoalEntryData!$D$8,1,0),IF(GoalEntryData!$C$8=\">=\",IF($B122>=GoalEntryData!$D$8,1,0),\"\")))","v":""},"",{"$f":"IF($B122=\"\",\"\",IF(GoalEntryData!$C$6=\"<=\",IF($B122<=GoalEntryData!$D$6,1,0),IF(GoalEntryData!$C$6=\">=\",IF($B122>=GoalEntryData!$D$6,1,0),\"\")))","v":""},"",null,null,null,{"$f":"IF($M122=\"\",\"\",IF(GoalEntryData!$C$10=\"<=\",IF($M122<=GoalEntryData!$D$10,1,0),IF(GoalEntryData!$C$10=\">=\",IF($M122>=GoalEntryData!$D$10,1,0),\"\")))","v":""},"",{"$f":"IF($M122=\"\",\"\",IF(GoalEntryData!$C$11=\"<=\",IF($M122<=GoalEntryData!$D$11,1,0),IF(GoalEntryData!$C$11=\">=\",IF($M122>=GoalEntryData!$D$11,1,0),\"\")))","v":""},"",{"$f":"IF($M122=\"\",\"\",IF(GoalEntryData!$C$12=\"<=\",IF($M122<=GoalEntryData!$D$12,1,0),IF(GoalEntryData!$C$10=\">=\",IF($M122>=GoalEntryData!$D$12,1,0),\"\")))","v":""},"",{"$f":"IF($M122=\"\",\"\",IF(GoalEntryData!$C$10=\"<=\",IF($M122<=GoalEntryData!$D$10,1,0),IF(GoalEntryData!$C$10=\">=\",IF($M122>=GoalEntryData!$D$10,1,0),\"\")))","v":""},""]
[null,null,null,{"$f":"IF($B123=\"\",\"\",IF(GoalEntryData!$C$6=\"<=\",IF($B123<=GoalEntryData!$D$6,1,0),IF(GoalEntryData!$C$6=\">=\",IF($B123>=GoalEntryData!$D$6,1,0),\"\")))","v":""},"",{"$f":"IF($B123=\"\",\"\",IF(GoalEntryData!$C$7=\"<=\",IF($B123<=GoalEntryData!$D$7,1,0),IF(GoalEntryData!$C$7=\">=\",IF($B123>=GoalEntryData!$D$7,1,0),\"\")))","v":""},"",{"$f":"IF($B123=\"\",\"\",IF(GoalEntryData!$C$8=\"<=\",IF($B123<=GoalEntryData!$D$8,1,0),IF(GoalEntryData!$C$8=\">=\",IF($B123>=GoalEntryData!$D$8,1,0),\"\")))","v":""},"",{"$f":"IF($B123=\"\",\"\",IF(GoalEntryData!$C$6=\"<=\",IF($B123<=GoalEntryData!$D$6,1,0),IF(GoalEntryData!$C$6=\">=\",IF($B123>=GoalEntryData!$D$6,1,0),\"\")))","v":""},"",null,null,null,{"$f":"IF($M123=\"\",\"\",IF(GoalEntryData!$C$10=\"<=\",IF($M123<=GoalEntryData!$D$10,1,0),IF(GoalEntryData!$C$10=\">=\",IF($M123>=GoalEntryData!$D$10,1,0),\"\")))","v":""},"",{"$f":"IF($M123=\"\",\"\",IF(GoalEntryData!$C$11=\"<=\",IF($M123<=GoalEntryData!$D$11,1,0),IF(GoalEntryData!$C$11=\">=\",IF($M123>=GoalEntryData!$D$11,1,0),\"\")))","v":""},"",{"$f":"IF($M123=\"\",\"\",IF(GoalEntryData!$C$12=\"<=\",IF($M123<=GoalEntryData!$D$12,1,0),IF(GoalEntryData!$C$10=\">=\",IF($M123>=GoalEntryData!$D$12,1,0),\"\")))","v":""},"",{"$f":"IF($M123=\"\",\"\",IF(GoalEntryData!$C$10=\"<=\",IF($M123<=GoalEntryData!$D$10,1,0),IF(GoalEntryData!$C$10=\">=\",IF($M123>=GoalEntryData!$D$10,1,0),\"\")))","v":""},""]
[null,null,null,{"$f":"IF($B124=\"\",\"\",IF(GoalEntryData!$C$6=\"<=\",IF($B124<=GoalEntryData!$D$6,1,0),IF(GoalEntryData!$C$6=\">=\",IF($B124>=GoalEntryData!$D$6,1,0),\"\")))","v":""},"",{"$f":"IF($B124=\"\",\"\",IF(GoalEntryData!$C$7=\"<=\",IF($B124<=GoalEntryData!$D$7,1,0),IF(GoalEntryData!$C$7=\">=\",IF($B124>=GoalEntryData!$D$7,1,0),\"\")))","v":""},"",{"$f":"IF($B124=\"\",\"\",IF(GoalEntryData!$C$8=\"<=\",IF($B124<=GoalEntryData!$D$8,1,0),IF(GoalEntryData!$C$8=\">=\",IF($B124>=GoalEntryData!$D$8,1,0),\"\")))","v":""},"",{"$f":"IF($B124=\"\",\"\",IF(GoalEntryData!$C$6=\"<=\",IF($B124<=GoalEntryData!$D$6,1,0),IF(GoalEntryData!$C$6=\">=\",IF($B124>=GoalEntryData!$D$6,1,0),\"\")))","v":""},"",null,null,null,{"$f":"IF($M124=\"\",\"\",IF(GoalEntryData!$C$10=\"<=\",IF($M124<=GoalEntryData!$D$10,1,0),IF(GoalEntryData!$C$10=\">=\",IF($M124>=GoalEntryData!$D$10,1,0),\"\")))","v":""},"",{"$f":"IF($M124=\"\",\"\",IF(GoalEntryData!$C$11=\"<=\",IF($M124<=GoalEntryData!$D$11,1,0),IF(GoalEntryData!$C$11=\">=\",IF($M124>=GoalEntryData!$D$11,1,0),\"\")))","v":""},"",{"$f":"IF($M124=\"\",\"\",IF(GoalEntryData!$C$12=\"<=\",IF($M124<=GoalEntryData!$D$12,1,0),IF(GoalEntryData!$C$10=\">=\",IF($M124>=GoalEntryData!$D$12,1,0),\"\")))","v":""},"",{"$f":"IF($M124=\"\",\"\",IF(GoalEntryData!$C$10=\"<=\",IF($M124<=GoalEntryData!$D$10,1,0),IF(GoalEntryData!$C$10=\">=\",IF($M124>=GoalEntryData!$D$10,1,0),\"\")))","v":""},""]
[null,null,null,{"$f":"IF($B125=\"\",\"\",IF(GoalEntryData!$C$6=\"<=\",IF($B125<=GoalEntryData!$D$6,1,0),IF(GoalEntryData!$C$6=\">=\",IF($B125>=GoalEntryData!$D$6,1,0),\"\")))","v":""},"",{"$f":"IF($B125=\"\",\"\",IF(GoalEntryData!$C$7=\"<=\",IF($B125<=GoalEntryData!$D$7,1,0),IF(GoalEntryData!$C$7=\">=\",IF($B125>=GoalEntryData!$D$7,1,0),\"\")))","v":""},"",{"$f":"IF($B125=\"\",\"\",IF(GoalEntryData!$C$8=\"<=\",IF($B125<=GoalEntryData!$D$8,1,0),IF(GoalEntryData!$C$8=\">=\",IF($B125>=GoalEntryData!$D$8,1,0),\"\")))","v":""},"",{"$f":"IF($B125=\"\",\"\",IF(GoalEntryData!$C$6=\"<=\",IF($B125<=GoalEntryData!$D$6,1,0),IF(GoalEntryData!$C$6=\">=\",IF($B125>=GoalEntryData!$D$6,1,0),\"\")))","v":""},"",null,null,null,{"$f":"IF($M125=\"\",\"\",IF(GoalEntryData!$C$10=\"<=\",IF($M125<=GoalEntryData!$D$10,1,0),IF(GoalEntryData!$C$10=\">=\",IF($M125>=GoalEntryData!$D$10,1,0),\"\")))","v":""},"",{"$f":"IF($M125=\"\",\"\",IF(GoalEntryData!$C$11=\"<=\",IF($M125<=GoalEntryData!$D$11,1,0),IF(GoalEntryData!$C$11=\">=\",IF($M125>=GoalEntryData!$D$11,1,0),\"\")))","v":""},"",{"$f":"IF($M125=\"\",\"\",IF(GoalEntryData!$C$12=\"<=\",IF($M125<=GoalEntryData!$D$12,1,0),IF(GoalEntryData!$C$10=\">=\",IF($M125>=GoalEntryData!$D$12,1,0),\"\")))","v":""},"",{"$f":"IF($M125=\"\",\"\",IF(GoalEntryData!$C$10=\"<=\",IF($M125<=GoalEntryData!$D$10,1,0),IF(GoalEntryData!$C$10=\">=\",IF($M125>=GoalEntryData!$D$10,1,0),\"\")))","v":""},""]
[null,null,null,{"$f":"IF($B126=\"\",\"\",IF(GoalEntryData!$C$6=\"<=\",IF($B126<=GoalEntryData!$D$6,1,0),IF(GoalEntryData!$C$6=\">=\",IF($B126>=GoalEntryData!$D$6,1,0),\"\")))","v":""},"",{"$f":"IF($B126=\"\",\"\",IF(GoalEntryData!$C$7=\"<=\",IF($B126<=GoalEntryData!$D$7,1,0),IF(GoalEntryData!$C$7=\">=\",IF($B126>=GoalEntryData!$D$7,1,0),\"\")))","v":""},"",{"$f":"IF($B126=\"\",\"\",IF(GoalEntryData!$C$8=\"<=\",IF($B126<=GoalEntryData!$D$8,1,0),IF(GoalEntryData!$C$8=\">=\",IF($B126>=GoalEntryData!$D$8,1,0),\"\")))","v":""},"",{"$f":"IF($B126=\"\",\"\",IF(GoalEntryData!$C$6=\"<=\",IF($B126<=GoalEntryData!$D$6,1,0),IF(GoalEntryData!$C$6=\">=\",IF($B126>=GoalEntryData!$D$6,1,0),\"\")))","v":""},"",null,null,null,{"$f":"IF($M126=\"\",\"\",IF(GoalEntryData!$C$10=\"<=\",IF($M126<=GoalEntryData!$D$10,1,0),IF(GoalEntryData!$C$10=\">=\",IF($M126>=GoalEntryData!$D$10,1,0),\"\")))","v":""},"",{"$f":"IF($M126=\"\",\"\",IF(GoalEntryData!$C$11=\"<=\",IF($M126<=GoalEntryData!$D$11,1,0),IF(GoalEntryData!$C$11=\">=\",IF($M126>=GoalEntryData!$D$11,1,0),\"\")))","v":""},"",{"$f":"IF($M126=\"\",\"\",IF(GoalEntryData!$C$12=\"<=\",IF($M126<=GoalEntryData!$D$12,1,0),IF(GoalEntryData!$C$10=\">=\",IF($M126>=GoalEntryData!$D$12,1,0),\"\")))","v":""},"",{"$f":"IF($M126=\"\",\"\",IF(GoalEntryData!$C$10=\"<=\",IF($M126<=GoalEntryData!$D$10,1,0),IF(GoalEntryData!$C$10=\">=\",IF($M126>=GoalEntryData!$D$10,1,0),\"\")))","v":""},""]
[null,null,null,{"$f":"IF($B127=\"\",\"\",IF(GoalEntryData!$C$6=\"<=\",IF($B127<=GoalEntryData!$D$6,1,0),IF(GoalEntryData!$C$6=\">=\",IF($B127>=GoalEntryData!$D$6,1,0),\"\")))","v":""},"",{"$f":"IF($B127=\"\",\"\",IF(GoalEntryData!$C$7=\"<=\",IF($B127<=GoalEntryData!$D$7,1,0),IF(GoalEntryData!$C$7=\">=\",IF($B127>=GoalEntryData!$D$7,1,0),\"\")))","v":""},"",{"$f":"IF($B127=\"\",\"\",IF(GoalEntryData!$C$8=\"<=\",IF($B127<=GoalEntryData!$D$8,1,0),IF(GoalEntryData!$C$8=\">=\",IF($B127>=GoalEntryData!$D$8,1,0),\"\")))","v":""},"",{"$f":"IF($B127=\"\",\"\",IF(GoalEntryData!$C$6=\"<=\",IF($B127<=GoalEntryData!$D$6,1,0),IF(GoalEntryData!$C$6=\">=\",IF($B127>=GoalEntryData!$D$6,1,0),\"\")))","v":""},"",null,null,null,{"$f":"IF($M127=\"\",\"\",IF(GoalEntryData!$C$10=\"<=\",IF($M127<=GoalEntryData!$D$10,1,0),IF(GoalEntryData!$C$10=\">=\",IF($M127>=GoalEntryData!$D$10,1,0),\"\")))","v":""},"",{"$f":"IF($M127=\"\",\"\",IF(GoalEntryData!$C$11=\"<=\",IF($M127<=GoalEntryData!$D$11,1,0),IF(GoalEntryData!$C$11=\">=\",IF($M127>=GoalEntryData!$D$11,1,0),\"\")))","v":""},"",{"$f":"IF($M127=\"\",\"\",IF(GoalEntryData!$C$12=\"<=\",IF($M127<=GoalEntryData!$D$12,1,0),IF(GoalEntryData!$C$10=\">=\",IF($M127>=GoalEntryData!$D$12,1,0),\"\")))","v":""},"",{"$f":"IF($M127=\"\",\"\",IF(GoalEntryData!$C$10=\"<=\",IF($M127<=GoalEntryData!$D$10,1,0),IF(GoalEntryData!$C$10=\">=\",IF($M127>=GoalEntryData!$D$10,1,0),\"\")))","v":""},""]
[null,null,null,{"$f":"IF($B128=\"\",\"\",IF(GoalEntryData!$C$6=\"<=\",IF($B128<=GoalEntryData!$D$6,1,0),IF(GoalEntryData!$C$6=\">=\",IF($B128>=GoalEntryData!$D$6,1,0),\"\")))","v":""},"",{"$f":"IF($B128=\"\",\"\",IF(GoalEntryData!$C$7=\"<=\",IF($B128<=GoalEntryData!$D$7,1,0),IF(GoalEntryData!$C$7=\">=\",IF($B128>=GoalEntryData!$D$7,1,0),\"\")))","v":""},"",{"$f":"IF($B128=\"\",\"\",IF(GoalEntryData!$C$8=\"<=\",IF($B128<=GoalEntryData!$D$8,1,0),IF(GoalEntryData!$C$8=\">=\",IF($B128>=GoalEntryData!$D$8,1,0),\"\")))","v":""},"",{"$f":"IF($B128=\"\",\"\",IF(GoalEntryData!$C$6=\"<=\",IF($B128<=GoalEntryData!$D$6,1,0),IF(GoalEntryData!$C$6=\">=\",IF($B128>=GoalEntryData!$D$6,1,0),\"\")))","v":""},"",null,null,null,{"$f":"IF($M128=\"\",\"\",IF(GoalEntryData!$C$10=\"<=\",IF($M128<=GoalEntryData!$D$10,1,0),IF(GoalEntryData!$C$10=\">=\",IF($M128>=GoalEntryData!$D$10,1,0),\"\")))","v":""},"",{"$f":"IF($M128=\"\",\"\",IF(GoalEntryData!$C$11=\"<=\",IF($M128<=GoalEntryData!$D$11,1,0),IF(GoalEntryData!$C$11=\">=\",IF($M128>=GoalEntryData!$D$11,1,0),\"\")))","v":""},"",{"$f":"IF($M128=\"\",\"\",IF(GoalEntryData!$C$12=\"<=\",IF($M128<=GoalEntryData!$D$12,1,0),IF(GoalEntryData!$C$10=\">=\",IF($M128>=GoalEntryData!$D$12,1,0),\"\")))","v":""},"",{"$f":"IF($M128=\"\",\"\",IF(GoalEntryData!$C$10=\"<=\",IF($M128<=GoalEntryData!$D$10,1,0),IF(GoalEntryData!$C$10=\">=\",IF($M128>=GoalEntryData!$D$10,1,0),\"\")))","v":""},""]
[null,null,null,{"$f":"IF($B129=\"\",\"\",IF(GoalEntryData!$C$6=\"<=\",IF($B129<=GoalEntryData!$D$6,1,0),IF(GoalEntryData!$C$6=\">=\",IF($B129>=GoalEntryData!$D$6,1,0),\"\")))","v":""},"",{"$f":"IF($B129=\"\",\"\",IF(GoalEntryData!$C$7=\"<=\",IF($B129<=GoalEntryData!$D$7,1,0),IF(GoalEntryData!$C$7=\">=\",IF($B129>=GoalEntryData!$D$7,1,0),\"\")))","v":""},"",{"$f":"IF($B129=\"\",\"\",IF(GoalEntryData!$C$8=\"<=\",IF($B129<=GoalEntryData!$D$8,1,0),IF(GoalEntryData!$C$8=\">=\",IF($B129>=GoalEntryData!$D$8,1,0),\"\")))","v":""},"",{"$f":"IF($B129=\"\",\"\",IF(GoalEntryData!$C$6=\"<=\",IF($B129<=GoalEntryData!$D$6,1,0),IF(GoalEntryData!$C$6=\">=\",IF($B129>=GoalEntryData!$D$6,1,0),\"\")))","v":""},"",null,null,null,{"$f":"IF($M129=\"\",\"\",IF(GoalEntryData!$C$10=\"<=\",IF($M129<=GoalEntryData!$D$10,1,0),IF(GoalEntryData!$C$10=\">=\",IF($M129>=GoalEntryData!$D$10,1,0),\"\")))","v":""},"",{"$f":"IF($M129=\"\",\"\",IF(GoalEntryData!$C$11=\"<=\",IF($M129<=GoalEntryData!$D$11,1,0),IF(GoalEntryData!$C$11=\">=\",IF($M129>=GoalEntryData!$D$11,1,0),\"\")))","v":""},"",{"$f":"IF($M129=\"\",\"\",IF(GoalEntryData!$C$12=\"<=\",IF($M129<=GoalEntryData!$D$12,1,0),IF(GoalEntryData!$C$10=\">=\",IF($M129>=GoalEntryData!$D$12,1,0),\"\")))","v":""},"",{"$f":"IF($M129=\"\",\"\",IF(GoalEntryData!$C$10=\"<=\",IF($M129<=GoalEntryData!$D$10,1,0),IF(GoalEntryData!$C$10=\">=\",IF($M129>=GoalEntryData!$D$10,1,0),\"\")))","v":""},""]
[null,null,null,{"$f":"IF($B130=\"\",\"\",IF(GoalEntryData!$C$6=\"<=\",IF($B130<=GoalEntryData!$D$6,1,0),IF(GoalEntryData!$C$6=\">=\",IF($B130>=GoalEntryData!$D$6,1,0),\"\")))","v":""},"",{"$f":"IF($B130=\"\",\"\",IF(GoalEntryData!$C$7=\"<=\",IF($B130<=GoalEntryData!$D$7,1,0),IF(GoalEntryData!$C$7=\">=\",IF($B130>=GoalEntryData!$D$7,1,0),\"\")))","v":""},"",{"$f":"IF($B130=\"\",\"\",IF(GoalEntryData!$C$8=\"<=\",IF($B130<=GoalEntryData!$D$8,1,0),IF(GoalEntryData!$C$8=\">=\",IF($B130>=GoalEntryData!$D$8,1,0),\"\")))","v":""},"",{"$f":"IF($B130=\"\",\"\",IF(GoalEntryData!$C$6=\"<=\",IF($B130<=GoalEntryData!$D$6,1,0),IF(GoalEntryData!$C$6=\">=\",IF($B130>=GoalEntryData!$D$6,1,0),\"\")))","v":""},"",null,null,null,{"$f":"IF($M130=\"\",\"\",IF(GoalEntryData!$C$10=\"<=\",IF($M130<=GoalEntryData!$D$10,1,0),IF(GoalEntryData!$C$10=\">=\",IF($M130>=GoalEntryData!$D$10,1,0),\"\")))","v":""},"",{"$f":"IF($M130=\"\",\"\",IF(GoalEntryData!$C$11=\"<=\",IF($M130<=GoalEntryData!$D$11,1,0),IF(GoalEntryData!$C$11=\">=\",IF($M130>=GoalEntryData!$D$11,1,0),\"\")))","v":""},"",{"$f":"IF($M130=\"\",\"\",IF(GoalEntryData!$C$12=\"<=\",IF($M130<=GoalEntryData!$D$12,1,0),IF(GoalEntryData!$C$10=\">=\",IF($M130>=GoalEntryData!$D$12,1,0),\"\")))","v":""},"",{"$f":"IF($M130=\"\",\"\",IF(GoalEntryData!$C$10=\"<=\",IF($M130<=GoalEntryData!$D$10,1,0),IF(GoalEntryData!$C$10=\">=\",IF($M130>=GoalEntryData!$D$10,1,0),\"\")))","v":""},""]
[null,null,null,{"$f":"IF($B131=\"\",\"\",IF(GoalEntryData!$C$6=\"<=\",IF($B131<=GoalEntryData!$D$6,1,0),IF(GoalEntryData!$C$6=\">=\",IF($B131>=GoalEntryData!$D$6,1,0),\"\")))","v":""},"",{"$f":"IF($B131=\"\",\"\",IF(GoalEntryData!$C$7=\"<=\",IF($B131<=GoalEntryData!$D$7,1,0),IF(GoalEntryData!$C$7=\">=\",IF($B131>=GoalEntryData!$D$7,1,0),\"\")))","v":""},"",{"$f":"IF($B131=\"\",\"\",IF(GoalEntryData!$C$8=\"<=\",IF($B131<=GoalEntryData!$D$8,1,0),IF(GoalEntryData!$C$8=\">=\",IF($B131>=GoalEntryData!$D$8,1,0),\"\")))","v":""},"",{"$f":"IF($B131=\"\",\"\",IF(GoalEntryData!$C$6=\"<=\",IF($B131<=GoalEntryData!$D$6,1,0),IF(GoalEntryData!$C$6=\">=\",IF($B131>=GoalEntryData!$D$6,1,0),\"\")))","v":""},"",null,null,null,{"$f":"IF($M131=\"\",\"\",IF(GoalEntryData!$C$10=\"<=\",IF($M131<=GoalEntryData!$D$10,1,0),IF(GoalEntryData!$C$10=\">=\",IF($M131>=GoalEntryData!$D$10,1,0),\"\")))","v":""},"",{"$f":"IF($M131=\"\",\"\",IF(GoalEntryData!$C$11=\"<=\",IF($M131<=GoalEntryData!$D$11,1,0),IF(GoalEntryData!$C$11=\">=\",IF($M131>=GoalEntryData!$D$11,1,0),\"\")))","v":""},"",{"$f":"IF($M131=\"\",\"\",IF(GoalEntryData!$C$12=\"<=\",IF($M131<=GoalEntryData!$D$12,1,0),IF(GoalEntryData!$C$10=\">=\",IF($M131>=GoalEntryData!$D$12,1,0),\"\")))","v":""},"",{"$f":"IF($M131=\"\",\"\",IF(GoalEntryData!$C$10=\"<=\",IF($M131<=GoalEntryData!$D$10,1,0),IF(GoalEntryData!$C$10=\">=\",IF($M131>=GoalEntryData!$D$10,1,0),\"\")))","v":""},""]
[null,null,null,{"$f":"IF($B132=\"\",\"\",IF(GoalEntryData!$C$6=\"<=\",IF($B132<=GoalEntryData!$D$6,1,0),IF(GoalEntryData!$C$6=\">=\",IF($B132>=GoalEntryData!$D$6,1,0),\"\")))","v":""},{"$f":"IF(AND(E131>=1,D132=1),E131+1,D132)","v":""},{"$f":"IF($B132=\"\",\"\",IF(GoalEntryData!$C$7=\"<=\",IF($B132<=GoalEntryData!$D$7,1,0),IF(GoalEntryData!$C$7=\">=\",IF($B132>=GoalEntryData!$D$7,1,0),\"\")))","v":""},{"$f":"IF(AND(G131>=1,F132=1),G131+1,F132)","v":""},{"$f":"IF($B132=\"\",\"\",IF(GoalEntryData!$C$8=\"<=\",IF($B132<=GoalEntryData!$D$8,1,0),IF(GoalEntryData!$C$8=\">=\",IF($B132>=GoalEntryData!$D$8,1,0),\"\")))","v":""},{"$f":"IF(AND(I131>=1,H132=1),I131+1,H132)","v":""},{"$f":"IF($B132=\"\",\"\",IF(GoalEntryData!$C$6=\"<=\",IF($B132<=GoalEntryData!$D$6,1,0),IF(GoalEntryData!$C$6=\">=\",IF($B132>=GoalEntryData!$D$6,1,0),\"\")))","v":""},{"$f":"IF(AND(K131>=1,J132=1),K131+1,J132)","v":""},null,null,null,{"$f":"IF($M132=\"\",\"\",IF(GoalEntryData!$C$10=\"<=\",IF($M132<=GoalEntryData!$D$10,1,0),IF(GoalEntryData!$C$10=\">=\",IF($M132>=GoalEntryData!$D$10,1,0),\"\")))","v":""},{"$f":"IF(AND(P131>=1,O132=1),P131+1,O132)","v":""},{"$f":"IF($M132=\"\",\"\",IF(GoalEntryData!$C$11=\"<=\",IF($M132<=GoalEntryData!$D$11,1,0),IF(GoalEntryData!$C$11=\">=\",IF($M132>=GoalEntryData!$D$11,1,0),\"\")))","v":""},{"$f":"IF(AND(R131>=1,Q132=1),R131+1,Q132)","v":""},{"$f":"IF($M132=\"\",\"\",IF(GoalEntryData!$C$12=\"<=\",IF($M132<=GoalEntryData!$D$12,1,0),IF(GoalEntryData!$C$10=\">=\",IF($M132>=GoalEntryData!$D$12,1,0),\"\")))","v":""},{"$f":"IF(AND(T131>=1,S132=1),T131+1,S132)","v":""},{"$f":"IF($M132=\"\",\"\",IF(GoalEntryData!$C$10=\"<=\",IF($M132<=GoalEntryData!$D$10,1,0),IF(GoalEntryData!$C$10=\">=\",IF($M132>=GoalEntryData!$D$10,1,0),\"\")))","v":""},{"$f":"IF(AND(V131>=1,U132=1),V131+1,U132)","v":""}]
[null,null,null,{"$f":"IF($B133=\"\",\"\",IF(GoalEntryData!$C$6=\"<=\",IF($B133<=GoalEntryData!$D$6,1,0),IF(GoalEntryData!$C$6=\">=\",IF($B133>=GoalEntryData!$D$6,1,0),\"\")))","v":""},"",{"$f":"IF($B133=\"\",\"\",IF(GoalEntryData!$C$7=\"<=\",IF($B133<=GoalEntryData!$D$7,1,0),IF(GoalEntryData!$C$7=\">=\",IF($B133>=GoalEntryData!$D$7,1,0),\"\")))","v":""},"",{"$f":"IF($B133=\"\",\"\",IF(GoalEntryData!$C$8=\"<=\",IF($B133<=GoalEntryData!$D$8,1,0),IF(GoalEntryData!$C$8=\">=\",IF($B133>=GoalEntryData!$D$8,1,0),\"\")))","v":""},"",{"$f":"IF($B133=\"\",\"\",IF(GoalEntryData!$C$6=\"<=\",IF($B133<=GoalEntryData!$D$6,1,0),IF(GoalEntryData!$C$6=\">=\",IF($B133>=GoalEntryData!$D$6,1,0),\"\")))","v":""},"",null,null,null,{"$f":"IF($M133=\"\",\"\",IF(GoalEntryData!$C$10=\"<=\",IF($M133<=GoalEntryData!$D$10,1,0),IF(GoalEntryData!$C$10=\">=\",IF($M133>=GoalEntryData!$D$10,1,0),\"\")))","v":""},"",{"$f":"IF($M133=\"\",\"\",IF(GoalEntryData!$C$11=\"<=\",IF($M133<=GoalEntryData!$D$11,1,0),IF(GoalEntryData!$C$11=\">=\",IF($M133>=GoalEntryData!$D$11,1,0),\"\")))","v":""},"",{"$f":"IF($M133=\"\",\"\",IF(GoalEntryData!$C$12=\"<=\",IF($M133<=GoalEntryData!$D$12,1,0),IF(GoalEntryData!$C$10=\">=\",IF($M133>=GoalEntryData!$D$12,1,0),\"\")))","v":""},"",{"$f":"IF($M133=\"\",\"\",IF(GoalEntryData!$C$10=\"<=\",IF($M133<=GoalEntryData!$D$10,1,0),IF(GoalEntryData!$C$10=\">=\",IF($M133>=GoalEntryData!$D$10,1,0),\"\")))","v":""},""]
[null,null,null,{"$f":"IF($B134=\"\",\"\",IF(GoalEntryData!$C$6=\"<=\",IF($B134<=GoalEntryData!$D$6,1,0),IF(GoalEntryData!$C$6=\">=\",IF($B134>=GoalEntryData!$D$6,1,0),\"\")))","v":""},"",{"$f":"IF($B134=\"\",\"\",IF(GoalEntryData!$C$7=\"<=\",IF($B134<=GoalEntryData!$D$7,1,0),IF(GoalEntryData!$C$7=\">=\",IF($B134>=GoalEntryData!$D$7,1,0),\"\")))","v":""},"",{"$f":"IF($B134=\"\",\"\",IF(GoalEntryData!$C$8=\"<=\",IF($B134<=GoalEntryData!$D$8,1,0),IF(GoalEntryData!$C$8=\">=\",IF($B134>=GoalEntryData!$D$8,1,0),\"\")))","v":""},"",{"$f":"IF($B134=\"\",\"\",IF(GoalEntryData!$C$6=\"<=\",IF($B134<=GoalEntryData!$D$6,1,0),IF(GoalEntryData!$C$6=\">=\",IF($B134>=GoalEntryData!$D$6,1,0),\"\")))","v":""},"",null,null,null,{"$f":"IF($M134=\"\",\"\",IF(GoalEntryData!$C$10=\"<=\",IF($M134<=GoalEntryData!$D$10,1,0),IF(GoalEntryData!$C$10=\">=\",IF($M134>=GoalEntryData!$D$10,1,0),\"\")))","v":""},"",{"$f":"IF($M134=\"\",\"\",IF(GoalEntryData!$C$11=\"<=\",IF($M134<=GoalEntryData!$D$11,1,0),IF(GoalEntryData!$C$11=\">=\",IF($M134>=GoalEntryData!$D$11,1,0),\"\")))","v":""},"",{"$f":"IF($M134=\"\",\"\",IF(GoalEntryData!$C$12=\"<=\",IF($M134<=GoalEntryData!$D$12,1,0),IF(GoalEntryData!$C$10=\">=\",IF($M134>=GoalEntryData!$D$12,1,0),\"\")))","v":""},"",{"$f":"IF($M134=\"\",\"\",IF(GoalEntryData!$C$10=\"<=\",IF($M134<=GoalEntryData!$D$10,1,0),IF(GoalEntryData!$C$10=\">=\",IF($M134>=GoalEntryData!$D$10,1,0),\"\")))","v":""},""]
[null,null,null,{"$f":"IF($B135=\"\",\"\",IF(GoalEntryData!$C$6=\"<=\",IF($B135<=GoalEntryData!$D$6,1,0),IF(GoalEntryData!$C$6=\">=\",IF($B135>=GoalEntryData!$D$6,1,0),\"\")))","v":""},"",{"$f":"IF($B135=\"\",\"\",IF(GoalEntryData!$C$7=\"<=\",IF($B135<=GoalEntryData!$D$7,1,0),IF(GoalEntryData!$C$7=\">=\",IF($B135>=GoalEntryData!$D$7,1,0),\"\")))","v":""},"",{"$f":"IF($B135=\"\",\"\",IF(GoalEntryData!$C$8=\"<=\",IF($B135<=GoalEntryData!$D$8,1,0),IF(GoalEntryData!$C$8=\">=\",IF($B135>=GoalEntryData!$D$8,1,0),\"\")))","v":""},"",{"$f":"IF($B135=\"\",\"\",IF(GoalEntryData!$C$6=\"<=\",IF($B135<=GoalEntryData!$D$6,1,0),IF(GoalEntryData!$C$6=\">=\",IF($B135>=GoalEntryData!$D$6,1,0),\"\")))","v":""},"",null,null,null,{"$f":"IF($M135=\"\",\"\",IF(GoalEntryData!$C$10=\"<=\",IF($M135<=GoalEntryData!$D$10,1,0),IF(GoalEntryData!$C$10=\">=\",IF($M135>=GoalEntryData!$D$10,1,0),\"\")))","v":""},"",{"$f":"IF($M135=\"\",\"\",IF(GoalEntryData!$C$11=\"<=\",IF($M135<=GoalEntryData!$D$11,1,0),IF(GoalEntryData!$C$11=\">=\",IF($M135>=GoalEntryData!$D$11,1,0),\"\")))","v":""},"",{"$f":"IF($M135=\"\",\"\",IF(GoalEntryData!$C$12=\"<=\",IF($M135<=GoalEntryData!$D$12,1,0),IF(GoalEntryData!$C$10=\">=\",IF($M135>=GoalEntryData!$D$12,1,0),\"\")))","v":""},"",{"$f":"IF($M135=\"\",\"\",IF(GoalEntryData!$C$10=\"<=\",IF($M135<=GoalEntryData!$D$10,1,0),IF(GoalEntryData!$C$10=\">=\",IF($M135>=GoalEntryData!$D$10,1,0),\"\")))","v":""},""]
[null,null,null,{"$f":"IF($B136=\"\",\"\",IF(GoalEntryData!$C$6=\"<=\",IF($B136<=GoalEntryData!$D$6,1,0),IF(GoalEntryData!$C$6=\">=\",IF($B136>=GoalEntryData!$D$6,1,0),\"\")))","v":""},"",{"$f":"IF($B136=\"\",\"\",IF(GoalEntryData!$C$7=\"<=\",IF($B136<=GoalEntryData!$D$7,1,0),IF(GoalEntryData!$C$7=\">=\",IF($B136>=GoalEntryData!$D$7,1,0),\"\")))","v":""},"",{"$f":"IF($B136=\"\",\"\",IF(GoalEntryData!$C$8=\"<=\",IF($B136<=GoalEntryData!$D$8,1,0),IF(GoalEntryData!$C$8=\">=\",IF($B136>=GoalEntryData!$D$8,1,0),\"\")))","v":""},"",{"$f":"IF($B136=\"\",\"\",IF(GoalEntryData!$C$6=\"<=\",IF($B136<=GoalEntryData!$D$6,1,0),IF(GoalEntryData!$C$6=\">=\",IF($B136>=GoalEntryData!$D$6,1,0),\"\")))","v":""},"",null,null,null,{"$f":"IF($M136=\"\",\"\",IF(GoalEntryData!$C$10=\"<=\",IF($M136<=GoalEntryData!$D$10,1,0),IF(GoalEntryData!$C$10=\">=\",IF($M136>=GoalEntryData!$D$10,1,0),\"\")))","v":""},"",{"$f":"IF($M136=\"\",\"\",IF(GoalEntryData!$C$11=\"<=\",IF($M136<=GoalEntryData!$D$11,1,0),IF(GoalEntryData!$C$11=\">=\",IF($M136>=GoalEntryData!$D$11,1,0),\"\")))","v":""},"",{"$f":"IF($M136=\"\",\"\",IF(GoalEntryData!$C$12=\"<=\",IF($M136<=GoalEntryData!$D$12,1,0),IF(GoalEntryData!$C$10=\">=\",IF($M136>=GoalEntryData!$D$12,1,0),\"\")))","v":""},"",{"$f":"IF($M136=\"\",\"\",IF(GoalEntryData!$C$10=\"<=\",IF($M136<=GoalEntryData!$D$10,1,0),IF(GoalEntryData!$C$10=\">=\",IF($M136>=GoalEntryData!$D$10,1,0),\"\")))","v":""},""]
[null,null,null,{"$f":"IF($B137=\"\",\"\",IF(GoalEntryData!$C$6=\"<=\",IF($B137<=GoalEntryData!$D$6,1,0),IF(GoalEntryData!$C$6=\">=\",IF($B137>=GoalEntryData!$D$6,1,0),\"\")))","v":""},"",{"$f":"IF($B137=\"\",\"\",IF(GoalEntryData!$C$7=\"<=\",IF($B137<=GoalEntryData!$D$7,1,0),IF(GoalEntryData!$C$7=\">=\",IF($B137>=GoalEntryData!$D$7,1,0),\"\")))","v":""},"",{"$f":"IF($B137=\"\",\"\",IF(GoalEntryData!$C$8=\"<=\",IF($B137<=GoalEntryData!$D$8,1,0),IF(GoalEntryData!$C$8=\">=\",IF($B137>=GoalEntryData!$D$8,1,0),\"\")))","v":""},"",{"$f":"IF($B137=\"\",\"\",IF(GoalEntryData!$C$6=\"<=\",IF($B137<=GoalEntryData!$D$6,1,0),IF(GoalEntryData!$C$6=\">=\",IF($B137>=GoalEntryData!$D$6,1,0),\"\")))","v":""},"",null,null,null,{"$f":"IF($M137=\"\",\"\",IF(GoalEntryData!$C$10=\"<=\",IF($M137<=GoalEntryData!$D$10,1,0),IF(GoalEntryData!$C$10=\">=\",IF($M137>=GoalEntryData!$D$10,1,0),\"\")))","v":""},"",{"$f":"IF($M137=\"\",\"\",IF(GoalEntryData!$C$11=\"<=\",IF($M137<=GoalEntryData!$D$11,1,0),IF(GoalEntryData!$C$11=\">=\",IF($M137>=GoalEntryData!$D$11,1,0),\"\")))","v":""},"",{"$f":"IF($M137=\"\",\"\",IF(GoalEntryData!$C$12=\"<=\",IF($M137<=GoalEntryData!$D$12,1,0),IF(GoalEntryData!$C$10=\">=\",IF($M137>=GoalEntryData!$D$12,1,0),\"\")))","v":""},"",{"$f":"IF($M137=\"\",\"\",IF(GoalEntryData!$C$10=\"<=\",IF($M137<=GoalEntryData!$D$10,1,0),IF(GoalEntryData!$C$10=\">=\",IF($M137>=GoalEntryData!$D$10,1,0),\"\")))","v":""},""]
[null,null,null,{"$f":"IF($B138=\"\",\"\",IF(GoalEntryData!$C$6=\"<=\",IF($B138<=GoalEntryData!$D$6,1,0),IF(GoalEntryData!$C$6=\">=\",IF($B138>=GoalEntryData!$D$6,1,0),\"\")))","v":""},"",{"$f":"IF($B138=\"\",\"\",IF(GoalEntryData!$C$7=\"<=\",IF($B138<=GoalEntryData!$D$7,1,0),IF(GoalEntryData!$C$7=\">=\",IF($B138>=GoalEntryData!$D$7,1,0),\"\")))","v":""},"",{"$f":"IF($B138=\"\",\"\",IF(GoalEntryData!$C$8=\"<=\",IF($B138<=GoalEntryData!$D$8,1,0),IF(GoalEntryData!$C$8=\">=\",IF($B138>=GoalEntryData!$D$8,1,0),\"\")))","v":""},"",{"$f":"IF($B138=\"\",\"\",IF(GoalEntryData!$C$6=\"<=\",IF($B138<=GoalEntryData!$D$6,1,0),IF(GoalEntryData!$C$6=\">=\",IF($B138>=GoalEntryData!$D$6,1,0),\"\")))","v":""},"",null,null,null,{"$f":"IF($M138=\"\",\"\",IF(GoalEntryData!$C$10=\"<=\",IF($M138<=GoalEntryData!$D$10,1,0),IF(GoalEntryData!$C$10=\">=\",IF($M138>=GoalEntryData!$D$10,1,0),\"\")))","v":""},"",{"$f":"IF($M138=\"\",\"\",IF(GoalEntryData!$C$11=\"<=\",IF($M138<=GoalEntryData!$D$11,1,0),IF(GoalEntryData!$C$11=\">=\",IF($M138>=GoalEntryData!$D$11,1,0),\"\")))","v":""},"",{"$f":"IF($M138=\"\",\"\",IF(GoalEntryData!$C$12=\"<=\",IF($M138<=GoalEntryData!$D$12,1,0),IF(GoalEntryData!$C$10=\">=\",IF($M138>=GoalEntryData!$D$12,1,0),\"\")))","v":""},"",{"$f":"IF($M138=\"\",\"\",IF(GoalEntryData!$C$10=\"<=\",IF($M138<=GoalEntryData!$D$10,1,0),IF(GoalEntryData!$C$10=\">=\",IF($M138>=GoalEntryData!$D$10,1,0),\"\")))","v":""},""]
[null,null,null,{"$f":"IF($B139=\"\",\"\",IF(GoalEntryData!$C$6=\"<=\",IF($B139<=GoalEntryData!$D$6,1,0),IF(GoalEntryData!$C$6=\">=\",IF($B139>=GoalEntryData!$D$6,1,0),\"\")))","v":""},"",{"$f":"IF($B139=\"\",\"\",IF(GoalEntryData!$C$7=\"<=\",IF($B139<=GoalEntryData!$D$7,1,0),IF(GoalEntryData!$C$7=\">=\",IF($B139>=GoalEntryData!$D$7,1,0),\"\")))","v":""},"",{"$f":"IF($B139=\"\",\"\",IF(GoalEntryData!$C$8=\"<=\",IF($B139<=GoalEntryData!$D$8,1,0),IF(GoalEntryData!$C$8=\">=\",IF($B139>=GoalEntryData!$D$8,1,0),\"\")))","v":""},"",{"$f":"IF($B139=\"\",\"\",IF(GoalEntryData!$C$6=\"<=\",IF($B139<=GoalEntryData!$D$6,1,0),IF(GoalEntryData!$C$6=\">=\",IF($B139>=GoalEntryData!$D$6,1,0),\"\")))","v":""},"",null,null,null,{"$f":"IF($M139=\"\",\"\",IF(GoalEntryData!$C$10=\"<=\",IF($M139<=GoalEntryData!$D$10,1,0),IF(GoalEntryData!$C$10=\">=\",IF($M139>=GoalEntryData!$D$10,1,0),\"\")))","v":""},"",{"$f":"IF($M139=\"\",\"\",IF(GoalEntryData!$C$11=\"<=\",IF($M139<=GoalEntryData!$D$11,1,0),IF(GoalEntryData!$C$11=\">=\",IF($M139>=GoalEntryData!$D$11,1,0),\"\")))","v":""},"",{"$f":"IF($M139=\"\",\"\",IF(GoalEntryData!$C$12=\"<=\",IF($M139<=GoalEntryData!$D$12,1,0),IF(GoalEntryData!$C$10=\">=\",IF($M139>=GoalEntryData!$D$12,1,0),\"\")))","v":""},"",{"$f":"IF($M139=\"\",\"\",IF(GoalEntryData!$C$10=\"<=\",IF($M139<=GoalEntryData!$D$10,1,0),IF(GoalEntryData!$C$10=\">=\",IF($M139>=GoalEntryData!$D$10,1,0),\"\")))","v":""},""]
[null,null,null,{"$f":"IF($B140=\"\",\"\",IF(GoalEntryData!$C$6=\"<=\",IF($B140<=GoalEntryData!$D$6,1,0),IF(GoalEntryData!$C$6=\">=\",IF($B140>=GoalEntryData!$D$6,1,0),\"\")))","v":""},"",{"$f":"IF($B140=\"\",\"\",IF(GoalEntryData!$C$7=\"<=\",IF($B140<=GoalEntryData!$D$7,1,0),IF(GoalEntryData!$C$7=\">=\",IF($B140>=GoalEntryData!$D$7,1,0),\"\")))","v":""},"",{"$f":"IF($B140=\"\",\"\",IF(GoalEntryData!$C$8=\"<=\",IF($B140<=GoalEntryData!$D$8,1,0),IF(GoalEntryData!$C$8=\">=\",IF($B140>=GoalEntryData!$D$8,1,0),\"\")))","v":""},"",{"$f":"IF($B140=\"\",\"\",IF(GoalEntryData!$C$6=\"<=\",IF($B140<=GoalEntryData!$D$6,1,0),IF(GoalEntryData!$C$6=\">=\",IF($B140>=GoalEntryData!$D$6,1,0),\"\")))","v":""},"",null,null,null,{"$f":"IF($M140=\"\",\"\",IF(GoalEntryData!$C$10=\"<=\",IF($M140<=GoalEntryData!$D$10,1,0),IF(GoalEntryData!$C$10=\">=\",IF($M140>=GoalEntryData!$D$10,1,0),\"\")))","v":""},"",{"$f":"IF($M140=\"\",\"\",IF(GoalEntryData!$C$11=\"<=\",IF($M140<=GoalEntryData!$D$11,1,0),IF(GoalEntryData!$C$11=\">=\",IF($M140>=GoalEntryData!$D$11,1,0),\"\")))","v":""},"",{"$f":"IF($M140=\"\",\"\",IF(GoalEntryData!$C$12=\"<=\",IF($M140<=GoalEntryData!$D$12,1,0),IF(GoalEntryData!$C$10=\">=\",IF($M140>=GoalEntryData!$D$12,1,0),\"\")))","v":""},"",{"$f":"IF($M140=\"\",\"\",IF(GoalEntryData!$C$10=\"<=\",IF($M140<=GoalEntryData!$D$10,1,0),IF(GoalEntryData!$C$10=\">=\",IF($M140>=GoalEntryData!$D$10,1,0),\"\")))","v":""},""]
[null,null,null,{"$f":"IF($B141=\"\",\"\",IF(GoalEntryData!$C$6=\"<=\",IF($B141<=GoalEntryData!$D$6,1,0),IF(GoalEntryData!$C$6=\">=\",IF($B141>=GoalEntryData!$D$6,1,0),\"\")))","v":""},"",{"$f":"IF($B141=\"\",\"\",IF(GoalEntryData!$C$7=\"<=\",IF($B141<=GoalEntryData!$D$7,1,0),IF(GoalEntryData!$C$7=\">=\",IF($B141>=GoalEntryData!$D$7,1,0),\"\")))","v":""},"",{"$f":"IF($B141=\"\",\"\",IF(GoalEntryData!$C$8=\"<=\",IF($B141<=GoalEntryData!$D$8,1,0),IF(GoalEntryData!$C$8=\">=\",IF($B141>=GoalEntryData!$D$8,1,0),\"\")))","v":""},"",{"$f":"IF($B141=\"\",\"\",IF(GoalEntryData!$C$6=\"<=\",IF($B141<=GoalEntryData!$D$6,1,0),IF(GoalEntryData!$C$6=\">=\",IF($B141>=GoalEntryData!$D$6,1,0),\"\")))","v":""},"",null,null,null,{"$f":"IF($M141=\"\",\"\",IF(GoalEntryData!$C$10=\"<=\",IF($M141<=GoalEntryData!$D$10,1,0),IF(GoalEntryData!$C$10=\">=\",IF($M141>=GoalEntryData!$D$10,1,0),\"\")))","v":""},"",{"$f":"IF($M141=\"\",\"\",IF(GoalEntryData!$C$11=\"<=\",IF($M141<=GoalEntryData!$D$11,1,0),IF(GoalEntryData!$C$11=\">=\",IF($M141>=GoalEntryData!$D$11,1,0),\"\")))","v":""},"",{"$f":"IF($M141=\"\",\"\",IF(GoalEntryData!$C$12=\"<=\",IF($M141<=GoalEntryData!$D$12,1,0),IF(GoalEntryData!$C$10=\">=\",IF($M141>=GoalEntryData!$D$12,1,0),\"\")))","v":""},"",{"$f":"IF($M141=\"\",\"\",IF(GoalEntryData!$C$10=\"<=\",IF($M141<=GoalEntryData!$D$10,1,0),IF(GoalEntryData!$C$10=\">=\",IF($M141>=GoalEntryData!$D$10,1,0),\"\")))","v":""},""]
[null,null,null,{"$f":"IF($B142=\"\",\"\",IF(GoalEntryData!$C$6=\"<=\",IF($B142<=GoalEntryData!$D$6,1,0),IF(GoalEntryData!$C$6=\">=\",IF($B142>=GoalEntryData!$D$6,1,0),\"\")))","v":""},"",{"$f":"IF($B142=\"\",\"\",IF(GoalEntryData!$C$7=\"<=\",IF($B142<=GoalEntryData!$D$7,1,0),IF(GoalEntryData!$C$7=\">=\",IF($B142>=GoalEntryData!$D$7,1,0),\"\")))","v":""},"",{"$f":"IF($B142=\"\",\"\",IF(GoalEntryData!$C$8=\"<=\",IF($B142<=GoalEntryData!$D$8,1,0),IF(GoalEntryData!$C$8=\">=\",IF($B142>=GoalEntryData!$D$8,1,0),\"\")))","v":""},"",{"$f":"IF($B142=\"\",\"\",IF(GoalEntryData!$C$6=\"<=\",IF($B142<=GoalEntryData!$D$6,1,0),IF(GoalEntryData!$C$6=\">=\",IF($B142>=GoalEntryData!$D$6,1,0),\"\")))","v":""},"",null,null,null,{"$f":"IF($M142=\"\",\"\",IF(GoalEntryData!$C$10=\"<=\",IF($M142<=GoalEntryData!$D$10,1,0),IF(GoalEntryData!$C$10=\">=\",IF($M142>=GoalEntryData!$D$10,1,0),\"\")))","v":""},"",{"$f":"IF($M142=\"\",\"\",IF(GoalEntryData!$C$11=\"<=\",IF($M142<=GoalEntryData!$D$11,1,0),IF(GoalEntryData!$C$11=\">=\",IF($M142>=GoalEntryData!$D$11,1,0),\"\")))","v":""},"",{"$f":"IF($M142=\"\",\"\",IF(GoalEntryData!$C$12=\"<=\",IF($M142<=GoalEntryData!$D$12,1,0),IF(GoalEntryData!$C$10=\">=\",IF($M142>=GoalEntryData!$D$12,1,0),\"\")))","v":""},"",{"$f":"IF($M142=\"\",\"\",IF(GoalEntryData!$C$10=\"<=\",IF($M142<=GoalEntryData!$D$10,1,0),IF(GoalEntryData!$C$10=\">=\",IF($M142>=GoalEntryData!$D$10,1,0),\"\")))","v":""},""]
[null,null,null,{"$f":"IF($B143=\"\",\"\",IF(GoalEntryData!$C$6=\"<=\",IF($B143<=GoalEntryData!$D$6,1,0),IF(GoalEntryData!$C$6=\">=\",IF($B143>=GoalEntryData!$D$6,1,0),\"\")))","v":""},"",{"$f":"IF($B143=\"\",\"\",IF(GoalEntryData!$C$7=\"<=\",IF($B143<=GoalEntryData!$D$7,1,0),IF(GoalEntryData!$C$7=\">=\",IF($B143>=GoalEntryData!$D$7,1,0),\"\")))","v":""},"",{"$f":"IF($B143=\"\",\"\",IF(GoalEntryData!$C$8=\"<=\",IF($B143<=GoalEntryData!$D$8,1,0),IF(GoalEntryData!$C$8=\">=\",IF($B143>=GoalEntryData!$D$8,1,0),\"\")))","v":""},"",{"$f":"IF($B143=\"\",\"\",IF(GoalEntryData!$C$6=\"<=\",IF($B143<=GoalEntryData!$D$6,1,0),IF(GoalEntryData!$C$6=\">=\",IF($B143>=GoalEntryData!$D$6,1,0),\"\")))","v":""},"",null,null,null,{"$f":"IF($M143=\"\",\"\",IF(GoalEntryData!$C$10=\"<=\",IF($M143<=GoalEntryData!$D$10,1,0),IF(GoalEntryData!$C$10=\">=\",IF($M143>=GoalEntryData!$D$10,1,0),\"\")))","v":""},"",{"$f":"IF($M143=\"\",\"\",IF(GoalEntryData!$C$11=\"<=\",IF($M143<=GoalEntryData!$D$11,1,0),IF(GoalEntryData!$C$11=\">=\",IF($M143>=GoalEntryData!$D$11,1,0),\"\")))","v":""},"",{"$f":"IF($M143=\"\",\"\",IF(GoalEntryData!$C$12=\"<=\",IF($M143<=GoalEntryData!$D$12,1,0),IF(GoalEntryData!$C$10=\">=\",IF($M143>=GoalEntryData!$D$12,1,0),\"\")))","v":""},"",{"$f":"IF($M143=\"\",\"\",IF(GoalEntryData!$C$10=\"<=\",IF($M143<=GoalEntryData!$D$10,1,0),IF(GoalEntryData!$C$10=\">=\",IF($M143>=GoalEntryData!$D$10,1,0),\"\")))","v":""},""]
[null,null,null,{"$f":"IF($B144=\"\",\"\",IF(GoalEntryData!$C$6=\"<=\",IF($B144<=GoalEntryData!$D$6,1,0),IF(GoalEntryData!$C$6=\">=\",IF($B144>=GoalEntryData!$D$6,1,0),\"\")))","v":""},"",{"$f":"IF($B144=\"\",\"\",IF(GoalEntryData!$C$7=\"<=\",IF($B144<=GoalEntryData!$D$7,1,0),IF(GoalEntryData!$C$7=\">=\",IF($B144>=GoalEntryData!$D$7,1,0),\"\")))","v":""},"",{"$f":"IF($B144=\"\",\"\",IF(GoalEntryData!$C$8=\"<=\",IF($B144<=GoalEntryData!$D$8,1,0),IF(GoalEntryData!$C$8=\">=\",IF($B144>=GoalEntryData!$D$8,1,0),\"\")))","v":""},"",{"$f":"IF($B144=\"\",\"\",IF(GoalEntryData!$C$6=\"<=\",IF($B144<=GoalEntryData!$D$6,1,0),IF(GoalEntryData!$C$6=\">=\",IF($B144>=GoalEntryData!$D$6,1,0),\"\")))","v":""},"",null,null,null,{"$f":"IF($M144=\"\",\"\",IF(GoalEntryData!$C$10=\"<=\",IF($M144<=GoalEntryData!$D$10,1,0),IF(GoalEntryData!$C$10=\">=\",IF($M144>=GoalEntryData!$D$10,1,0),\"\")))","v":""},"",{"$f":"IF($M144=\"\",\"\",IF(GoalEntryData!$C$11=\"<=\",IF($M144<=GoalEntryData!$D$11,1,0),IF(GoalEntryData!$C$11=\">=\",IF($M144>=GoalEntryData!$D$11,1,0),\"\")))","v":""},"",{"$f":"IF($M144=\"\",\"\",IF(GoalEntryData!$C$12=\"<=\",IF($M144<=GoalEntryData!$D$12,1,0),IF(GoalEntryData!$C$10=\">=\",IF($M144>=GoalEntryData!$D$12,1,0),\"\")))","v":""},"",{"$f":"IF($M144=\"\",\"\",IF(GoalEntryData!$C$10=\"<=\",IF($M144<=GoalEntryData!$D$10,1,0),IF(GoalEntryData!$C$10=\">=\",IF($M144>=GoalEntryData!$D$10,1,0),\"\")))","v":""},""]
[null,null,null,{"$f":"IF($B145=\"\",\"\",IF(GoalEntryData!$C$6=\"<=\",IF($B145<=GoalEntryData!$D$6,1,0),IF(GoalEntryData!$C$6=\">=\",IF($B145>=GoalEntryData!$D$6,1,0),\"\")))","v":""},"",{"$f":"IF($B145=\"\",\"\",IF(GoalEntryData!$C$7=\"<=\",IF($B145<=GoalEntryData!$D$7,1,0),IF(GoalEntryData!$C$7=\">=\",IF($B145>=GoalEntryData!$D$7,1,0),\"\")))","v":""},"",{"$f":"IF($B145=\"\",\"\",IF(GoalEntryData!$C$8=\"<=\",IF($B145<=GoalEntryData!$D$8,1,0),IF(GoalEntryData!$C$8=\">=\",IF($B145>=GoalEntryData!$D$8,1,0),\"\")))","v":""},"",{"$f":"IF($B145=\"\",\"\",IF(GoalEntryData!$C$6=\"<=\",IF($B145<=GoalEntryData!$D$6,1,0),IF(GoalEntryData!$C$6=\">=\",IF($B145>=GoalEntryData!$D$6,1,0),\"\")))","v":""},"",null,null,null,{"$f":"IF($M145=\"\",\"\",IF(GoalEntryData!$C$10=\"<=\",IF($M145<=GoalEntryData!$D$10,1,0),IF(GoalEntryData!$C$10=\">=\",IF($M145>=GoalEntryData!$D$10,1,0),\"\")))","v":""},"",{"$f":"IF($M145=\"\",\"\",IF(GoalEntryData!$C$11=\"<=\",IF($M145<=GoalEntryData!$D$11,1,0),IF(GoalEntryData!$C$11=\">=\",IF($M145>=GoalEntryData!$D$11,1,0),\"\")))","v":""},"",{"$f":"IF($M145=\"\",\"\",IF(GoalEntryData!$C$12=\"<=\",IF($M145<=GoalEntryData!$D$12,1,0),IF(GoalEntryData!$C$10=\">=\",IF($M145>=GoalEntryData!$D$12,1,0),\"\")))","v":""},"",{"$f":"IF($M145=\"\",\"\",IF(GoalEntryData!$C$10=\"<=\",IF($M145<=GoalEntryData!$D$10,1,0),IF(GoalEntryData!$C$10=\">=\",IF($M145>=GoalEntryData!$D$10,1,0),\"\")))","v":""},""]
[null,null,null,{"$f":"IF($B146=\"\",\"\",IF(GoalEntryData!$C$6=\"<=\",IF($B146<=GoalEntryData!$D$6,1,0),IF(GoalEntryData!$C$6=\">=\",IF($B146>=GoalEntryData!$D$6,1,0),\"\")))","v":""},"",{"$f":"IF($B146=\"\",\"\",IF(GoalEntryData!$C$7=\"<=\",IF($B146<=GoalEntryData!$D$7,1,0),IF(GoalEntryData!$C$7=\">=\",IF($B146>=GoalEntryData!$D$7,1,0),\"\")))","v":""},"",{"$f":"IF($B146=\"\",\"\",IF(GoalEntryData!$C$8=\"<=\",IF($B146<=GoalEntryData!$D$8,1,0),IF(GoalEntryData!$C$8=\">=\",IF($B146>=GoalEntryData!$D$8,1,0),\"\")))","v":""},"",{"$f":"IF($B146=\"\",\"\",IF(GoalEntryData!$C$6=\"<=\",IF($B146<=GoalEntryData!$D$6,1,0),IF(GoalEntryData!$C$6=\">=\",IF($B146>=GoalEntryData!$D$6,1,0),\"\")))","v":""},"",null,null,null,{"$f":"IF($M146=\"\",\"\",IF(GoalEntryData!$C$10=\"<=\",IF($M146<=GoalEntryData!$D$10,1,0),IF(GoalEntryData!$C$10=\">=\",IF($M146>=GoalEntryData!$D$10,1,0),\"\")))","v":""},"",{"$f":"IF($M146=\"\",\"\",IF(GoalEntryData!$C$11=\"<=\",IF($M146<=GoalEntryData!$D$11,1,0),IF(GoalEntryData!$C$11=\">=\",IF($M146>=GoalEntryData!$D$11,1,0),\"\")))","v":""},"",{"$f":"IF($M146=\"\",\"\",IF(GoalEntryData!$C$12=\"<=\",IF($M146<=GoalEntryData!$D$12,1,0),IF(GoalEntryData!$C$10=\">=\",IF($M146>=GoalEntryData!$D$12,1,0),\"\")))","v":""},"",{"$f":"IF($M146=\"\",\"\",IF(GoalEntryData!$C$10=\"<=\",IF($M146<=GoalEntryData!$D$10,1,0),IF(GoalEntryData!$C$10=\">=\",IF($M146>=GoalEntryData!$D$10,1,0),\"\")))","v":""},""]
[null,null,null,{"$f":"IF($B147=\"\",\"\",IF(GoalEntryData!$C$6=\"<=\",IF($B147<=GoalEntryData!$D$6,1,0),IF(GoalEntryData!$C$6=\">=\",IF($B147>=GoalEntryData!$D$6,1,0),\"\")))","v":""},"",{"$f":"IF($B147=\"\",\"\",IF(GoalEntryData!$C$7=\"<=\",IF($B147<=GoalEntryData!$D$7,1,0),IF(GoalEntryData!$C$7=\">=\",IF($B147>=GoalEntryData!$D$7,1,0),\"\")))","v":""},"",{"$f":"IF($B147=\"\",\"\",IF(GoalEntryData!$C$8=\"<=\",IF($B147<=GoalEntryData!$D$8,1,0),IF(GoalEntryData!$C$8=\">=\",IF($B147>=GoalEntryData!$D$8,1,0),\"\")))","v":""},"",{"$f":"IF($B147=\"\",\"\",IF(GoalEntryData!$C$6=\"<=\",IF($B147<=GoalEntryData!$D$6,1,0),IF(GoalEntryData!$C$6=\">=\",IF($B147>=GoalEntryData!$D$6,1,0),\"\")))","v":""},"",null,null,null,{"$f":"IF($M147=\"\",\"\",IF(GoalEntryData!$C$10=\"<=\",IF($M147<=GoalEntryData!$D$10,1,0),IF(GoalEntryData!$C$10=\">=\",IF($M147>=GoalEntryData!$D$10,1,0),\"\")))","v":""},"",{"$f":"IF($M147=\"\",\"\",IF(GoalEntryData!$C$11=\"<=\",IF($M147<=GoalEntryData!$D$11,1,0),IF(GoalEntryData!$C$11=\">=\",IF($M147>=GoalEntryData!$D$11,1,0),\"\")))","v":""},"",{"$f":"IF($M147=\"\",\"\",IF(GoalEntryData!$C$12=\"<=\",IF($M147<=GoalEntryData!$D$12,1,0),IF(GoalEntryData!$C$10=\">=\",IF($M147>=GoalEntryData!$D$12,1,0),\"\")))","v":""},"",{"$f":"IF($M147=\"\",\"\",IF(GoalEntryData!$C$10=\"<=\",IF($M147<=GoalEntryData!$D$10,1,0),IF(GoalEntryData!$C$10=\">=\",IF($M147>=GoalEntryData!$D$10,1,0),\"\")))","v":""},""]
[null,null,null,{"$f":"IF($B148=\"\",\"\",IF(GoalEntryData!$C$6=\"<=\",IF($B148<=GoalEntryData!$D$6,1,0),IF(GoalEntryData!$C$6=\">=\",IF($B148>=GoalEntryData!$D$6,1,0),\"\")))","v":""},"",{"$f":"IF($B148=\"\",\"\",IF(GoalEntryData!$C$7=\"<=\",IF($B148<=GoalEntryData!$D$7,1,0),IF(GoalEntryData!$C$7=\">=\",IF($B148>=GoalEntryData!$D$7,1,0),\"\")))","v":""},"",{"$f":"IF($B148=\"\",\"\",IF(GoalEntryData!$C$8=\"<=\",IF($B148<=GoalEntryData!$D$8,1,0),IF(GoalEntryData!$C$8=\">=\",IF($B148>=GoalEntryData!$D$8,1,0),\"\")))","v":""},"",{"$f":"IF($B148=\"\",\"\",IF(GoalEntryData!$C$6=\"<=\",IF($B148<=GoalEntryData!$D$6,1,0),IF(GoalEntryData!$C$6=\">=\",IF($B148>=GoalEntryData!$D$6,1,0),\"\")))","v":""},"",null,null,null,{"$f":"IF($M148=\"\",\"\",IF(GoalEntryData!$C$10=\"<=\",IF($M148<=GoalEntryData!$D$10,1,0),IF(GoalEntryData!$C$10=\">=\",IF($M148>=GoalEntryData!$D$10,1,0),\"\")))","v":""},"",{"$f":"IF($M148=\"\",\"\",IF(GoalEntryData!$C$11=\"<=\",IF($M148<=GoalEntryData!$D$11,1,0),IF(GoalEntryData!$C$11=\">=\",IF($M148>=GoalEntryData!$D$11,1,0),\"\")))","v":""},"",{"$f":"IF($M148=\"\",\"\",IF(GoalEntryData!$C$12=\"<=\",IF($M148<=GoalEntryData!$D$12,1,0),IF(GoalEntryData!$C$10=\">=\",IF($M148>=GoalEntryData!$D$12,1,0),\"\")))","v":""},"",{"$f":"IF($M148=\"\",\"\",IF(GoalEntryData!$C$10=\"<=\",IF($M148<=GoalEntryData!$D$10,1,0),IF(GoalEntryData!$C$10=\">=\",IF($M148>=GoalEntryData!$D$10,1,0),\"\")))","v":""},""]
[null,null,null,{"$f":"IF($B149=\"\",\"\",IF(GoalEntryData!$C$6=\"<=\",IF($B149<=GoalEntryData!$D$6,1,0),IF(GoalEntryData!$C$6=\">=\",IF($B149>=GoalEntryData!$D$6,1,0),\"\")))","v":""},"",{"$f":"IF($B149=\"\",\"\",IF(GoalEntryData!$C$7=\"<=\",IF($B149<=GoalEntryData!$D$7,1,0),IF(GoalEntryData!$C$7=\">=\",IF($B149>=GoalEntryData!$D$7,1,0),\"\")))","v":""},"",{"$f":"IF($B149=\"\",\"\",IF(GoalEntryData!$C$8=\"<=\",IF($B149<=GoalEntryData!$D$8,1,0),IF(GoalEntryData!$C$8=\">=\",IF($B149>=GoalEntryData!$D$8,1,0),\"\")))","v":""},"",{"$f":"IF($B149=\"\",\"\",IF(GoalEntryData!$C$6=\"<=\",IF($B149<=GoalEntryData!$D$6,1,0),IF(GoalEntryData!$C$6=\">=\",IF($B149>=GoalEntryData!$D$6,1,0),\"\")))","v":""},"",null,null,null,{"$f":"IF($M149=\"\",\"\",IF(GoalEntryData!$C$10=\"<=\",IF($M149<=GoalEntryData!$D$10,1,0),IF(GoalEntryData!$C$10=\">=\",IF($M149>=GoalEntryData!$D$10,1,0),\"\")))","v":""},"",{"$f":"IF($M149=\"\",\"\",IF(GoalEntryData!$C$11=\"<=\",IF($M149<=GoalEntryData!$D$11,1,0),IF(GoalEntryData!$C$11=\">=\",IF($M149>=GoalEntryData!$D$11,1,0),\"\")))","v":""},"",{"$f":"IF($M149=\"\",\"\",IF(GoalEntryData!$C$12=\"<=\",IF($M149<=GoalEntryData!$D$12,1,0),IF(GoalEntryData!$C$10=\">=\",IF($M149>=GoalEntryData!$D$12,1,0),\"\")))","v":""},"",{"$f":"IF($M149=\"\",\"\",IF(GoalEntryData!$C$10=\"<=\",IF($M149<=GoalEntryData!$D$10,1,0),IF(GoalEntryData!$C$10=\">=\",IF($M149>=GoalEntryData!$D$10,1,0),\"\")))","v":""},""]
[null,null,null,{"$f":"IF($B150=\"\",\"\",IF(GoalEntryData!$C$6=\"<=\",IF($B150<=GoalEntryData!$D$6,1,0),IF(GoalEntryData!$C$6=\">=\",IF($B150>=GoalEntryData!$D$6,1,0),\"\")))","v":""},"",{"$f":"IF($B150=\"\",\"\",IF(GoalEntryData!$C$7=\"<=\",IF($B150<=GoalEntryData!$D$7,1,0),IF(GoalEntryData!$C$7=\">=\",IF($B150>=GoalEntryData!$D$7,1,0),\"\")))","v":""},"",{"$f":"IF($B150=\"\",\"\",IF(GoalEntryData!$C$8=\"<=\",IF($B150<=GoalEntryData!$D$8,1,0),IF(GoalEntryData!$C$8=\">=\",IF($B150>=GoalEntryData!$D$8,1,0),\"\")))","v":""},"",{"$f":"IF($B150=\"\",\"\",IF(GoalEntryData!$C$6=\"<=\",IF($B150<=GoalEntryData!$D$6,1,0),IF(GoalEntryData!$C$6=\">=\",IF($B150>=GoalEntryData!$D$6,1,0),\"\")))","v":""},"",null,null,null,{"$f":"IF($M150=\"\",\"\",IF(GoalEntryData!$C$10=\"<=\",IF($M150<=GoalEntryData!$D$10,1,0),IF(GoalEntryData!$C$10=\">=\",IF($M150>=GoalEntryData!$D$10,1,0),\"\")))","v":""},"",{"$f":"IF($M150=\"\",\"\",IF(GoalEntryData!$C$11=\"<=\",IF($M150<=GoalEntryData!$D$11,1,0),IF(GoalEntryData!$C$11=\">=\",IF($M150>=GoalEntryData!$D$11,1,0),\"\")))","v":""},"",{"$f":"IF($M150=\"\",\"\",IF(GoalEntryData!$C$12=\"<=\",IF($M150<=GoalEntryData!$D$12,1,0),IF(GoalEntryData!$C$10=\">=\",IF($M150>=GoalEntryData!$D$12,1,0),\"\")))","v":""},"",{"$f":"IF($M150=\"\",\"\",IF(GoalEntryData!$C$10=\"<=\",IF($M150<=GoalEntryData!$D$10,1,0),IF(GoalEntryData!$C$10=\">=\",IF($M150>=GoalEntryData!$D$10,1,0),\"\")))","v":""},""]
[null,null,null,{"$f":"IF($B151=\"\",\"\",IF(GoalEntryData!$C$6=\"<=\",IF($B151<=GoalEntryData!$D$6,1,0),IF(GoalEntryData!$C$6=\">=\",IF($B151>=GoalEntryData!$D$6,1,0),\"\")))","v":""},"",{"$f":"IF($B151=\"\",\"\",IF(GoalEntryData!$C$7=\"<=\",IF($B151<=GoalEntryData!$D$7,1,0),IF(GoalEntryData!$C$7=\">=\",IF($B151>=GoalEntryData!$D$7,1,0),\"\")))","v":""},"",{"$f":"IF($B151=\"\",\"\",IF(GoalEntryData!$C$8=\"<=\",IF($B151<=GoalEntryData!$D$8,1,0),IF(GoalEntryData!$C$8=\">=\",IF($B151>=GoalEntryData!$D$8,1,0),\"\")))","v":""},"",{"$f":"IF($B151=\"\",\"\",IF(GoalEntryData!$C$6=\"<=\",IF($B151<=GoalEntryData!$D$6,1,0),IF(GoalEntryData!$C$6=\">=\",IF($B151>=GoalEntryData!$D$6,1,0),\"\")))","v":""},"",null,null,null,{"$f":"IF($M151=\"\",\"\",IF(GoalEntryData!$C$10=\"<=\",IF($M151<=GoalEntryData!$D$10,1,0),IF(GoalEntryData!$C$10=\">=\",IF($M151>=GoalEntryData!$D$10,1,0),\"\")))","v":""},"",{"$f":"IF($M151=\"\",\"\",IF(GoalEntryData!$C$11=\"<=\",IF($M151<=GoalEntryData!$D$11,1,0),IF(GoalEntryData!$C$11=\">=\",IF($M151>=GoalEntryData!$D$11,1,0),\"\")))","v":""},"",{"$f":"IF($M151=\"\",\"\",IF(GoalEntryData!$C$12=\"<=\",IF($M151<=GoalEntryData!$D$12,1,0),IF(GoalEntryData!$C$10=\">=\",IF($M151>=GoalEntryData!$D$12,1,0),\"\")))","v":""},"",{"$f":"IF($M151=\"\",\"\",IF(GoalEntryData!$C$10=\"<=\",IF($M151<=GoalEntryData!$D$10,1,0),IF(GoalEntryData!$C$10=\">=\",IF($M151>=GoalEntryData!$D$10,1,0),\"\")))","v":""},""]
[null,null,null,{"$f":"IF($B152=\"\",\"\",IF(GoalEntryData!$C$6=\"<=\",IF($B152<=GoalEntryData!$D$6,1,0),IF(GoalEntryData!$C$6=\">=\",IF($B152>=GoalEntryData!$D$6,1,0),\"\")))","v":""},"",{"$f":"IF($B152=\"\",\"\",IF(GoalEntryData!$C$7=\"<=\",IF($B152<=GoalEntryData!$D$7,1,0),IF(GoalEntryData!$C$7=\">=\",IF($B152>=GoalEntryData!$D$7,1,0),\"\")))","v":""},"",{"$f":"IF($B152=\"\",\"\",IF(GoalEntryData!$C$8=\"<=\",IF($B152<=GoalEntryData!$D$8,1,0),IF(GoalEntryData!$C$8=\">=\",IF($B152>=GoalEntryData!$D$8,1,0),\"\")))","v":""},"",{"$f":"IF($B152=\"\",\"\",IF(GoalEntryData!$C$6=\"<=\",IF($B152<=GoalEntryData!$D$6,1,0),IF(GoalEntryData!$C$6=\">=\",IF($B152>=GoalEntryData!$D$6,1,0),\"\")))","v":""},"",null,null,null,{"$f":"IF($M152=\"\",\"\",IF(GoalEntryData!$C$10=\"<=\",IF($M152<=GoalEntryData!$D$10,1,0),IF(GoalEntryData!$C$10=\">=\",IF($M152>=GoalEntryData!$D$10,1,0),\"\")))","v":""},"",{"$f":"IF($M152=\"\",\"\",IF(GoalEntryData!$C$11=\"<=\",IF($M152<=GoalEntryData!$D$11,1,0),IF(GoalEntryData!$C$11=\">=\",IF($M152>=GoalEntryData!$D$11,1,0),\"\")))","v":""},"",{"$f":"IF($M152=\"\",\"\",IF(GoalEntryData!$C$12=\"<=\",IF($M152<=GoalEntryData!$D$12,1,0),IF(GoalEntryData!$C$10=\">=\",IF($M152>=GoalEntryData!$D$12,1,0),\"\")))","v":""},"",{"$f":"IF($M152=\"\",\"\",IF(GoalEntryData!$C$10=\"<=\",IF($M152<=GoalEntryData!$D$10,1,0),IF(GoalEntryData!$C$10=\">=\",IF($M152>=GoalEntryData!$D$10,1,0),\"\")))","v":""},""]
[null,null,null,{"$f":"IF($B153=\"\",\"\",IF(GoalEntryData!$C$6=\"<=\",IF($B153<=GoalEntryData!$D$6,1,0),IF(GoalEntryData!$C$6=\">=\",IF($B153>=GoalEntryData!$D$6,1,0),\"\")))","v":""},"",{"$f":"IF($B153=\"\",\"\",IF(GoalEntryData!$C$7=\"<=\",IF($B153<=GoalEntryData!$D$7,1,0),IF(GoalEntryData!$C$7=\">=\",IF($B153>=GoalEntryData!$D$7,1,0),\"\")))","v":""},"",{"$f":"IF($B153=\"\",\"\",IF(GoalEntryData!$C$8=\"<=\",IF($B153<=GoalEntryData!$D$8,1,0),IF(GoalEntryData!$C$8=\">=\",IF($B153>=GoalEntryData!$D$8,1,0),\"\")))","v":""},"",{"$f":"IF($B153=\"\",\"\",IF(GoalEntryData!$C$6=\"<=\",IF($B153<=GoalEntryData!$D$6,1,0),IF(GoalEntryData!$C$6=\">=\",IF($B153>=GoalEntryData!$D$6,1,0),\"\")))","v":""},"",null,null,null,{"$f":"IF($M153=\"\",\"\",IF(GoalEntryData!$C$10=\"<=\",IF($M153<=GoalEntryData!$D$10,1,0),IF(GoalEntryData!$C$10=\">=\",IF($M153>=GoalEntryData!$D$10,1,0),\"\")))","v":""},"",{"$f":"IF($M153=\"\",\"\",IF(GoalEntryData!$C$11=\"<=\",IF($M153<=GoalEntryData!$D$11,1,0),IF(GoalEntryData!$C$11=\">=\",IF($M153>=GoalEntryData!$D$11,1,0),\"\")))","v":""},"",{"$f":"IF($M153=\"\",\"\",IF(GoalEntryData!$C$12=\"<=\",IF($M153<=GoalEntryData!$D$12,1,0),IF(GoalEntryData!$C$10=\">=\",IF($M153>=GoalEntryData!$D$12,1,0),\"\")))","v":""},"",{"$f":"IF($M153=\"\",\"\",IF(GoalEntryData!$C$10=\"<=\",IF($M153<=GoalEntryData!$D$10,1,0),IF(GoalEntryData!$C$10=\">=\",IF($M153>=GoalEntryData!$D$10,1,0),\"\")))","v":""},""]
[null,null,null,{"$f":"IF($B154=\"\",\"\",IF(GoalEntryData!$C$6=\"<=\",IF($B154<=GoalEntryData!$D$6,1,0),IF(GoalEntryData!$C$6=\">=\",IF($B154>=GoalEntryData!$D$6,1,0),\"\")))","v":""},"",{"$f":"IF($B154=\"\",\"\",IF(GoalEntryData!$C$7=\"<=\",IF($B154<=GoalEntryData!$D$7,1,0),IF(GoalEntryData!$C$7=\">=\",IF($B154>=GoalEntryData!$D$7,1,0),\"\")))","v":""},"",{"$f":"IF($B154=\"\",\"\",IF(GoalEntryData!$C$8=\"<=\",IF($B154<=GoalEntryData!$D$8,1,0),IF(GoalEntryData!$C$8=\">=\",IF($B154>=GoalEntryData!$D$8,1,0),\"\")))","v":""},"",{"$f":"IF($B154=\"\",\"\",IF(GoalEntryData!$C$6=\"<=\",IF($B154<=GoalEntryData!$D$6,1,0),IF(GoalEntryData!$C$6=\">=\",IF($B154>=GoalEntryData!$D$6,1,0),\"\")))","v":""},"",null,null,null,{"$f":"IF($M154=\"\",\"\",IF(GoalEntryData!$C$10=\"<=\",IF($M154<=GoalEntryData!$D$10,1,0),IF(GoalEntryData!$C$10=\">=\",IF($M154>=GoalEntryData!$D$10,1,0),\"\")))","v":""},"",{"$f":"IF($M154=\"\",\"\",IF(GoalEntryData!$C$11=\"<=\",IF($M154<=GoalEntryData!$D$11,1,0),IF(GoalEntryData!$C$11=\">=\",IF($M154>=GoalEntryData!$D$11,1,0),\"\")))","v":""},"",{"$f":"IF($M154=\"\",\"\",IF(GoalEntryData!$C$12=\"<=\",IF($M154<=GoalEntryData!$D$12,1,0),IF(GoalEntryData!$C$10=\">=\",IF($M154>=GoalEntryData!$D$12,1,0),\"\")))","v":""},"",{"$f":"IF($M154=\"\",\"\",IF(GoalEntryData!$C$10=\"<=\",IF($M154<=GoalEntryData!$D$10,1,0),IF(GoalEntryData!$C$10=\">=\",IF($M154>=GoalEntryData!$D$10,1,0),\"\")))","v":""},""]
[null,null,null,{"$f":"IF($B155=\"\",\"\",IF(GoalEntryData!$C$6=\"<=\",IF($B155<=GoalEntryData!$D$6,1,0),IF(GoalEntryData!$C$6=\">=\",IF($B155>=GoalEntryData!$D$6,1,0),\"\")))","v":""},"",{"$f":"IF($B155=\"\",\"\",IF(GoalEntryData!$C$7=\"<=\",IF($B155<=GoalEntryData!$D$7,1,0),IF(GoalEntryData!$C$7=\">=\",IF($B155>=GoalEntryData!$D$7,1,0),\"\")))","v":""},"",{"$f":"IF($B155=\"\",\"\",IF(GoalEntryData!$C$8=\"<=\",IF($B155<=GoalEntryData!$D$8,1,0),IF(GoalEntryData!$C$8=\">=\",IF($B155>=GoalEntryData!$D$8,1,0),\"\")))","v":""},"",{"$f":"IF($B155=\"\",\"\",IF(GoalEntryData!$C$6=\"<=\",IF($B155<=GoalEntryData!$D$6,1,0),IF(GoalEntryData!$C$6=\">=\",IF($B155>=GoalEntryData!$D$6,1,0),\"\")))","v":""},"",null,null,null,{"$f":"IF($M155=\"\",\"\",IF(GoalEntryData!$C$10=\"<=\",IF($M155<=GoalEntryData!$D$10,1,0),IF(GoalEntryData!$C$10=\">=\",IF($M155>=GoalEntryData!$D$10,1,0),\"\")))","v":""},"",{"$f":"IF($M155=\"\",\"\",IF(GoalEntryData!$C$11=\"<=\",IF($M155<=GoalEntryData!$D$11,1,0),IF(GoalEntryData!$C$11=\">=\",IF($M155>=GoalEntryData!$D$11,1,0),\"\")))","v":""},"",{"$f":"IF($M155=\"\",\"\",IF(GoalEntryData!$C$12=\"<=\",IF($M155<=GoalEntryData!$D$12,1,0),IF(GoalEntryData!$C$10=\">=\",IF($M155>=GoalEntryData!$D$12,1,0),\"\")))","v":""},"",{"$f":"IF($M155=\"\",\"\",IF(GoalEntryData!$C$10=\"<=\",IF($M155<=GoalEntryData!$D$10,1,0),IF(GoalEntryData!$C$10=\">=\",IF($M155>=GoalEntryData!$D$10,1,0),\"\")))","v":""},""]
[null,null,null,{"$f":"IF($B156=\"\",\"\",IF(GoalEntryData!$C$6=\"<=\",IF($B156<=GoalEntryData!$D$6,1,0),IF(GoalEntryData!$C$6=\">=\",IF($B156>=GoalEntryData!$D$6,1,0),\"\")))","v":""},"",{"$f":"IF($B156=\"\",\"\",IF(GoalEntryData!$C$7=\"<=\",IF($B156<=GoalEntryData!$D$7,1,0),IF(GoalEntryData!$C$7=\">=\",IF($B156>=GoalEntryData!$D$7,1,0),\"\")))","v":""},"",{"$f":"IF($B156=\"\",\"\",IF(GoalEntryData!$C$8=\"<=\",IF($B156<=GoalEntryData!$D$8,1,0),IF(GoalEntryData!$C$8=\">=\",IF($B156>=GoalEntryData!$D$8,1,0),\"\")))","v":""},"",{"$f":"IF($B156=\"\",\"\",IF(GoalEntryData!$C$6=\"<=\",IF($B156<=GoalEntryData!$D$6,1,0),IF(GoalEntryData!$C$6=\">=\",IF($B156>=GoalEntryData!$D$6,1,0),\"\")))","v":""},"",null,null,null,{"$f":"IF($M156=\"\",\"\",IF(GoalEntryData!$C$10=\"<=\",IF($M156<=GoalEntryData!$D$10,1,0),IF(GoalEntryData!$C$10=\">=\",IF($M156>=GoalEntryData!$D$10,1,0),\"\")))","v":""},"",{"$f":"IF($M156=\"\",\"\",IF(GoalEntryData!$C$11=\"<=\",IF($M156<=GoalEntryData!$D$11,1,0),IF(GoalEntryData!$C$11=\">=\",IF($M156>=GoalEntryData!$D$11,1,0),\"\")))","v":""},"",{"$f":"IF($M156=\"\",\"\",IF(GoalEntryData!$C$12=\"<=\",IF($M156<=GoalEntryData!$D$12,1,0),IF(GoalEntryData!$C$10=\">=\",IF($M156>=GoalEntryData!$D$12,1,0),\"\")))","v":""},"",{"$f":"IF($M156=\"\",\"\",IF(GoalEntryData!$C$10=\"<=\",IF($M156<=GoalEntryData!$D$10,1,0),IF(GoalEntryData!$C$10=\">=\",IF($M156>=GoalEntryData!$D$10,1,0),\"\")))","v":""},""]
[null,null,null,{"$f":"IF($B157=\"\",\"\",IF(GoalEntryData!$C$6=\"<=\",IF($B157<=GoalEntryData!$D$6,1,0),IF(GoalEntryData!$C$6=\">=\",IF($B157>=GoalEntryData!$D$6,1,0),\"\")))","v":""},"",{"$f":"IF($B157=\"\",\"\",IF(GoalEntryData!$C$7=\"<=\",IF($B157<=GoalEntryData!$D$7,1,0),IF(GoalEntryData!$C$7=\">=\",IF($B157>=GoalEntryData!$D$7,1,0),\"\")))","v":""},"",{"$f":"IF($B157=\"\",\"\",IF(GoalEntryData!$C$8=\"<=\",IF($B157<=GoalEntryData!$D$8,1,0),IF(GoalEntryData!$C$8=\">=\",IF($B157>=GoalEntryData!$D$8,1,0),\"\")))","v":""},"",{"$f":"IF($B157=\"\",\"\",IF(GoalEntryData!$C$6=\"<=\",IF($B157<=GoalEntryData!$D$6,1,0),IF(GoalEntryData!$C$6=\">=\",IF($B157>=GoalEntryData!$D$6,1,0),\"\")))","v":""},"",null,null,null,{"$f":"IF($M157=\"\",\"\",IF(GoalEntryData!$C$10=\"<=\",IF($M157<=GoalEntryData!$D$10,1,0),IF(GoalEntryData!$C$10=\">=\",IF($M157>=GoalEntryData!$D$10,1,0),\"\")))","v":""},"",{"$f":"IF($M157=\"\",\"\",IF(GoalEntryData!$C$11=\"<=\",IF($M157<=GoalEntryData!$D$11,1,0),IF(GoalEntryData!$C$11=\">=\",IF($M157>=GoalEntryData!$D$11,1,0),\"\")))","v":""},"",{"$f":"IF($M157=\"\",\"\",IF(GoalEntryData!$C$12=\"<=\",IF($M157<=GoalEntryData!$D$12,1,0),IF(GoalEntryData!$C$10=\">=\",IF($M157>=GoalEntryData!$D$12,1,0),\"\")))","v":""},"",{"$f":"IF($M157=\"\",\"\",IF(GoalEntryData!$C$10=\"<=\",IF($M157<=GoalEntryData!$D$10,1,0),IF(GoalEntryData!$C$10=\">=\",IF($M157>=GoalEntryData!$D$10,1,0),\"\")))","v":""},""]
[null,null,null,{"$f":"IF($B158=\"\",\"\",IF(GoalEntryData!$C$6=\"<=\",IF($B158<=GoalEntryData!$D$6,1,0),IF(GoalEntryData!$C$6=\">=\",IF($B158>=GoalEntryData!$D$6,1,0),\"\")))","v":""},"",{"$f":"IF($B158=\"\",\"\",IF(GoalEntryData!$C$7=\"<=\",IF($B158<=GoalEntryData!$D$7,1,0),IF(GoalEntryData!$C$7=\">=\",IF($B158>=GoalEntryData!$D$7,1,0),\"\")))","v":""},"",{"$f":"IF($B158=\"\",\"\",IF(GoalEntryData!$C$8=\"<=\",IF($B158<=GoalEntryData!$D$8,1,0),IF(GoalEntryData!$C$8=\">=\",IF($B158>=GoalEntryData!$D$8,1,0),\"\")))","v":""},"",{"$f":"IF($B158=\"\",\"\",IF(GoalEntryData!$C$6=\"<=\",IF($B158<=GoalEntryData!$D$6,1,0),IF(GoalEntryData!$C$6=\">=\",IF($B158>=GoalEntryData!$D$6,1,0),\"\")))","v":""},"",null,null,null,{"$f":"IF($M158=\"\",\"\",IF(GoalEntryData!$C$10=\"<=\",IF($M158<=GoalEntryData!$D$10,1,0),IF(GoalEntryData!$C$10=\">=\",IF($M158>=GoalEntryData!$D$10,1,0),\"\")))","v":""},"",{"$f":"IF($M158=\"\",\"\",IF(GoalEntryData!$C$11=\"<=\",IF($M158<=GoalEntryData!$D$11,1,0),IF(GoalEntryData!$C$11=\">=\",IF($M158>=GoalEntryData!$D$11,1,0),\"\")))","v":""},"",{"$f":"IF($M158=\"\",\"\",IF(GoalEntryData!$C$12=\"<=\",IF($M158<=GoalEntryData!$D$12,1,0),IF(GoalEntryData!$C$10=\">=\",IF($M158>=GoalEntryData!$D$12,1,0),\"\")))","v":""},"",{"$f":"IF($M158=\"\",\"\",IF(GoalEntryData!$C$10=\"<=\",IF($M158<=GoalEntryData!$D$10,1,0),IF(GoalEntryData!$C$10=\">=\",IF($M158>=GoalEntryData!$D$10,1,0),\"\")))","v":""},""]
[null,null,null,{"$f":"IF($B159=\"\",\"\",IF(GoalEntryData!$C$6=\"<=\",IF($B159<=GoalEntryData!$D$6,1,0),IF(GoalEntryData!$C$6=\">=\",IF($B159>=GoalEntryData!$D$6,1,0),\"\")))","v":""},"",{"$f":"IF($B159=\"\",\"\",IF(GoalEntryData!$C$7=\"<=\",IF($B159<=GoalEntryData!$D$7,1,0),IF(GoalEntryData!$C$7=\">=\",IF($B159>=GoalEntryData!$D$7,1,0),\"\")))","v":""},"",{"$f":"IF($B159=\"\",\"\",IF(GoalEntryData!$C$8=\"<=\",IF($B159<=GoalEntryData!$D$8,1,0),IF(GoalEntryData!$C$8=\">=\",IF($B159>=GoalEntryData!$D$8,1,0),\"\")))","v":""},"",{"$f":"IF($B159=\"\",\"\",IF(GoalEntryData!$C$6=\"<=\",IF($B159<=GoalEntryData!$D$6,1,0),IF(GoalEntryData!$C$6=\">=\",IF($B159>=GoalEntryData!$D$6,1,0),\"\")))","v":""},"",null,null,null,{"$f":"IF($M159=\"\",\"\",IF(GoalEntryData!$C$10=\"<=\",IF($M159<=GoalEntryData!$D$10,1,0),IF(GoalEntryData!$C$10=\">=\",IF($M159>=GoalEntryData!$D$10,1,0),\"\")))","v":""},"",{"$f":"IF($M159=\"\",\"\",IF(GoalEntryData!$C$11=\"<=\",IF($M159<=GoalEntryData!$D$11,1,0),IF(GoalEntryData!$C$11=\">=\",IF($M159>=GoalEntryData!$D$11,1,0),\"\")))","v":""},"",{"$f":"IF($M159=\"\",\"\",IF(GoalEntryData!$C$12=\"<=\",IF($M159<=GoalEntryData!$D$12,1,0),IF(GoalEntryData!$C$10=\">=\",IF($M159>=GoalEntryData!$D$12,1,0),\"\")))","v":""},"",{"$f":"IF($M159=\"\",\"\",IF(GoalEntryData!$C$10=\"<=\",IF($M159<=GoalEntryData!$D$10,1,0),IF(GoalEntryData!$C$10=\">=\",IF($M159>=GoalEntryData!$D$10,1,0),\"\")))","v":""},""]
[null,null,null,{"$f":"IF($B160=\"\",\"\",IF(GoalEntryData!$C$6=\"<=\",IF($B160<=GoalEntryData!$D$6,1,0),IF(GoalEntryData!$C$6=\">=\",IF($B160>=GoalEntryData!$D$6,1,0),\"\")))","v":""},"",{"$f":"IF($B160=\"\",\"\",IF(GoalEntryData!$C$7=\"<=\",IF($B160<=GoalEntryData!$D$7,1,0),IF(GoalEntryData!$C$7=\">=\",IF($B160>=GoalEntryData!$D$7,1,0),\"\")))","v":""},"",{"$f":"IF($B160=\"\",\"\",IF(GoalEntryData!$C$8=\"<=\",IF($B160<=GoalEntryData!$D$8,1,0),IF(GoalEntryData!$C$8=\">=\",IF($B160>=GoalEntryData!$D$8,1,0),\"\")))","v":""},"",{"$f":"IF($B160=\"\",\"\",IF(GoalEntryData!$C$6=\"<=\",IF($B160<=GoalEntryData!$D$6,1,0),IF(GoalEntryData!$C$6=\">=\",IF($B160>=GoalEntryData!$D$6,1,0),\"\")))","v":""},"",null,null,null,{"$f":"IF($M160=\"\",\"\",IF(GoalEntryData!$C$10=\"<=\",IF($M160<=GoalEntryData!$D$10,1,0),IF(GoalEntryData!$C$10=\">=\",IF($M160>=GoalEntryData!$D$10,1,0),\"\")))","v":""},"",{"$f":"IF($M160=\"\",\"\",IF(GoalEntryData!$C$11=\"<=\",IF($M160<=GoalEntryData!$D$11,1,0),IF(GoalEntryData!$C$11=\">=\",IF($M160>=GoalEntryData!$D$11,1,0),\"\")))","v":""},"",{"$f":"IF($M160=\"\",\"\",IF(GoalEntryData!$C$12=\"<=\",IF($M160<=GoalEntryData!$D$12,1,0),IF(GoalEntryData!$C$10=\">=\",IF($M160>=GoalEntryData!$D$12,1,0),\"\")))","v":""},"",{"$f":"IF($M160=\"\",\"\",IF(GoalEntryData!$C$10=\"<=\",IF($M160<=GoalEntryData!$D$10,1,0),IF(GoalEntryData!$C$10=\">=\",IF($M160>=GoalEntryData!$D$10,1,0),\"\")))","v":""},""]
[null,null,null,{"$f":"IF($B161=\"\",\"\",IF(GoalEntryData!$C$6=\"<=\",IF($B161<=GoalEntryData!$D$6,1,0),IF(GoalEntryData!$C$6=\">=\",IF($B161>=GoalEntryData!$D$6,1,0),\"\")))","v":""},"",{"$f":"IF($B161=\"\",\"\",IF(GoalEntryData!$C$7=\"<=\",IF($B161<=GoalEntryData!$D$7,1,0),IF(GoalEntryData!$C$7=\">=\",IF($B161>=GoalEntryData!$D$7,1,0),\"\")))","v":""},"",{"$f":"IF($B161=\"\",\"\",IF(GoalEntryData!$C$8=\"<=\",IF($B161<=GoalEntryData!$D$8,1,0),IF(GoalEntryData!$C$8=\">=\",IF($B161>=GoalEntryData!$D$8,1,0),\"\")))","v":""},"",{"$f":"IF($B161=\"\",\"\",IF(GoalEntryData!$C$6=\"<=\",IF($B161<=GoalEntryData!$D$6,1,0),IF(GoalEntryData!$C$6=\">=\",IF($B161>=GoalEntryData!$D$6,1,0),\"\")))","v":""},"",null,null,null,{"$f":"IF($M161=\"\",\"\",IF(GoalEntryData!$C$10=\"<=\",IF($M161<=GoalEntryData!$D$10,1,0),IF(GoalEntryData!$C$10=\">=\",IF($M161>=GoalEntryData!$D$10,1,0),\"\")))","v":""},"",{"$f":"IF($M161=\"\",\"\",IF(GoalEntryData!$C$11=\"<=\",IF($M161<=GoalEntryData!$D$11,1,0),IF(GoalEntryData!$C$11=\">=\",IF($M161>=GoalEntryData!$D$11,1,0),\"\")))","v":""},"",{"$f":"IF($M161=\"\",\"\",IF(GoalEntryData!$C$12=\"<=\",IF($M161<=GoalEntryData!$D$12,1,0),IF(GoalEntryData!$C$10=\">=\",IF($M161>=GoalEntryData!$D$12,1,0),\"\")))","v":""},"",{"$f":"IF($M161=\"\",\"\",IF(GoalEntryData!$C$10=\"<=\",IF($M161<=GoalEntryData!$D$10,1,0),IF(GoalEntryData!$C$10=\">=\",IF($M161>=GoalEntryData!$D$10,1,0),\"\")))","v":""},""]
[null,null,null,{"$f":"IF($B162=\"\",\"\",IF(GoalEntryData!$C$6=\"<=\",IF($B162<=GoalEntryData!$D$6,1,0),IF(GoalEntryData!$C$6=\">=\",IF($B162>=GoalEntryData!$D$6,1,0),\"\")))","v":""},"",{"$f":"IF($B162=\"\",\"\",IF(GoalEntryData!$C$7=\"<=\",IF($B162<=GoalEntryData!$D$7,1,0),IF(GoalEntryData!$C$7=\">=\",IF($B162>=GoalEntryData!$D$7,1,0),\"\")))","v":""},"",{"$f":"IF($B162=\"\",\"\",IF(GoalEntryData!$C$8=\"<=\",IF($B162<=GoalEntryData!$D$8,1,0),IF(GoalEntryData!$C$8=\">=\",IF($B162>=GoalEntryData!$D$8,1,0),\"\")))","v":""},"",{"$f":"IF($B162=\"\",\"\",IF(GoalEntryData!$C$6=\"<=\",IF($B162<=GoalEntryData!$D$6,1,0),IF(GoalEntryData!$C$6=\">=\",IF($B162>=GoalEntryData!$D$6,1,0),\"\")))","v":""},"",null,null,null,{"$f":"IF($M162=\"\",\"\",IF(GoalEntryData!$C$10=\"<=\",IF($M162<=GoalEntryData!$D$10,1,0),IF(GoalEntryData!$C$10=\">=\",IF($M162>=GoalEntryData!$D$10,1,0),\"\")))","v":""},"",{"$f":"IF($M162=\"\",\"\",IF(GoalEntryData!$C$11=\"<=\",IF($M162<=GoalEntryData!$D$11,1,0),IF(GoalEntryData!$C$11=\">=\",IF($M162>=GoalEntryData!$D$11,1,0),\"\")))","v":""},"",{"$f":"IF($M162=\"\",\"\",IF(GoalEntryData!$C$12=\"<=\",IF($M162<=GoalEntryData!$D$12,1,0),IF(GoalEntryData!$C$10=\">=\",IF($M162>=GoalEntryData!$D$12,1,0),\"\")))","v":""},"",{"$f":"IF($M162=\"\",\"\",IF(GoalEntryData!$C$10=\"<=\",IF($M162<=GoalEntryData!$D$10,1,0),IF(GoalEntryData!$C$10=\">=\",IF($M162>=GoalEntryData!$D$10,1,0),\"\")))","v":""},""]
[null,null,null,{"$f":"IF($B163=\"\",\"\",IF(GoalEntryData!$C$6=\"<=\",IF($B163<=GoalEntryData!$D$6,1,0),IF(GoalEntryData!$C$6=\">=\",IF($B163>=GoalEntryData!$D$6,1,0),\"\")))","v":""},"",{"$f":"IF($B163=\"\",\"\",IF(GoalEntryData!$C$7=\"<=\",IF($B163<=GoalEntryData!$D$7,1,0),IF(GoalEntryData!$C$7=\">=\",IF($B163>=GoalEntryData!$D$7,1,0),\"\")))","v":""},"",{"$f":"IF($B163=\"\",\"\",IF(GoalEntryData!$C$8=\"<=\",IF($B163<=GoalEntryData!$D$8,1,0),IF(GoalEntryData!$C$8=\">=\",IF($B163>=GoalEntryData!$D$8,1,0),\"\")))","v":""},"",{"$f":"IF($B163=\"\",\"\",IF(GoalEntryData!$C$6=\"<=\",IF($B163<=GoalEntryData!$D$6,1,0),IF(GoalEntryData!$C$6=\">=\",IF($B163>=GoalEntryData!$D$6,1,0),\"\")))","v":""},"",null,null,null,{"$f":"IF($M163=\"\",\"\",IF(GoalEntryData!$C$10=\"<=\",IF($M163<=GoalEntryData!$D$10,1,0),IF(GoalEntryData!$C$10=\">=\",IF($M163>=GoalEntryData!$D$10,1,0),\"\")))","v":""},"",{"$f":"IF($M163=\"\",\"\",IF(GoalEntryData!$C$11=\"<=\",IF($M163<=GoalEntryData!$D$11,1,0),IF(GoalEntryData!$C$11=\">=\",IF($M163>=GoalEntryData!$D$11,1,0),\"\")))","v":""},"",{"$f":"IF($M163=\"\",\"\",IF(GoalEntryData!$C$12=\"<=\",IF($M163<=GoalEntryData!$D$12,1,0),IF(GoalEntryData!$C$10=\">=\",IF($M163>=GoalEntryData!$D$12,1,0),\"\")))","v":""},"",{"$f":"IF($M163=\"\",\"\",IF(GoalEntryData!$C$10=\"<=\",IF($M163<=GoalEntryData!$D$10,1,0),IF(GoalEntryData!$C$10=\">=\",IF($M163>=GoalEntryData!$D$10,1,0),\"\")))","v":""},""]
[null,null,null,{"$f":"IF($B164=\"\",\"\",IF(GoalEntryData!$C$6=\"<=\",IF($B164<=GoalEntryData!$D$6,1,0),IF(GoalEntryData!$C$6=\">=\",IF($B164>=GoalEntryData!$D$6,1,0),\"\")))","v":""},"",{"$f":"IF($B164=\"\",\"\",IF(GoalEntryData!$C$7=\"<=\",IF($B164<=GoalEntryData!$D$7,1,0),IF(GoalEntryData!$C$7=\">=\",IF($B164>=GoalEntryData!$D$7,1,0),\"\")))","v":""},"",{"$f":"IF($B164=\"\",\"\",IF(GoalEntryData!$C$8=\"<=\",IF($B164<=GoalEntryData!$D$8,1,0),IF(GoalEntryData!$C$8=\">=\",IF($B164>=GoalEntryData!$D$8,1,0),\"\")))","v":""},"",{"$f":"IF($B164=\"\",\"\",IF(GoalEntryData!$C$6=\"<=\",IF($B164<=GoalEntryData!$D$6,1,0),IF(GoalEntryData!$C$6=\">=\",IF($B164>=GoalEntryData!$D$6,1,0),\"\")))","v":""},"",null,null,null,{"$f":"IF($M164=\"\",\"\",IF(GoalEntryData!$C$10=\"<=\",IF($M164<=GoalEntryData!$D$10,1,0),IF(GoalEntryData!$C$10=\">=\",IF($M164>=GoalEntryData!$D$10,1,0),\"\")))","v":""},"",{"$f":"IF($M164=\"\",\"\",IF(GoalEntryData!$C$11=\"<=\",IF($M164<=GoalEntryData!$D$11,1,0),IF(GoalEntryData!$C$11=\">=\",IF($M164>=GoalEntryData!$D$11,1,0),\"\")))","v":""},"",{"$f":"IF($M164=\"\",\"\",IF(GoalEntryData!$C$12=\"<=\",IF($M164<=GoalEntryData!$D$12,1,0),IF(GoalEntryData!$C$10=\">=\",IF($M164>=GoalEntryData!$D$12,1,0),\"\")))","v":""},"",{"$f":"IF($M164=\"\",\"\",IF(GoalEntryData!$C$10=\"<=\",IF($M164<=GoalEntryData!$D$10,1,0),IF(GoalEntryData!$C$10=\">=\",IF($M164>=GoalEntryData!$D$10,1,0),\"\")))","v":""},""]
[null,null,null,{"$f":"IF($B165=\"\",\"\",IF(GoalEntryData!$C$6=\"<=\",IF($B165<=GoalEntryData!$D$6,1,0),IF(GoalEntryData!$C$6=\">=\",IF($B165>=GoalEntryData!$D$6,1,0),\"\")))","v":""},"",{"$f":"IF($B165=\"\",\"\",IF(GoalEntryData!$C$7=\"<=\",IF($B165<=GoalEntryData!$D$7,1,0),IF(GoalEntryData!$C$7=\">=\",IF($B165>=GoalEntryData!$D$7,1,0),\"\")))","v":""},"",{"$f":"IF($B165=\"\",\"\",IF(GoalEntryData!$C$8=\"<=\",IF($B165<=GoalEntryData!$D$8,1,0),IF(GoalEntryData!$C$8=\">=\",IF($B165>=GoalEntryData!$D$8,1,0),\"\")))","v":""},"",{"$f":"IF($B165=\"\",\"\",IF(GoalEntryData!$C$6=\"<=\",IF($B165<=GoalEntryData!$D$6,1,0),IF(GoalEntryData!$C$6=\">=\",IF($B165>=GoalEntryData!$D$6,1,0),\"\")))","v":""},"",null,null,null,{"$f":"IF($M165=\"\",\"\",IF(GoalEntryData!$C$10=\"<=\",IF($M165<=GoalEntryData!$D$10,1,0),IF(GoalEntryData!$C$10=\">=\",IF($M165>=GoalEntryData!$D$10,1,0),\"\")))","v":""},"",{"$f":"IF($M165=\"\",\"\",IF(GoalEntryData!$C$11=\"<=\",IF($M165<=GoalEntryData!$D$11,1,0),IF(GoalEntryData!$C$11=\">=\",IF($M165>=GoalEntryData!$D$11,1,0),\"\")))","v":""},"",{"$f":"IF($M165=\"\",\"\",IF(GoalEntryData!$C$12=\"<=\",IF($M165<=GoalEntryData!$D$12,1,0),IF(GoalEntryData!$C$10=\">=\",IF($M165>=GoalEntryData!$D$12,1,0),\"\")))","v":""},"",{"$f":"IF($M165=\"\",\"\",IF(GoalEntryData!$C$10=\"<=\",IF($M165<=GoalEntryData!$D$10,1,0),IF(GoalEntryData!$C$10=\">=\",IF($M165>=GoalEntryData!$D$10,1,0),\"\")))","v":""},""]
[null,null,null,{"$f":"IF($B166=\"\",\"\",IF(GoalEntryData!$C$6=\"<=\",IF($B166<=GoalEntryData!$D$6,1,0),IF(GoalEntryData!$C$6=\">=\",IF($B166>=GoalEntryData!$D$6,1,0),\"\")))","v":""},"",{"$f":"IF($B166=\"\",\"\",IF(GoalEntryData!$C$7=\"<=\",IF($B166<=GoalEntryData!$D$7,1,0),IF(GoalEntryData!$C$7=\">=\",IF($B166>=GoalEntryData!$D$7,1,0),\"\")))","v":""},"",{"$f":"IF($B166=\"\",\"\",IF(GoalEntryData!$C$8=\"<=\",IF($B166<=GoalEntryData!$D$8,1,0),IF(GoalEntryData!$C$8=\">=\",IF($B166>=GoalEntryData!$D$8,1,0),\"\")))","v":""},"",{"$f":"IF($B166=\"\",\"\",IF(GoalEntryData!$C$6=\"<=\",IF($B166<=GoalEntryData!$D$6,1,0),IF(GoalEntryData!$C$6=\">=\",IF($B166>=GoalEntryData!$D$6,1,0),\"\")))","v":""},"",null,null,null,{"$f":"IF($M166=\"\",\"\",IF(GoalEntryData!$C$10=\"<=\",IF($M166<=GoalEntryData!$D$10,1,0),IF(GoalEntryData!$C$10=\">=\",IF($M166>=GoalEntryData!$D$10,1,0),\"\")))","v":""},"",{"$f":"IF($M166=\"\",\"\",IF(GoalEntryData!$C$11=\"<=\",IF($M166<=GoalEntryData!$D$11,1,0),IF(GoalEntryData!$C$11=\">=\",IF($M166>=GoalEntryData!$D$11,1,0),\"\")))","v":""},"",{"$f":"IF($M166=\"\",\"\",IF(GoalEntryData!$C$12=\"<=\",IF($M166<=GoalEntryData!$D$12,1,0),IF(GoalEntryData!$C$10=\">=\",IF($M166>=GoalEntryData!$D$12,1,0),\"\")))","v":""},"",{"$f":"IF($M166=\"\",\"\",IF(GoalEntryData!$C$10=\"<=\",IF($M166<=GoalEntryData!$D$10,1,0),IF(GoalEntryData!$C$10=\">=\",IF($M166>=GoalEntryData!$D$10,1,0),\"\")))","v":""},""]
[null,null,null,{"$f":"IF($B167=\"\",\"\",IF(GoalEntryData!$C$6=\"<=\",IF($B167<=GoalEntryData!$D$6,1,0),IF(GoalEntryData!$C$6=\">=\",IF($B167>=GoalEntryData!$D$6,1,0),\"\")))","v":""},"",{"$f":"IF($B167=\"\",\"\",IF(GoalEntryData!$C$7=\"<=\",IF($B167<=GoalEntryData!$D$7,1,0),IF(GoalEntryData!$C$7=\">=\",IF($B167>=GoalEntryData!$D$7,1,0),\"\")))","v":""},"",{"$f":"IF($B167=\"\",\"\",IF(GoalEntryData!$C$8=\"<=\",IF($B167<=GoalEntryData!$D$8,1,0),IF(GoalEntryData!$C$8=\">=\",IF($B167>=GoalEntryData!$D$8,1,0),\"\")))","v":""},"",{"$f":"IF($B167=\"\",\"\",IF(GoalEntryData!$C$6=\"<=\",IF($B167<=GoalEntryData!$D$6,1,0),IF(GoalEntryData!$C$6=\">=\",IF($B167>=GoalEntryData!$D$6,1,0),\"\")))","v":""},"",null,null,null,{"$f":"IF($M167=\"\",\"\",IF(GoalEntryData!$C$10=\"<=\",IF($M167<=GoalEntryData!$D$10,1,0),IF(GoalEntryData!$C$10=\">=\",IF($M167>=GoalEntryData!$D$10,1,0),\"\")))","v":""},"",{"$f":"IF($M167=\"\",\"\",IF(GoalEntryData!$C$11=\"<=\",IF($M167<=GoalEntryData!$D$11,1,0),IF(GoalEntryData!$C$11=\">=\",IF($M167>=GoalEntryData!$D$11,1,0),\"\")))","v":""},"",{"$f":"IF($M167=\"\",\"\",IF(GoalEntryData!$C$12=\"<=\",IF($M167<=GoalEntryData!$D$12,1,0),IF(GoalEntryData!$C$10=\">=\",IF($M167>=GoalEntryData!$D$12,1,0),\"\")))","v":""},"",{"$f":"IF($M167=\"\",\"\",IF(GoalEntryData!$C$10=\"<=\",IF($M167<=GoalEntryData!$D$10,1,0),IF(GoalEntryData!$C$10=\">=\",IF($M167>=GoalEntryData!$D$10,1,0),\"\")))","v":""},""]
[null,null,null,{"$f":"IF($B168=\"\",\"\",IF(GoalEntryData!$C$6=\"<=\",IF($B168<=GoalEntryData!$D$6,1,0),IF(GoalEntryData!$C$6=\">=\",IF($B168>=GoalEntryData!$D$6,1,0),\"\")))","v":""},"",{"$f":"IF($B168=\"\",\"\",IF(GoalEntryData!$C$7=\"<=\",IF($B168<=GoalEntryData!$D$7,1,0),IF(GoalEntryData!$C$7=\">=\",IF($B168>=GoalEntryData!$D$7,1,0),\"\")))","v":""},"",{"$f":"IF($B168=\"\",\"\",IF(GoalEntryData!$C$8=\"<=\",IF($B168<=GoalEntryData!$D$8,1,0),IF(GoalEntryData!$C$8=\">=\",IF($B168>=GoalEntryData!$D$8,1,0),\"\")))","v":""},"",{"$f":"IF($B168=\"\",\"\",IF(GoalEntryData!$C$6=\"<=\",IF($B168<=GoalEntryData!$D$6,1,0),IF(GoalEntryData!$C$6=\">=\",IF($B168>=GoalEntryData!$D$6,1,0),\"\")))","v":""},"",null,null,null,{"$f":"IF($M168=\"\",\"\",IF(GoalEntryData!$C$10=\"<=\",IF($M168<=GoalEntryData!$D$10,1,0),IF(GoalEntryData!$C$10=\">=\",IF($M168>=GoalEntryData!$D$10,1,0),\"\")))","v":""},"",{"$f":"IF($M168=\"\",\"\",IF(GoalEntryData!$C$11=\"<=\",IF($M168<=GoalEntryData!$D$11,1,0),IF(GoalEntryData!$C$11=\">=\",IF($M168>=GoalEntryData!$D$11,1,0),\"\")))","v":""},"",{"$f":"IF($M168=\"\",\"\",IF(GoalEntryData!$C$12=\"<=\",IF($M168<=GoalEntryData!$D$12,1,0),IF(GoalEntryData!$C$10=\">=\",IF($M168>=GoalEntryData!$D$12,1,0),\"\")))","v":""},"",{"$f":"IF($M168=\"\",\"\",IF(GoalEntryData!$C$10=\"<=\",IF($M168<=GoalEntryData!$D$10,1,0),IF(GoalEntryData!$C$10=\">=\",IF($M168>=GoalEntryData!$D$10,1,0),\"\")))","v":""},""]
[null,null,null,{"$f":"IF($B169=\"\",\"\",IF(GoalEntryData!$C$6=\"<=\",IF($B169<=GoalEntryData!$D$6,1,0),IF(GoalEntryData!$C$6=\">=\",IF($B169>=GoalEntryData!$D$6,1,0),\"\")))","v":""},"",{"$f":"IF($B169=\"\",\"\",IF(GoalEntryData!$C$7=\"<=\",IF($B169<=GoalEntryData!$D$7,1,0),IF(GoalEntryData!$C$7=\">=\",IF($B169>=GoalEntryData!$D$7,1,0),\"\")))","v":""},"",{"$f":"IF($B169=\"\",\"\",IF(GoalEntryData!$C$8=\"<=\",IF($B169<=GoalEntryData!$D$8,1,0),IF(GoalEntryData!$C$8=\">=\",IF($B169>=GoalEntryData!$D$8,1,0),\"\")))","v":""},"",{"$f":"IF($B169=\"\",\"\",IF(GoalEntryData!$C$6=\"<=\",IF($B169<=GoalEntryData!$D$6,1,0),IF(GoalEntryData!$C$6=\">=\",IF($B169>=GoalEntryData!$D$6,1,0),\"\")))","v":""},"",null,null,null,{"$f":"IF($M169=\"\",\"\",IF(GoalEntryData!$C$10=\"<=\",IF($M169<=GoalEntryData!$D$10,1,0),IF(GoalEntryData!$C$10=\">=\",IF($M169>=GoalEntryData!$D$10,1,0),\"\")))","v":""},"",{"$f":"IF($M169=\"\",\"\",IF(GoalEntryData!$C$11=\"<=\",IF($M169<=GoalEntryData!$D$11,1,0),IF(GoalEntryData!$C$11=\">=\",IF($M169>=GoalEntryData!$D$11,1,0),\"\")))","v":""},"",{"$f":"IF($M169=\"\",\"\",IF(GoalEntryData!$C$12=\"<=\",IF($M169<=GoalEntryData!$D$12,1,0),IF(GoalEntryData!$C$10=\">=\",IF($M169>=GoalEntryData!$D$12,1,0),\"\")))","v":""},"",{"$f":"IF($M169=\"\",\"\",IF(GoalEntryData!$C$10=\"<=\",IF($M169<=GoalEntryData!$D$10,1,0),IF(GoalEntryData!$C$10=\">=\",IF($M169>=GoalEntryData!$D$10,1,0),\"\")))","v":""},""]
[null,null,null,{"$f":"IF($B170=\"\",\"\",IF(GoalEntryData!$C$6=\"<=\",IF($B170<=GoalEntryData!$D$6,1,0),IF(GoalEntryData!$C$6=\">=\",IF($B170>=GoalEntryData!$D$6,1,0),\"\")))","v":""},"",{"$f":"IF($B170=\"\",\"\",IF(GoalEntryData!$C$7=\"<=\",IF($B170<=GoalEntryData!$D$7,1,0),IF(GoalEntryData!$C$7=\">=\",IF($B170>=GoalEntryData!$D$7,1,0),\"\")))","v":""},"",{"$f":"IF($B170=\"\",\"\",IF(GoalEntryData!$C$8=\"<=\",IF($B170<=GoalEntryData!$D$8,1,0),IF(GoalEntryData!$C$8=\">=\",IF($B170>=GoalEntryData!$D$8,1,0),\"\")))","v":""},"",{"$f":"IF($B170=\"\",\"\",IF(GoalEntryData!$C$6=\"<=\",IF($B170<=GoalEntryData!$D$6,1,0),IF(GoalEntryData!$C$6=\">=\",IF($B170>=GoalEntryData!$D$6,1,0),\"\")))","v":""},"",null,null,null,{"$f":"IF($M170=\"\",\"\",IF(GoalEntryData!$C$10=\"<=\",IF($M170<=GoalEntryData!$D$10,1,0),IF(GoalEntryData!$C$10=\">=\",IF($M170>=GoalEntryData!$D$10,1,0),\"\")))","v":""},"",{"$f":"IF($M170=\"\",\"\",IF(GoalEntryData!$C$11=\"<=\",IF($M170<=GoalEntryData!$D$11,1,0),IF(GoalEntryData!$C$11=\">=\",IF($M170>=GoalEntryData!$D$11,1,0),\"\")))","v":""},"",{"$f":"IF($M170=\"\",\"\",IF(GoalEntryData!$C$12=\"<=\",IF($M170<=GoalEntryData!$D$12,1,0),IF(GoalEntryData!$C$10=\">=\",IF($M170>=GoalEntryData!$D$12,1,0),\"\")))","v":""},"",{"$f":"IF($M170=\"\",\"\",IF(GoalEntryData!$C$10=\"<=\",IF($M170<=GoalEntryData!$D$10,1,0),IF(GoalEntryData!$C$10=\">=\",IF($M170>=GoalEntryData!$D$10,1,0),\"\")))","v":""},""]
[null,null,null,{"$f":"IF($B171=\"\",\"\",IF(GoalEntryData!$C$6=\"<=\",IF($B171<=GoalEntryData!$D$6,1,0),IF(GoalEntryData!$C$6=\">=\",IF($B171>=GoalEntryData!$D$6,1,0),\"\")))","v":""},"",{"$f":"IF($B171=\"\",\"\",IF(GoalEntryData!$C$7=\"<=\",IF($B171<=GoalEntryData!$D$7,1,0),IF(GoalEntryData!$C$7=\">=\",IF($B171>=GoalEntryData!$D$7,1,0),\"\")))","v":""},"",{"$f":"IF($B171=\"\",\"\",IF(GoalEntryData!$C$8=\"<=\",IF($B171<=GoalEntryData!$D$8,1,0),IF(GoalEntryData!$C$8=\">=\",IF($B171>=GoalEntryData!$D$8,1,0),\"\")))","v":""},"",{"$f":"IF($B171=\"\",\"\",IF(GoalEntryData!$C$6=\"<=\",IF($B171<=GoalEntryData!$D$6,1,0),IF(GoalEntryData!$C$6=\">=\",IF($B171>=GoalEntryData!$D$6,1,0),\"\")))","v":""},"",null,null,null,{"$f":"IF($M171=\"\",\"\",IF(GoalEntryData!$C$10=\"<=\",IF($M171<=GoalEntryData!$D$10,1,0),IF(GoalEntryData!$C$10=\">=\",IF($M171>=GoalEntryData!$D$10,1,0),\"\")))","v":""},"",{"$f":"IF($M171=\"\",\"\",IF(GoalEntryData!$C$11=\"<=\",IF($M171<=GoalEntryData!$D$11,1,0),IF(GoalEntryData!$C$11=\">=\",IF($M171>=GoalEntryData!$D$11,1,0),\"\")))","v":""},"",{"$f":"IF($M171=\"\",\"\",IF(GoalEntryData!$C$12=\"<=\",IF($M171<=GoalEntryData!$D$12,1,0),IF(GoalEntryData!$C$10=\">=\",IF($M171>=GoalEntryData!$D$12,1,0),\"\")))","v":""},"",{"$f":"IF($M171=\"\",\"\",IF(GoalEntryData!$C$10=\"<=\",IF($M171<=GoalEntryData!$D$10,1,0),IF(GoalEntryData!$C$10=\">=\",IF($M171>=GoalEntryData!$D$10,1,0),\"\")))","v":""},""]
[null,null,null,{"$f":"IF($B172=\"\",\"\",IF(GoalEntryData!$C$6=\"<=\",IF($B172<=GoalEntryData!$D$6,1,0),IF(GoalEntryData!$C$6=\">=\",IF($B172>=GoalEntryData!$D$6,1,0),\"\")))","v":""},"",{"$f":"IF($B172=\"\",\"\",IF(GoalEntryData!$C$7=\"<=\",IF($B172<=GoalEntryData!$D$7,1,0),IF(GoalEntryData!$C$7=\">=\",IF($B172>=GoalEntryData!$D$7,1,0),\"\")))","v":""},"",{"$f":"IF($B172=\"\",\"\",IF(GoalEntryData!$C$8=\"<=\",IF($B172<=GoalEntryData!$D$8,1,0),IF(GoalEntryData!$C$8=\">=\",IF($B172>=GoalEntryData!$D$8,1,0),\"\")))","v":""},"",{"$f":"IF($B172=\"\",\"\",IF(GoalEntryData!$C$6=\"<=\",IF($B172<=GoalEntryData!$D$6,1,0),IF(GoalEntryData!$C$6=\">=\",IF($B172>=GoalEntryData!$D$6,1,0),\"\")))","v":""},"",null,null,null,{"$f":"IF($M172=\"\",\"\",IF(GoalEntryData!$C$10=\"<=\",IF($M172<=GoalEntryData!$D$10,1,0),IF(GoalEntryData!$C$10=\">=\",IF($M172>=GoalEntryData!$D$10,1,0),\"\")))","v":""},"",{"$f":"IF($M172=\"\",\"\",IF(GoalEntryData!$C$11=\"<=\",IF($M172<=GoalEntryData!$D$11,1,0),IF(GoalEntryData!$C$11=\">=\",IF($M172>=GoalEntryData!$D$11,1,0),\"\")))","v":""},"",{"$f":"IF($M172=\"\",\"\",IF(GoalEntryData!$C$12=\"<=\",IF($M172<=GoalEntryData!$D$12,1,0),IF(GoalEntryData!$C$10=\">=\",IF($M172>=GoalEntryData!$D$12,1,0),\"\")))","v":""},"",{"$f":"IF($M172=\"\",\"\",IF(GoalEntryData!$C$10=\"<=\",IF($M172<=GoalEntryData!$D$10,1,0),IF(GoalEntryData!$C$10=\">=\",IF($M172>=GoalEntryData!$D$10,1,0),\"\")))","v":""},""]
[null,null,null,{"$f":"IF($B173=\"\",\"\",IF(GoalEntryData!$C$6=\"<=\",IF($B173<=GoalEntryData!$D$6,1,0),IF(GoalEntryData!$C$6=\">=\",IF($B173>=GoalEntryData!$D$6,1,0),\"\")))","v":""},"",{"$f":"IF($B173=\"\",\"\",IF(GoalEntryData!$C$7=\"<=\",IF($B173<=GoalEntryData!$D$7,1,0),IF(GoalEntryData!$C$7=\">=\",IF($B173>=GoalEntryData!$D$7,1,0),\"\")))","v":""},"",{"$f":"IF($B173=\"\",\"\",IF(GoalEntryData!$C$8=\"<=\",IF($B173<=GoalEntryData!$D$8,1,0),IF(GoalEntryData!$C$8=\">=\",IF($B173>=GoalEntryData!$D$8,1,0),\"\")))","v":""},"",{"$f":"IF($B173=\"\",\"\",IF(GoalEntryData!$C$6=\"<=\",IF($B173<=GoalEntryData!$D$6,1,0),IF(GoalEntryData!$C$6=\">=\",IF($B173>=GoalEntryData!$D$6,1,0),\"\")))","v":""},"",null,null,null,{"$f":"IF($M173=\"\",\"\",IF(GoalEntryData!$C$10=\"<=\",IF($M173<=GoalEntryData!$D$10,1,0),IF(GoalEntryData!$C$10=\">=\",IF($M173>=GoalEntryData!$D$10,1,0),\"\")))","v":""},"",{"$f":"IF($M173=\"\",\"\",IF(GoalEntryData!$C$11=\"<=\",IF($M173<=GoalEntryData!$D$11,1,0),IF(GoalEntryData!$C$11=\">=\",IF($M173>=GoalEntryData!$D$11,1,0),\"\")))","v":""},"",{"$f":"IF($M173=\"\",\"\",IF(GoalEntryData!$C$12=\"<=\",IF($M173<=GoalEntryData!$D$12,1,0),IF(GoalEntryData!$C$10=\">=\",IF($M173>=GoalEntryData!$D$12,1,0),\"\")))","v":""},"",{"$f":"IF($M173=\"\",\"\",IF(GoalEntryData!$C$10=\"<=\",IF($M173<=GoalEntryData!$D$10,1,0),IF(GoalEntryData!$C$10=\">=\",IF($M173>=GoalEntryData!$D$10,1,0),\"\")))","v":""},""]
[null,null,null,{"$f":"IF($B174=\"\",\"\",IF(GoalEntryData!$C$6=\"<=\",IF($B174<=GoalEntryData!$D$6,1,0),IF(GoalEntryData!$C$6=\">=\",IF($B174>=GoalEntryData!$D$6,1,0),\"\")))","v":""},"",{"$f":"IF($B174=\"\",\"\",IF(GoalEntryData!$C$7=\"<=\",IF($B174<=GoalEntryData!$D$7,1,0),IF(GoalEntryData!$C$7=\">=\",IF($B174>=GoalEntryData!$D$7,1,0),\"\")))","v":""},"",{"$f":"IF($B174=\"\",\"\",IF(GoalEntryData!$C$8=\"<=\",IF($B174<=GoalEntryData!$D$8,1,0),IF(GoalEntryData!$C$8=\">=\",IF($B174>=GoalEntryData!$D$8,1,0),\"\")))","v":""},"",{"$f":"IF($B174=\"\",\"\",IF(GoalEntryData!$C$6=\"<=\",IF($B174<=GoalEntryData!$D$6,1,0),IF(GoalEntryData!$C$6=\">=\",IF($B174>=GoalEntryData!$D$6,1,0),\"\")))","v":""},"",null,null,null,{"$f":"IF($M174=\"\",\"\",IF(GoalEntryData!$C$10=\"<=\",IF($M174<=GoalEntryData!$D$10,1,0),IF(GoalEntryData!$C$10=\">=\",IF($M174>=GoalEntryData!$D$10,1,0),\"\")))","v":""},"",{"$f":"IF($M174=\"\",\"\",IF(GoalEntryData!$C$11=\"<=\",IF($M174<=GoalEntryData!$D$11,1,0),IF(GoalEntryData!$C$11=\">=\",IF($M174>=GoalEntryData!$D$11,1,0),\"\")))","v":""},"",{"$f":"IF($M174=\"\",\"\",IF(GoalEntryData!$C$12=\"<=\",IF($M174<=GoalEntryData!$D$12,1,0),IF(GoalEntryData!$C$10=\">=\",IF($M174>=GoalEntryData!$D$12,1,0),\"\")))","v":""},"",{"$f":"IF($M174=\"\",\"\",IF(GoalEntryData!$C$10=\"<=\",IF($M174<=GoalEntryData!$D$10,1,0),IF(GoalEntryData!$C$10=\">=\",IF($M174>=GoalEntryData!$D$10,1,0),\"\")))","v":""},""]
[null,null,null,{"$f":"IF($B175=\"\",\"\",IF(GoalEntryData!$C$6=\"<=\",IF($B175<=GoalEntryData!$D$6,1,0),IF(GoalEntryData!$C$6=\">=\",IF($B175>=GoalEntryData!$D$6,1,0),\"\")))","v":""},"",{"$f":"IF($B175=\"\",\"\",IF(GoalEntryData!$C$7=\"<=\",IF($B175<=GoalEntryData!$D$7,1,0),IF(GoalEntryData!$C$7=\">=\",IF($B175>=GoalEntryData!$D$7,1,0),\"\")))","v":""},"",{"$f":"IF($B175=\"\",\"\",IF(GoalEntryData!$C$8=\"<=\",IF($B175<=GoalEntryData!$D$8,1,0),IF(GoalEntryData!$C$8=\">=\",IF($B175>=GoalEntryData!$D$8,1,0),\"\")))","v":""},"",{"$f":"IF($B175=\"\",\"\",IF(GoalEntryData!$C$6=\"<=\",IF($B175<=GoalEntryData!$D$6,1,0),IF(GoalEntryData!$C$6=\">=\",IF($B175>=GoalEntryData!$D$6,1,0),\"\")))","v":""},"",null,null,null,{"$f":"IF($M175=\"\",\"\",IF(GoalEntryData!$C$10=\"<=\",IF($M175<=GoalEntryData!$D$10,1,0),IF(GoalEntryData!$C$10=\">=\",IF($M175>=GoalEntryData!$D$10,1,0),\"\")))","v":""},"",{"$f":"IF($M175=\"\",\"\",IF(GoalEntryData!$C$11=\"<=\",IF($M175<=GoalEntryData!$D$11,1,0),IF(GoalEntryData!$C$11=\">=\",IF($M175>=GoalEntryData!$D$11,1,0),\"\")))","v":""},"",{"$f":"IF($M175=\"\",\"\",IF(GoalEntryData!$C$12=\"<=\",IF($M175<=GoalEntryData!$D$12,1,0),IF(GoalEntryData!$C$10=\">=\",IF($M175>=GoalEntryData!$D$12,1,0),\"\")))","v":""},"",{"$f":"IF($M175=\"\",\"\",IF(GoalEntryData!$C$10=\"<=\",IF($M175<=GoalEntryData!$D$10,1,0),IF(GoalEntryData!$C$10=\">=\",IF($M175>=GoalEntryData!$D$10,1,0),\"\")))","v":""},""]
[null,null,null,{"$f":"IF($B176=\"\",\"\",IF(GoalEntryData!$C$6=\"<=\",IF($B176<=GoalEntryData!$D$6,1,0),IF(GoalEntryData!$C$6=\">=\",IF($B176>=GoalEntryData!$D$6,1,0),\"\")))","v":""},"",{"$f":"IF($B176=\"\",\"\",IF(GoalEntryData!$C$7=\"<=\",IF($B176<=GoalEntryData!$D$7,1,0),IF(GoalEntryData!$C$7=\">=\",IF($B176>=GoalEntryData!$D$7,1,0),\"\")))","v":""},"",{"$f":"IF($B176=\"\",\"\",IF(GoalEntryData!$C$8=\"<=\",IF($B176<=GoalEntryData!$D$8,1,0),IF(GoalEntryData!$C$8=\">=\",IF($B176>=GoalEntryData!$D$8,1,0),\"\")))","v":""},"",{"$f":"IF($B176=\"\",\"\",IF(GoalEntryData!$C$6=\"<=\",IF($B176<=GoalEntryData!$D$6,1,0),IF(GoalEntryData!$C$6=\">=\",IF($B176>=GoalEntryData!$D$6,1,0),\"\")))","v":""},"",null,null,null,{"$f":"IF($M176=\"\",\"\",IF(GoalEntryData!$C$10=\"<=\",IF($M176<=GoalEntryData!$D$10,1,0),IF(GoalEntryData!$C$10=\">=\",IF($M176>=GoalEntryData!$D$10,1,0),\"\")))","v":""},"",{"$f":"IF($M176=\"\",\"\",IF(GoalEntryData!$C$11=\"<=\",IF($M176<=GoalEntryData!$D$11,1,0),IF(GoalEntryData!$C$11=\">=\",IF($M176>=GoalEntryData!$D$11,1,0),\"\")))","v":""},"",{"$f":"IF($M176=\"\",\"\",IF(GoalEntryData!$C$12=\"<=\",IF($M176<=GoalEntryData!$D$12,1,0),IF(GoalEntryData!$C$10=\">=\",IF($M176>=GoalEntryData!$D$12,1,0),\"\")))","v":""},"",{"$f":"IF($M176=\"\",\"\",IF(GoalEntryData!$C$10=\"<=\",IF($M176<=GoalEntryData!$D$10,1,0),IF(GoalEntryData!$C$10=\">=\",IF($M176>=GoalEntryData!$D$10,1,0),\"\")))","v":""},""]
[null,null,null,{"$f":"IF($B177=\"\",\"\",IF(GoalEntryData!$C$6=\"<=\",IF($B177<=GoalEntryData!$D$6,1,0),IF(GoalEntryData!$C$6=\">=\",IF($B177>=GoalEntryData!$D$6,1,0),\"\")))","v":""},"",{"$f":"IF($B177=\"\",\"\",IF(GoalEntryData!$C$7=\"<=\",IF($B177<=GoalEntryData!$D$7,1,0),IF(GoalEntryData!$C$7=\">=\",IF($B177>=GoalEntryData!$D$7,1,0),\"\")))","v":""},"",{"$f":"IF($B177=\"\",\"\",IF(GoalEntryData!$C$8=\"<=\",IF($B177<=GoalEntryData!$D$8,1,0),IF(GoalEntryData!$C$8=\">=\",IF($B177>=GoalEntryData!$D$8,1,0),\"\")))","v":""},"",{"$f":"IF($B177=\"\",\"\",IF(GoalEntryData!$C$6=\"<=\",IF($B177<=GoalEntryData!$D$6,1,0),IF(GoalEntryData!$C$6=\">=\",IF($B177>=GoalEntryData!$D$6,1,0),\"\")))","v":""},"",null,null,null,{"$f":"IF($M177=\"\",\"\",IF(GoalEntryData!$C$10=\"<=\",IF($M177<=GoalEntryData!$D$10,1,0),IF(GoalEntryData!$C$10=\">=\",IF($M177>=GoalEntryData!$D$10,1,0),\"\")))","v":""},"",{"$f":"IF($M177=\"\",\"\",IF(GoalEntryData!$C$11=\"<=\",IF($M177<=GoalEntryData!$D$11,1,0),IF(GoalEntryData!$C$11=\">=\",IF($M177>=GoalEntryData!$D$11,1,0),\"\")))","v":""},"",{"$f":"IF($M177=\"\",\"\",IF(GoalEntryData!$C$12=\"<=\",IF($M177<=GoalEntryData!$D$12,1,0),IF(GoalEntryData!$C$10=\">=\",IF($M177>=GoalEntryData!$D$12,1,0),\"\")))","v":""},"",{"$f":"IF($M177=\"\",\"\",IF(GoalEntryData!$C$10=\"<=\",IF($M177<=GoalEntryData!$D$10,1,0),IF(GoalEntryData!$C$10=\">=\",IF($M177>=GoalEntryData!$D$10,1,0),\"\")))","v":""},""]
[null,null,null,{"$f":"IF($B178=\"\",\"\",IF(GoalEntryData!$C$6=\"<=\",IF($B178<=GoalEntryData!$D$6,1,0),IF(GoalEntryData!$C$6=\">=\",IF($B178>=GoalEntryData!$D$6,1,0),\"\")))","v":""},"",{"$f":"IF($B178=\"\",\"\",IF(GoalEntryData!$C$7=\"<=\",IF($B178<=GoalEntryData!$D$7,1,0),IF(GoalEntryData!$C$7=\">=\",IF($B178>=GoalEntryData!$D$7,1,0),\"\")))","v":""},"",{"$f":"IF($B178=\"\",\"\",IF(GoalEntryData!$C$8=\"<=\",IF($B178<=GoalEntryData!$D$8,1,0),IF(GoalEntryData!$C$8=\">=\",IF($B178>=GoalEntryData!$D$8,1,0),\"\")))","v":""},"",{"$f":"IF($B178=\"\",\"\",IF(GoalEntryData!$C$6=\"<=\",IF($B178<=GoalEntryData!$D$6,1,0),IF(GoalEntryData!$C$6=\">=\",IF($B178>=GoalEntryData!$D$6,1,0),\"\")))","v":""},"",null,null,null,{"$f":"IF($M178=\"\",\"\",IF(GoalEntryData!$C$10=\"<=\",IF($M178<=GoalEntryData!$D$10,1,0),IF(GoalEntryData!$C$10=\">=\",IF($M178>=GoalEntryData!$D$10,1,0),\"\")))","v":""},"",{"$f":"IF($M178=\"\",\"\",IF(GoalEntryData!$C$11=\"<=\",IF($M178<=GoalEntryData!$D$11,1,0),IF(GoalEntryData!$C$11=\">=\",IF($M178>=GoalEntryData!$D$11,1,0),\"\")))","v":""},"",{"$f":"IF($M178=\"\",\"\",IF(GoalEntryData!$C$12=\"<=\",IF($M178<=GoalEntryData!$D$12,1,0),IF(GoalEntryData!$C$10=\">=\",IF($M178>=GoalEntryData!$D$12,1,0),\"\")))","v":""},"",{"$f":"IF($M178=\"\",\"\",IF(GoalEntryData!$C$10=\"<=\",IF($M178<=GoalEntryData!$D$10,1,0),IF(GoalEntryData!$C$10=\">=\",IF($M178>=GoalEntryData!$D$10,1,0),\"\")))","v":""},""]
[null,null,null,{"$f":"IF($B179=\"\",\"\",IF(GoalEntryData!$C$6=\"<=\",IF($B179<=GoalEntryData!$D$6,1,0),IF(GoalEntryData!$C$6=\">=\",IF($B179>=GoalEntryData!$D$6,1,0),\"\")))","v":""},"",{"$f":"IF($B179=\"\",\"\",IF(GoalEntryData!$C$7=\"<=\",IF($B179<=GoalEntryData!$D$7,1,0),IF(GoalEntryData!$C$7=\">=\",IF($B179>=GoalEntryData!$D$7,1,0),\"\")))","v":""},"",{"$f":"IF($B179=\"\",\"\",IF(GoalEntryData!$C$8=\"<=\",IF($B179<=GoalEntryData!$D$8,1,0),IF(GoalEntryData!$C$8=\">=\",IF($B179>=GoalEntryData!$D$8,1,0),\"\")))","v":""},"",{"$f":"IF($B179=\"\",\"\",IF(GoalEntryData!$C$6=\"<=\",IF($B179<=GoalEntryData!$D$6,1,0),IF(GoalEntryData!$C$6=\">=\",IF($B179>=GoalEntryData!$D$6,1,0),\"\")))","v":""},"",null,null,null,{"$f":"IF($M179=\"\",\"\",IF(GoalEntryData!$C$10=\"<=\",IF($M179<=GoalEntryData!$D$10,1,0),IF(GoalEntryData!$C$10=\">=\",IF($M179>=GoalEntryData!$D$10,1,0),\"\")))","v":""},"",{"$f":"IF($M179=\"\",\"\",IF(GoalEntryData!$C$11=\"<=\",IF($M179<=GoalEntryData!$D$11,1,0),IF(GoalEntryData!$C$11=\">=\",IF($M179>=GoalEntryData!$D$11,1,0),\"\")))","v":""},"",{"$f":"IF($M179=\"\",\"\",IF(GoalEntryData!$C$12=\"<=\",IF($M179<=GoalEntryData!$D$12,1,0),IF(GoalEntryData!$C$10=\">=\",IF($M179>=GoalEntryData!$D$12,1,0),\"\")))","v":""},"",{"$f":"IF($M179=\"\",\"\",IF(GoalEntryData!$C$10=\"<=\",IF($M179<=GoalEntryData!$D$10,1,0),IF(GoalEntryData!$C$10=\">=\",IF($M179>=GoalEntryData!$D$10,1,0),\"\")))","v":""},""]
[null,null,null,{"$f":"IF($B180=\"\",\"\",IF(GoalEntryData!$C$6=\"<=\",IF($B180<=GoalEntryData!$D$6,1,0),IF(GoalEntryData!$C$6=\">=\",IF($B180>=GoalEntryData!$D$6,1,0),\"\")))","v":""},"",{"$f":"IF($B180=\"\",\"\",IF(GoalEntryData!$C$7=\"<=\",IF($B180<=GoalEntryData!$D$7,1,0),IF(GoalEntryData!$C$7=\">=\",IF($B180>=GoalEntryData!$D$7,1,0),\"\")))","v":""},"",{"$f":"IF($B180=\"\",\"\",IF(GoalEntryData!$C$8=\"<=\",IF($B180<=GoalEntryData!$D$8,1,0),IF(GoalEntryData!$C$8=\">=\",IF($B180>=GoalEntryData!$D$8,1,0),\"\")))","v":""},"",{"$f":"IF($B180=\"\",\"\",IF(GoalEntryData!$C$6=\"<=\",IF($B180<=GoalEntryData!$D$6,1,0),IF(GoalEntryData!$C$6=\">=\",IF($B180>=GoalEntryData!$D$6,1,0),\"\")))","v":""},"",null,null,null,{"$f":"IF($M180=\"\",\"\",IF(GoalEntryData!$C$10=\"<=\",IF($M180<=GoalEntryData!$D$10,1,0),IF(GoalEntryData!$C$10=\">=\",IF($M180>=GoalEntryData!$D$10,1,0),\"\")))","v":""},"",{"$f":"IF($M180=\"\",\"\",IF(GoalEntryData!$C$11=\"<=\",IF($M180<=GoalEntryData!$D$11,1,0),IF(GoalEntryData!$C$11=\">=\",IF($M180>=GoalEntryData!$D$11,1,0),\"\")))","v":""},"",{"$f":"IF($M180=\"\",\"\",IF(GoalEntryData!$C$12=\"<=\",IF($M180<=GoalEntryData!$D$12,1,0),IF(GoalEntryData!$C$10=\">=\",IF($M180>=GoalEntryData!$D$12,1,0),\"\")))","v":""},"",{"$f":"IF($M180=\"\",\"\",IF(GoalEntryData!$C$10=\"<=\",IF($M180<=GoalEntryData!$D$10,1,0),IF(GoalEntryData!$C$10=\">=\",IF($M180>=GoalEntryData!$D$10,1,0),\"\")))","v":""},""]
[null,null,null,{"$f":"IF($B181=\"\",\"\",IF(GoalEntryData!$C$6=\"<=\",IF($B181<=GoalEntryData!$D$6,1,0),IF(GoalEntryData!$C$6=\">=\",IF($B181>=GoalEntryData!$D$6,1,0),\"\")))","v":""},"",{"$f":"IF($B181=\"\",\"\",IF(GoalEntryData!$C$7=\"<=\",IF($B181<=GoalEntryData!$D$7,1,0),IF(GoalEntryData!$C$7=\">=\",IF($B181>=GoalEntryData!$D$7,1,0),\"\")))","v":""},"",{"$f":"IF($B181=\"\",\"\",IF(GoalEntryData!$C$8=\"<=\",IF($B181<=GoalEntryData!$D$8,1,0),IF(GoalEntryData!$C$8=\">=\",IF($B181>=GoalEntryData!$D$8,1,0),\"\")))","v":""},"",{"$f":"IF($B181=\"\",\"\",IF(GoalEntryData!$C$6=\"<=\",IF($B181<=GoalEntryData!$D$6,1,0),IF(GoalEntryData!$C$6=\">=\",IF($B181>=GoalEntryData!$D$6,1,0),\"\")))","v":""},"",null,null,null,{"$f":"IF($M181=\"\",\"\",IF(GoalEntryData!$C$10=\"<=\",IF($M181<=GoalEntryData!$D$10,1,0),IF(GoalEntryData!$C$10=\">=\",IF($M181>=GoalEntryData!$D$10,1,0),\"\")))","v":""},"",{"$f":"IF($M181=\"\",\"\",IF(GoalEntryData!$C$11=\"<=\",IF($M181<=GoalEntryData!$D$11,1,0),IF(GoalEntryData!$C$11=\">=\",IF($M181>=GoalEntryData!$D$11,1,0),\"\")))","v":""},"",{"$f":"IF($M181=\"\",\"\",IF(GoalEntryData!$C$12=\"<=\",IF($M181<=GoalEntryData!$D$12,1,0),IF(GoalEntryData!$C$10=\">=\",IF($M181>=GoalEntryData!$D$12,1,0),\"\")))","v":""},"",{"$f":"IF($M181=\"\",\"\",IF(GoalEntryData!$C$10=\"<=\",IF($M181<=GoalEntryData!$D$10,1,0),IF(GoalEntryData!$C$10=\">=\",IF($M181>=GoalEntryData!$D$10,1,0),\"\")))","v":""},""]
[null,null,null,{"$f":"IF($B182=\"\",\"\",IF(GoalEntryData!$C$6=\"<=\",IF($B182<=GoalEntryData!$D$6,1,0),IF(GoalEntryData!$C$6=\">=\",IF($B182>=GoalEntryData!$D$6,1,0),\"\")))","v":""},"",{"$f":"IF($B182=\"\",\"\",IF(GoalEntryData!$C$7=\"<=\",IF($B182<=GoalEntryData!$D$7,1,0),IF(GoalEntryData!$C$7=\">=\",IF($B182>=GoalEntryData!$D$7,1,0),\"\")))","v":""},"",{"$f":"IF($B182=\"\",\"\",IF(GoalEntryData!$C$8=\"<=\",IF($B182<=GoalEntryData!$D$8,1,0),IF(GoalEntryData!$C$8=\">=\",IF($B182>=GoalEntryData!$D$8,1,0),\"\")))","v":""},"",{"$f":"IF($B182=\"\",\"\",IF(GoalEntryData!$C$6=\"<=\",IF($B182<=GoalEntryData!$D$6,1,0),IF(GoalEntryData!$C$6=\">=\",IF($B182>=GoalEntryData!$D$6,1,0),\"\")))","v":""},"",null,null,null,{"$f":"IF($M182=\"\",\"\",IF(GoalEntryData!$C$10=\"<=\",IF($M182<=GoalEntryData!$D$10,1,0),IF(GoalEntryData!$C$10=\">=\",IF($M182>=GoalEntryData!$D$10,1,0),\"\")))","v":""},"",{"$f":"IF($M182=\"\",\"\",IF(GoalEntryData!$C$11=\"<=\",IF($M182<=GoalEntryData!$D$11,1,0),IF(GoalEntryData!$C$11=\">=\",IF($M182>=GoalEntryData!$D$11,1,0),\"\")))","v":""},"",{"$f":"IF($M182=\"\",\"\",IF(GoalEntryData!$C$12=\"<=\",IF($M182<=GoalEntryData!$D$12,1,0),IF(GoalEntryData!$C$10=\">=\",IF($M182>=GoalEntryData!$D$12,1,0),\"\")))","v":""},"",{"$f":"IF($M182=\"\",\"\",IF(GoalEntryData!$C$10=\"<=\",IF($M182<=GoalEntryData!$D$10,1,0),IF(GoalEntryData!$C$10=\">=\",IF($M182>=GoalEntryData!$D$10,1,0),\"\")))","v":""},""]
[null,null,null,{"$f":"IF($B183=\"\",\"\",IF(GoalEntryData!$C$6=\"<=\",IF($B183<=GoalEntryData!$D$6,1,0),IF(GoalEntryData!$C$6=\">=\",IF($B183>=GoalEntryData!$D$6,1,0),\"\")))","v":""},"",{"$f":"IF($B183=\"\",\"\",IF(GoalEntryData!$C$7=\"<=\",IF($B183<=GoalEntryData!$D$7,1,0),IF(GoalEntryData!$C$7=\">=\",IF($B183>=GoalEntryData!$D$7,1,0),\"\")))","v":""},"",{"$f":"IF($B183=\"\",\"\",IF(GoalEntryData!$C$8=\"<=\",IF($B183<=GoalEntryData!$D$8,1,0),IF(GoalEntryData!$C$8=\">=\",IF($B183>=GoalEntryData!$D$8,1,0),\"\")))","v":""},"",{"$f":"IF($B183=\"\",\"\",IF(GoalEntryData!$C$6=\"<=\",IF($B183<=GoalEntryData!$D$6,1,0),IF(GoalEntryData!$C$6=\">=\",IF($B183>=GoalEntryData!$D$6,1,0),\"\")))","v":""},"",null,null,null,{"$f":"IF($M183=\"\",\"\",IF(GoalEntryData!$C$10=\"<=\",IF($M183<=GoalEntryData!$D$10,1,0),IF(GoalEntryData!$C$10=\">=\",IF($M183>=GoalEntryData!$D$10,1,0),\"\")))","v":""},"",{"$f":"IF($M183=\"\",\"\",IF(GoalEntryData!$C$11=\"<=\",IF($M183<=GoalEntryData!$D$11,1,0),IF(GoalEntryData!$C$11=\">=\",IF($M183>=GoalEntryData!$D$11,1,0),\"\")))","v":""},"",{"$f":"IF($M183=\"\",\"\",IF(GoalEntryData!$C$12=\"<=\",IF($M183<=GoalEntryData!$D$12,1,0),IF(GoalEntryData!$C$10=\">=\",IF($M183>=GoalEntryData!$D$12,1,0),\"\")))","v":""},"",{"$f":"IF($M183=\"\",\"\",IF(GoalEntryData!$C$10=\"<=\",IF($M183<=GoalEntryData!$D$10,1,0),IF(GoalEntryData!$C$10=\">=\",IF($M183>=GoalEntryData!$D$10,1,0),\"\")))","v":""},""]
[null,null,null,{"$f":"IF($B184=\"\",\"\",IF(GoalEntryData!$C$6=\"<=\",IF($B184<=GoalEntryData!$D$6,1,0),IF(GoalEntryData!$C$6=\">=\",IF($B184>=GoalEntryData!$D$6,1,0),\"\")))","v":""},"",{"$f":"IF($B184=\"\",\"\",IF(GoalEntryData!$C$7=\"<=\",IF($B184<=GoalEntryData!$D$7,1,0),IF(GoalEntryData!$C$7=\">=\",IF($B184>=GoalEntryData!$D$7,1,0),\"\")))","v":""},"",{"$f":"IF($B184=\"\",\"\",IF(GoalEntryData!$C$8=\"<=\",IF($B184<=GoalEntryData!$D$8,1,0),IF(GoalEntryData!$C$8=\">=\",IF($B184>=GoalEntryData!$D$8,1,0),\"\")))","v":""},"",{"$f":"IF($B184=\"\",\"\",IF(GoalEntryData!$C$6=\"<=\",IF($B184<=GoalEntryData!$D$6,1,0),IF(GoalEntryData!$C$6=\">=\",IF($B184>=GoalEntryData!$D$6,1,0),\"\")))","v":""},"",null,null,null,{"$f":"IF($M184=\"\",\"\",IF(GoalEntryData!$C$10=\"<=\",IF($M184<=GoalEntryData!$D$10,1,0),IF(GoalEntryData!$C$10=\">=\",IF($M184>=GoalEntryData!$D$10,1,0),\"\")))","v":""},"",{"$f":"IF($M184=\"\",\"\",IF(GoalEntryData!$C$11=\"<=\",IF($M184<=GoalEntryData!$D$11,1,0),IF(GoalEntryData!$C$11=\">=\",IF($M184>=GoalEntryData!$D$11,1,0),\"\")))","v":""},"",{"$f":"IF($M184=\"\",\"\",IF(GoalEntryData!$C$12=\"<=\",IF($M184<=GoalEntryData!$D$12,1,0),IF(GoalEntryData!$C$10=\">=\",IF($M184>=GoalEntryData!$D$12,1,0),\"\")))","v":""},"",{"$f":"IF($M184=\"\",\"\",IF(GoalEntryData!$C$10=\"<=\",IF($M184<=GoalEntryData!$D$10,1,0),IF(GoalEntryData!$C$10=\">=\",IF($M184>=GoalEntryData!$D$10,1,0),\"\")))","v":""},""]
[null,null,null,{"$f":"IF($B185=\"\",\"\",IF(GoalEntryData!$C$6=\"<=\",IF($B185<=GoalEntryData!$D$6,1,0),IF(GoalEntryData!$C$6=\">=\",IF($B185>=GoalEntryData!$D$6,1,0),\"\")))","v":""},"",{"$f":"IF($B185=\"\",\"\",IF(GoalEntryData!$C$7=\"<=\",IF($B185<=GoalEntryData!$D$7,1,0),IF(GoalEntryData!$C$7=\">=\",IF($B185>=GoalEntryData!$D$7,1,0),\"\")))","v":""},"",{"$f":"IF($B185=\"\",\"\",IF(GoalEntryData!$C$8=\"<=\",IF($B185<=GoalEntryData!$D$8,1,0),IF(GoalEntryData!$C$8=\">=\",IF($B185>=GoalEntryData!$D$8,1,0),\"\")))","v":""},"",{"$f":"IF($B185=\"\",\"\",IF(GoalEntryData!$C$6=\"<=\",IF($B185<=GoalEntryData!$D$6,1,0),IF(GoalEntryData!$C$6=\">=\",IF($B185>=GoalEntryData!$D$6,1,0),\"\")))","v":""},"",null,null,null,{"$f":"IF($M185=\"\",\"\",IF(GoalEntryData!$C$10=\"<=\",IF($M185<=GoalEntryData!$D$10,1,0),IF(GoalEntryData!$C$10=\">=\",IF($M185>=GoalEntryData!$D$10,1,0),\"\")))","v":""},"",{"$f":"IF($M185=\"\",\"\",IF(GoalEntryData!$C$11=\"<=\",IF($M185<=GoalEntryData!$D$11,1,0),IF(GoalEntryData!$C$11=\">=\",IF($M185>=GoalEntryData!$D$11,1,0),\"\")))","v":""},"",{"$f":"IF($M185=\"\",\"\",IF(GoalEntryData!$C$12=\"<=\",IF($M185<=GoalEntryData!$D$12,1,0),IF(GoalEntryData!$C$10=\">=\",IF($M185>=GoalEntryData!$D$12,1,0),\"\")))","v":""},"",{"$f":"IF($M185=\"\",\"\",IF(GoalEntryData!$C$10=\"<=\",IF($M185<=GoalEntryData!$D$10,1,0),IF(GoalEntryData!$C$10=\">=\",IF($M185>=GoalEntryData!$D$10,1,0),\"\")))","v":""},""]
[null,null,null,{"$f":"IF($B186=\"\",\"\",IF(GoalEntryData!$C$6=\"<=\",IF($B186<=GoalEntryData!$D$6,1,0),IF(GoalEntryData!$C$6=\">=\",IF($B186>=GoalEntryData!$D$6,1,0),\"\")))","v":""},"",{"$f":"IF($B186=\"\",\"\",IF(GoalEntryData!$C$7=\"<=\",IF($B186<=GoalEntryData!$D$7,1,0),IF(GoalEntryData!$C$7=\">=\",IF($B186>=GoalEntryData!$D$7,1,0),\"\")))","v":""},"",{"$f":"IF($B186=\"\",\"\",IF(GoalEntryData!$C$8=\"<=\",IF($B186<=GoalEntryData!$D$8,1,0),IF(GoalEntryData!$C$8=\">=\",IF($B186>=GoalEntryData!$D$8,1,0),\"\")))","v":""},"",{"$f":"IF($B186=\"\",\"\",IF(GoalEntryData!$C$6=\"<=\",IF($B186<=GoalEntryData!$D$6,1,0),IF(GoalEntryData!$C$6=\">=\",IF($B186>=GoalEntryData!$D$6,1,0),\"\")))","v":""},"",null,null,null,{"$f":"IF($M186=\"\",\"\",IF(GoalEntryData!$C$10=\"<=\",IF($M186<=GoalEntryData!$D$10,1,0),IF(GoalEntryData!$C$10=\">=\",IF($M186>=GoalEntryData!$D$10,1,0),\"\")))","v":""},"",{"$f":"IF($M186=\"\",\"\",IF(GoalEntryData!$C$11=\"<=\",IF($M186<=GoalEntryData!$D$11,1,0),IF(GoalEntryData!$C$11=\">=\",IF($M186>=GoalEntryData!$D$11,1,0),\"\")))","v":""},"",{"$f":"IF($M186=\"\",\"\",IF(GoalEntryData!$C$12=\"<=\",IF($M186<=GoalEntryData!$D$12,1,0),IF(GoalEntryData!$C$10=\">=\",IF($M186>=GoalEntryData!$D$12,1,0),\"\")))","v":""},"",{"$f":"IF($M186=\"\",\"\",IF(GoalEntryData!$C$10=\"<=\",IF($M186<=GoalEntryData!$D$10,1,0),IF(GoalEntryData!$C$10=\">=\",IF($M186>=GoalEntryData!$D$10,1,0),\"\")))","v":""},""]
[null,null,null,{"$f":"IF($B187=\"\",\"\",IF(GoalEntryData!$C$6=\"<=\",IF($B187<=GoalEntryData!$D$6,1,0),IF(GoalEntryData!$C$6=\">=\",IF($B187>=GoalEntryData!$D$6,1,0),\"\")))","v":""},"",{"$f":"IF($B187=\"\",\"\",IF(GoalEntryData!$C$7=\"<=\",IF($B187<=GoalEntryData!$D$7,1,0),IF(GoalEntryData!$C$7=\">=\",IF($B187>=GoalEntryData!$D$7,1,0),\"\")))","v":""},"",{"$f":"IF($B187=\"\",\"\",IF(GoalEntryData!$C$8=\"<=\",IF($B187<=GoalEntryData!$D$8,1,0),IF(GoalEntryData!$C$8=\">=\",IF($B187>=GoalEntryData!$D$8,1,0),\"\")))","v":""},"",{"$f":"IF($B187=\"\",\"\",IF(GoalEntryData!$C$6=\"<=\",IF($B187<=GoalEntryData!$D$6,1,0),IF(GoalEntryData!$C$6=\">=\",IF($B187>=GoalEntryData!$D$6,1,0),\"\")))","v":""},"",null,null,null,{"$f":"IF($M187=\"\",\"\",IF(GoalEntryData!$C$10=\"<=\",IF($M187<=GoalEntryData!$D$10,1,0),IF(GoalEntryData!$C$10=\">=\",IF($M187>=GoalEntryData!$D$10,1,0),\"\")))","v":""},"",{"$f":"IF($M187=\"\",\"\",IF(GoalEntryData!$C$11=\"<=\",IF($M187<=GoalEntryData!$D$11,1,0),IF(GoalEntryData!$C$11=\">=\",IF($M187>=GoalEntryData!$D$11,1,0),\"\")))","v":""},"",{"$f":"IF($M187=\"\",\"\",IF(GoalEntryData!$C$12=\"<=\",IF($M187<=GoalEntryData!$D$12,1,0),IF(GoalEntryData!$C$10=\">=\",IF($M187>=GoalEntryData!$D$12,1,0),\"\")))","v":""},"",{"$f":"IF($M187=\"\",\"\",IF(GoalEntryData!$C$10=\"<=\",IF($M187<=GoalEntryData!$D$10,1,0),IF(GoalEntryData!$C$10=\">=\",IF($M187>=GoalEntryData!$D$10,1,0),\"\")))","v":""},""]
[null,null,null,{"$f":"IF($B188=\"\",\"\",IF(GoalEntryData!$C$6=\"<=\",IF($B188<=GoalEntryData!$D$6,1,0),IF(GoalEntryData!$C$6=\">=\",IF($B188>=GoalEntryData!$D$6,1,0),\"\")))","v":""},"",{"$f":"IF($B188=\"\",\"\",IF(GoalEntryData!$C$7=\"<=\",IF($B188<=GoalEntryData!$D$7,1,0),IF(GoalEntryData!$C$7=\">=\",IF($B188>=GoalEntryData!$D$7,1,0),\"\")))","v":""},"",{"$f":"IF($B188=\"\",\"\",IF(GoalEntryData!$C$8=\"<=\",IF($B188<=GoalEntryData!$D$8,1,0),IF(GoalEntryData!$C$8=\">=\",IF($B188>=GoalEntryData!$D$8,1,0),\"\")))","v":""},"",{"$f":"IF($B188=\"\",\"\",IF(GoalEntryData!$C$6=\"<=\",IF($B188<=GoalEntryData!$D$6,1,0),IF(GoalEntryData!$C$6=\">=\",IF($B188>=GoalEntryData!$D$6,1,0),\"\")))","v":""},"",null,null,null,{"$f":"IF($M188=\"\",\"\",IF(GoalEntryData!$C$10=\"<=\",IF($M188<=GoalEntryData!$D$10,1,0),IF(GoalEntryData!$C$10=\">=\",IF($M188>=GoalEntryData!$D$10,1,0),\"\")))","v":""},"",{"$f":"IF($M188=\"\",\"\",IF(GoalEntryData!$C$11=\"<=\",IF($M188<=GoalEntryData!$D$11,1,0),IF(GoalEntryData!$C$11=\">=\",IF($M188>=GoalEntryData!$D$11,1,0),\"\")))","v":""},"",{"$f":"IF($M188=\"\",\"\",IF(GoalEntryData!$C$12=\"<=\",IF($M188<=GoalEntryData!$D$12,1,0),IF(GoalEntryData!$C$10=\">=\",IF($M188>=GoalEntryData!$D$12,1,0),\"\")))","v":""},"",{"$f":"IF($M188=\"\",\"\",IF(GoalEntryData!$C$10=\"<=\",IF($M188<=GoalEntryData!$D$10,1,0),IF(GoalEntryData!$C$10=\">=\",IF($M188>=GoalEntryData!$D$10,1,0),\"\")))","v":""},""]
[null,null,null,{"$f":"IF($B189=\"\",\"\",IF(GoalEntryData!$C$6=\"<=\",IF($B189<=GoalEntryData!$D$6,1,0),IF(GoalEntryData!$C$6=\">=\",IF($B189>=GoalEntryData!$D$6,1,0),\"\")))","v":""},"",{"$f":"IF($B189=\"\",\"\",IF(GoalEntryData!$C$7=\"<=\",IF($B189<=GoalEntryData!$D$7,1,0),IF(GoalEntryData!$C$7=\">=\",IF($B189>=GoalEntryData!$D$7,1,0),\"\")))","v":""},"",{"$f":"IF($B189=\"\",\"\",IF(GoalEntryData!$C$8=\"<=\",IF($B189<=GoalEntryData!$D$8,1,0),IF(GoalEntryData!$C$8=\">=\",IF($B189>=GoalEntryData!$D$8,1,0),\"\")))","v":""},"",{"$f":"IF($B189=\"\",\"\",IF(GoalEntryData!$C$6=\"<=\",IF($B189<=GoalEntryData!$D$6,1,0),IF(GoalEntryData!$C$6=\">=\",IF($B189>=GoalEntryData!$D$6,1,0),\"\")))","v":""},"",null,null,null,{"$f":"IF($M189=\"\",\"\",IF(GoalEntryData!$C$10=\"<=\",IF($M189<=GoalEntryData!$D$10,1,0),IF(GoalEntryData!$C$10=\">=\",IF($M189>=GoalEntryData!$D$10,1,0),\"\")))","v":""},"",{"$f":"IF($M189=\"\",\"\",IF(GoalEntryData!$C$11=\"<=\",IF($M189<=GoalEntryData!$D$11,1,0),IF(GoalEntryData!$C$11=\">=\",IF($M189>=GoalEntryData!$D$11,1,0),\"\")))","v":""},"",{"$f":"IF($M189=\"\",\"\",IF(GoalEntryData!$C$12=\"<=\",IF($M189<=GoalEntryData!$D$12,1,0),IF(GoalEntryData!$C$10=\">=\",IF($M189>=GoalEntryData!$D$12,1,0),\"\")))","v":""},"",{"$f":"IF($M189=\"\",\"\",IF(GoalEntryData!$C$10=\"<=\",IF($M189<=GoalEntryData!$D$10,1,0),IF(GoalEntryData!$C$10=\">=\",IF($M189>=GoalEntryData!$D$10,1,0),\"\")))","v":""},""]
[null,null,null,{"$f":"IF($B190=\"\",\"\",IF(GoalEntryData!$C$6=\"<=\",IF($B190<=GoalEntryData!$D$6,1,0),IF(GoalEntryData!$C$6=\">=\",IF($B190>=GoalEntryData!$D$6,1,0),\"\")))","v":""},"",{"$f":"IF($B190=\"\",\"\",IF(GoalEntryData!$C$7=\"<=\",IF($B190<=GoalEntryData!$D$7,1,0),IF(GoalEntryData!$C$7=\">=\",IF($B190>=GoalEntryData!$D$7,1,0),\"\")))","v":""},"",{"$f":"IF($B190=\"\",\"\",IF(GoalEntryData!$C$8=\"<=\",IF($B190<=GoalEntryData!$D$8,1,0),IF(GoalEntryData!$C$8=\">=\",IF($B190>=GoalEntryData!$D$8,1,0),\"\")))","v":""},"",{"$f":"IF($B190=\"\",\"\",IF(GoalEntryData!$C$6=\"<=\",IF($B190<=GoalEntryData!$D$6,1,0),IF(GoalEntryData!$C$6=\">=\",IF($B190>=GoalEntryData!$D$6,1,0),\"\")))","v":""},"",null,null,null,{"$f":"IF($M190=\"\",\"\",IF(GoalEntryData!$C$10=\"<=\",IF($M190<=GoalEntryData!$D$10,1,0),IF(GoalEntryData!$C$10=\">=\",IF($M190>=GoalEntryData!$D$10,1,0),\"\")))","v":""},"",{"$f":"IF($M190=\"\",\"\",IF(GoalEntryData!$C$11=\"<=\",IF($M190<=GoalEntryData!$D$11,1,0),IF(GoalEntryData!$C$11=\">=\",IF($M190>=GoalEntryData!$D$11,1,0),\"\")))","v":""},"",{"$f":"IF($M190=\"\",\"\",IF(GoalEntryData!$C$12=\"<=\",IF($M190<=GoalEntryData!$D$12,1,0),IF(GoalEntryData!$C$10=\">=\",IF($M190>=GoalEntryData!$D$12,1,0),\"\")))","v":""},"",{"$f":"IF($M190=\"\",\"\",IF(GoalEntryData!$C$10=\"<=\",IF($M190<=GoalEntryData!$D$10,1,0),IF(GoalEntryData!$C$10=\">=\",IF($M190>=GoalEntryData!$D$10,1,0),\"\")))","v":""},""]
[null,null,null,{"$f":"IF($B191=\"\",\"\",IF(GoalEntryData!$C$6=\"<=\",IF($B191<=GoalEntryData!$D$6,1,0),IF(GoalEntryData!$C$6=\">=\",IF($B191>=GoalEntryData!$D$6,1,0),\"\")))","v":""},"",{"$f":"IF($B191=\"\",\"\",IF(GoalEntryData!$C$7=\"<=\",IF($B191<=GoalEntryData!$D$7,1,0),IF(GoalEntryData!$C$7=\">=\",IF($B191>=GoalEntryData!$D$7,1,0),\"\")))","v":""},"",{"$f":"IF($B191=\"\",\"\",IF(GoalEntryData!$C$8=\"<=\",IF($B191<=GoalEntryData!$D$8,1,0),IF(GoalEntryData!$C$8=\">=\",IF($B191>=GoalEntryData!$D$8,1,0),\"\")))","v":""},"",{"$f":"IF($B191=\"\",\"\",IF(GoalEntryData!$C$6=\"<=\",IF($B191<=GoalEntryData!$D$6,1,0),IF(GoalEntryData!$C$6=\">=\",IF($B191>=GoalEntryData!$D$6,1,0),\"\")))","v":""},"",null,null,null,{"$f":"IF($M191=\"\",\"\",IF(GoalEntryData!$C$10=\"<=\",IF($M191<=GoalEntryData!$D$10,1,0),IF(GoalEntryData!$C$10=\">=\",IF($M191>=GoalEntryData!$D$10,1,0),\"\")))","v":""},"",{"$f":"IF($M191=\"\",\"\",IF(GoalEntryData!$C$11=\"<=\",IF($M191<=GoalEntryData!$D$11,1,0),IF(GoalEntryData!$C$11=\">=\",IF($M191>=GoalEntryData!$D$11,1,0),\"\")))","v":""},"",{"$f":"IF($M191=\"\",\"\",IF(GoalEntryData!$C$12=\"<=\",IF($M191<=GoalEntryData!$D$12,1,0),IF(GoalEntryData!$C$10=\">=\",IF($M191>=GoalEntryData!$D$12,1,0),\"\")))","v":""},"",{"$f":"IF($M191=\"\",\"\",IF(GoalEntryData!$C$10=\"<=\",IF($M191<=GoalEntryData!$D$10,1,0),IF(GoalEntryData!$C$10=\">=\",IF($M191>=GoalEntryData!$D$10,1,0),\"\")))","v":""},""]
[null,null,null,{"$f":"IF($B192=\"\",\"\",IF(GoalEntryData!$C$6=\"<=\",IF($B192<=GoalEntryData!$D$6,1,0),IF(GoalEntryData!$C$6=\">=\",IF($B192>=GoalEntryData!$D$6,1,0),\"\")))","v":""},"",{"$f":"IF($B192=\"\",\"\",IF(GoalEntryData!$C$7=\"<=\",IF($B192<=GoalEntryData!$D$7,1,0),IF(GoalEntryData!$C$7=\">=\",IF($B192>=GoalEntryData!$D$7,1,0),\"\")))","v":""},"",{"$f":"IF($B192=\"\",\"\",IF(GoalEntryData!$C$8=\"<=\",IF($B192<=GoalEntryData!$D$8,1,0),IF(GoalEntryData!$C$8=\">=\",IF($B192>=GoalEntryData!$D$8,1,0),\"\")))","v":""},"",{"$f":"IF($B192=\"\",\"\",IF(GoalEntryData!$C$6=\"<=\",IF($B192<=GoalEntryData!$D$6,1,0),IF(GoalEntryData!$C$6=\">=\",IF($B192>=GoalEntryData!$D$6,1,0),\"\")))","v":""},"",null,null,null,{"$f":"IF($M192=\"\",\"\",IF(GoalEntryData!$C$10=\"<=\",IF($M192<=GoalEntryData!$D$10,1,0),IF(GoalEntryData!$C$10=\">=\",IF($M192>=GoalEntryData!$D$10,1,0),\"\")))","v":""},"",{"$f":"IF($M192=\"\",\"\",IF(GoalEntryData!$C$11=\"<=\",IF($M192<=GoalEntryData!$D$11,1,0),IF(GoalEntryData!$C$11=\">=\",IF($M192>=GoalEntryData!$D$11,1,0),\"\")))","v":""},"",{"$f":"IF($M192=\"\",\"\",IF(GoalEntryData!$C$12=\"<=\",IF($M192<=GoalEntryData!$D$12,1,0),IF(GoalEntryData!$C$10=\">=\",IF($M192>=GoalEntryData!$D$12,1,0),\"\")))","v":""},"",{"$f":"IF($M192=\"\",\"\",IF(GoalEntryData!$C$10=\"<=\",IF($M192<=GoalEntryData!$D$10,1,0),IF(GoalEntryData!$C$10=\">=\",IF($M192>=GoalEntryData!$D$10,1,0),\"\")))","v":""},""]
[null,null,null,{"$f":"IF($B193=\"\",\"\",IF(GoalEntryData!$C$6=\"<=\",IF($B193<=GoalEntryData!$D$6,1,0),IF(GoalEntryData!$C$6=\">=\",IF($B193>=GoalEntryData!$D$6,1,0),\"\")))","v":""},"",{"$f":"IF($B193=\"\",\"\",IF(GoalEntryData!$C$7=\"<=\",IF($B193<=GoalEntryData!$D$7,1,0),IF(GoalEntryData!$C$7=\">=\",IF($B193>=GoalEntryData!$D$7,1,0),\"\")))","v":""},"",{"$f":"IF($B193=\"\",\"\",IF(GoalEntryData!$C$8=\"<=\",IF($B193<=GoalEntryData!$D$8,1,0),IF(GoalEntryData!$C$8=\">=\",IF($B193>=GoalEntryData!$D$8,1,0),\"\")))","v":""},"",{"$f":"IF($B193=\"\",\"\",IF(GoalEntryData!$C$6=\"<=\",IF($B193<=GoalEntryData!$D$6,1,0),IF(GoalEntryData!$C$6=\">=\",IF($B193>=GoalEntryData!$D$6,1,0),\"\")))","v":""},"",null,null,null,{"$f":"IF($M193=\"\",\"\",IF(GoalEntryData!$C$10=\"<=\",IF($M193<=GoalEntryData!$D$10,1,0),IF(GoalEntryData!$C$10=\">=\",IF($M193>=GoalEntryData!$D$10,1,0),\"\")))","v":""},"",{"$f":"IF($M193=\"\",\"\",IF(GoalEntryData!$C$11=\"<=\",IF($M193<=GoalEntryData!$D$11,1,0),IF(GoalEntryData!$C$11=\">=\",IF($M193>=GoalEntryData!$D$11,1,0),\"\")))","v":""},"",{"$f":"IF($M193=\"\",\"\",IF(GoalEntryData!$C$12=\"<=\",IF($M193<=GoalEntryData!$D$12,1,0),IF(GoalEntryData!$C$10=\">=\",IF($M193>=GoalEntryData!$D$12,1,0),\"\")))","v":""},"",{"$f":"IF($M193=\"\",\"\",IF(GoalEntryData!$C$10=\"<=\",IF($M193<=GoalEntryData!$D$10,1,0),IF(GoalEntryData!$C$10=\">=\",IF($M193>=GoalEntryData!$D$10,1,0),\"\")))","v":""},""]
[null,null,null,{"$f":"IF($B194=\"\",\"\",IF(GoalEntryData!$C$6=\"<=\",IF($B194<=GoalEntryData!$D$6,1,0),IF(GoalEntryData!$C$6=\">=\",IF($B194>=GoalEntryData!$D$6,1,0),\"\")))","v":""},"",{"$f":"IF($B194=\"\",\"\",IF(GoalEntryData!$C$7=\"<=\",IF($B194<=GoalEntryData!$D$7,1,0),IF(GoalEntryData!$C$7=\">=\",IF($B194>=GoalEntryData!$D$7,1,0),\"\")))","v":""},"",{"$f":"IF($B194=\"\",\"\",IF(GoalEntryData!$C$8=\"<=\",IF($B194<=GoalEntryData!$D$8,1,0),IF(GoalEntryData!$C$8=\">=\",IF($B194>=GoalEntryData!$D$8,1,0),\"\")))","v":""},"",{"$f":"IF($B194=\"\",\"\",IF(GoalEntryData!$C$6=\"<=\",IF($B194<=GoalEntryData!$D$6,1,0),IF(GoalEntryData!$C$6=\">=\",IF($B194>=GoalEntryData!$D$6,1,0),\"\")))","v":""},"",null,null,null,{"$f":"IF($M194=\"\",\"\",IF(GoalEntryData!$C$10=\"<=\",IF($M194<=GoalEntryData!$D$10,1,0),IF(GoalEntryData!$C$10=\">=\",IF($M194>=GoalEntryData!$D$10,1,0),\"\")))","v":""},"",{"$f":"IF($M194=\"\",\"\",IF(GoalEntryData!$C$11=\"<=\",IF($M194<=GoalEntryData!$D$11,1,0),IF(GoalEntryData!$C$11=\">=\",IF($M194>=GoalEntryData!$D$11,1,0),\"\")))","v":""},"",{"$f":"IF($M194=\"\",\"\",IF(GoalEntryData!$C$12=\"<=\",IF($M194<=GoalEntryData!$D$12,1,0),IF(GoalEntryData!$C$10=\">=\",IF($M194>=GoalEntryData!$D$12,1,0),\"\")))","v":""},"",{"$f":"IF($M194=\"\",\"\",IF(GoalEntryData!$C$10=\"<=\",IF($M194<=GoalEntryData!$D$10,1,0),IF(GoalEntryData!$C$10=\">=\",IF($M194>=GoalEntryData!$D$10,1,0),\"\")))","v":""},""]
[null,null,null,{"$f":"IF($B195=\"\",\"\",IF(GoalEntryData!$C$6=\"<=\",IF($B195<=GoalEntryData!$D$6,1,0),IF(GoalEntryData!$C$6=\">=\",IF($B195>=GoalEntryData!$D$6,1,0),\"\")))","v":""},"",{"$f":"IF($B195=\"\",\"\",IF(GoalEntryData!$C$7=\"<=\",IF($B195<=GoalEntryData!$D$7,1,0),IF(GoalEntryData!$C$7=\">=\",IF($B195>=GoalEntryData!$D$7,1,0),\"\")))","v":""},"",{"$f":"IF($B195=\"\",\"\",IF(GoalEntryData!$C$8=\"<=\",IF($B195<=GoalEntryData!$D$8,1,0),IF(GoalEntryData!$C$8=\">=\",IF($B195>=GoalEntryData!$D$8,1,0),\"\")))","v":""},"",{"$f":"IF($B195=\"\",\"\",IF(GoalEntryData!$C$6=\"<=\",IF($B195<=GoalEntryData!$D$6,1,0),IF(GoalEntryData!$C$6=\">=\",IF($B195>=GoalEntryData!$D$6,1,0),\"\")))","v":""},"",null,null,null,{"$f":"IF($M195=\"\",\"\",IF(GoalEntryData!$C$10=\"<=\",IF($M195<=GoalEntryData!$D$10,1,0),IF(GoalEntryData!$C$10=\">=\",IF($M195>=GoalEntryData!$D$10,1,0),\"\")))","v":""},"",{"$f":"IF($M195=\"\",\"\",IF(GoalEntryData!$C$11=\"<=\",IF($M195<=GoalEntryData!$D$11,1,0),IF(GoalEntryData!$C$11=\">=\",IF($M195>=GoalEntryData!$D$11,1,0),\"\")))","v":""},"",{"$f":"IF($M195=\"\",\"\",IF(GoalEntryData!$C$12=\"<=\",IF($M195<=GoalEntryData!$D$12,1,0),IF(GoalEntryData!$C$10=\">=\",IF($M195>=GoalEntryData!$D$12,1,0),\"\")))","v":""},"",{"$f":"IF($M195=\"\",\"\",IF(GoalEntryData!$C$10=\"<=\",IF($M195<=GoalEntryData!$D$10,1,0),IF(GoalEntryData!$C$10=\">=\",IF($M195>=GoalEntryData!$D$10,1,0),\"\")))","v":""},""]
[null,null,null,{"$f":"IF($B196=\"\",\"\",IF(GoalEntryData!$C$6=\"<=\",IF($B196<=GoalEntryData!$D$6,1,0),IF(GoalEntryData!$C$6=\">=\",IF($B196>=GoalEntryData!$D$6,1,0),\"\")))","v":""},{"$f":"IF(AND(E195>=1,D196=1),E195+1,D196)","v":""},{"$f":"IF($B196=\"\",\"\",IF(GoalEntryData!$C$7=\"<=\",IF($B196<=GoalEntryData!$D$7,1,0),IF(GoalEntryData!$C$7=\">=\",IF($B196>=GoalEntryData!$D$7,1,0),\"\")))","v":""},{"$f":"IF(AND(G195>=1,F196=1),G195+1,F196)","v":""},{"$f":"IF($B196=\"\",\"\",IF(GoalEntryData!$C$8=\"<=\",IF($B196<=GoalEntryData!$D$8,1,0),IF(GoalEntryData!$C$8=\">=\",IF($B196>=GoalEntryData!$D$8,1,0),\"\")))","v":""},{"$f":"IF(AND(I195>=1,H196=1),I195+1,H196)","v":""},{"$f":"IF($B196=\"\",\"\",IF(GoalEntryData!$C$6=\"<=\",IF($B196<=GoalEntryData!$D$6,1,0),IF(GoalEntryData!$C$6=\">=\",IF($B196>=GoalEntryData!$D$6,1,0),\"\")))","v":""},{"$f":"IF(AND(K195>=1,J196=1),K195+1,J196)","v":""},null,null,null,{"$f":"IF($M196=\"\",\"\",IF(GoalEntryData!$C$10=\"<=\",IF($M196<=GoalEntryData!$D$10,1,0),IF(GoalEntryData!$C$10=\">=\",IF($M196>=GoalEntryData!$D$10,1,0),\"\")))","v":""},{"$f":"IF(AND(P195>=1,O196=1),P195+1,O196)","v":""},{"$f":"IF($M196=\"\",\"\",IF(GoalEntryData!$C$11=\"<=\",IF($M196<=GoalEntryData!$D$11,1,0),IF(GoalEntryData!$C$11=\">=\",IF($M196>=GoalEntryData!$D$11,1,0),\"\")))","v":""},{"$f":"IF(AND(R195>=1,Q196=1),R195+1,Q196)","v":""},{"$f":"IF($M196=\"\",\"\",IF(GoalEntryData!$C$12=\"<=\",IF($M196<=GoalEntryData!$D$12,1,0),IF(GoalEntryData!$C$10=\">=\",IF($M196>=GoalEntryData!$D$12,1,0),\"\")))","v":""},{"$f":"IF(AND(T195>=1,S196=1),T195+1,S196)","v":""},{"$f":"IF($M196=\"\",\"\",IF(GoalEntryData!$C$10=\"<=\",IF($M196<=GoalEntryData!$D$10,1,0),IF(GoalEntryData!$C$10=\">=\",IF($M196>=GoalEntryData!$D$10,1,0),\"\")))","v":""},{"$f":"IF(AND(V195>=1,U196=1),V195+1,U196)","v":""}]
[null,null,null,{"$f":"IF($B197=\"\",\"\",IF(GoalEntryData!$C$6=\"<=\",IF($B197<=GoalEntryData!$D$6,1,0),IF(GoalEntryData!$C$6=\">=\",IF($B197>=GoalEntryData!$D$6,1,0),\"\")))","v":""},"",{"$f":"IF($B197=\"\",\"\",IF(GoalEntryData!$C$7=\"<=\",IF($B197<=GoalEntryData!$D$7,1,0),IF(GoalEntryData!$C$7=\">=\",IF($B197>=GoalEntryData!$D$7,1,0),\"\")))","v":""},"",{"$f":"IF($B197=\"\",\"\",IF(GoalEntryData!$C$8=\"<=\",IF($B197<=GoalEntryData!$D$8,1,0),IF(GoalEntryData!$C$8=\">=\",IF($B197>=GoalEntryData!$D$8,1,0),\"\")))","v":""},"",{"$f":"IF($B197=\"\",\"\",IF(GoalEntryData!$C$6=\"<=\",IF($B197<=GoalEntryData!$D$6,1,0),IF(GoalEntryData!$C$6=\">=\",IF($B197>=GoalEntryData!$D$6,1,0),\"\")))","v":""},"",null,null,null,{"$f":"IF($M197=\"\",\"\",IF(GoalEntryData!$C$10=\"<=\",IF($M197<=GoalEntryData!$D$10,1,0),IF(GoalEntryData!$C$10=\">=\",IF($M197>=GoalEntryData!$D$10,1,0),\"\")))","v":""},"",{"$f":"IF($M197=\"\",\"\",IF(GoalEntryData!$C$11=\"<=\",IF($M197<=GoalEntryData!$D$11,1,0),IF(GoalEntryData!$C$11=\">=\",IF($M197>=GoalEntryData!$D$11,1,0),\"\")))","v":""},"",{"$f":"IF($M197=\"\",\"\",IF(GoalEntryData!$C$12=\"<=\",IF($M197<=GoalEntryData!$D$12,1,0),IF(GoalEntryData!$C$10=\">=\",IF($M197>=GoalEntryData!$D$12,1,0),\"\")))","v":""},"",{"$f":"IF($M197=\"\",\"\",IF(GoalEntryData!$C$10=\"<=\",IF($M197<=GoalEntryData!$D$10,1,0),IF(GoalEntryData!$C$10=\">=\",IF($M197>=GoalEntryData!$D$10,1,0),\"\")))","v":""},""]
[null,null,null,{"$f":"IF($B198=\"\",\"\",IF(GoalEntryData!$C$6=\"<=\",IF($B198<=GoalEntryData!$D$6,1,0),IF(GoalEntryData!$C$6=\">=\",IF($B198>=GoalEntryData!$D$6,1,0),\"\")))","v":""},"",{"$f":"IF($B198=\"\",\"\",IF(GoalEntryData!$C$7=\"<=\",IF($B198<=GoalEntryData!$D$7,1,0),IF(GoalEntryData!$C$7=\">=\",IF($B198>=GoalEntryData!$D$7,1,0),\"\")))","v":""},"",{"$f":"IF($B198=\"\",\"\",IF(GoalEntryData!$C$8=\"<=\",IF($B198<=GoalEntryData!$D$8,1,0),IF(GoalEntryData!$C$8=\">=\",IF($B198>=GoalEntryData!$D$8,1,0),\"\")))","v":""},"",{"$f":"IF($B198=\"\",\"\",IF(GoalEntryData!$C$6=\"<=\",IF($B198<=GoalEntryData!$D$6,1,0),IF(GoalEntryData!$C$6=\">=\",IF($B198>=GoalEntryData!$D$6,1,0),\"\")))","v":""},"",null,null,null,{"$f":"IF($M198=\"\",\"\",IF(GoalEntryData!$C$10=\"<=\",IF($M198<=GoalEntryData!$D$10,1,0),IF(GoalEntryData!$C$10=\">=\",IF($M198>=GoalEntryData!$D$10,1,0),\"\")))","v":""},"",{"$f":"IF($M198=\"\",\"\",IF(GoalEntryData!$C$11=\"<=\",IF($M198<=GoalEntryData!$D$11,1,0),IF(GoalEntryData!$C$11=\">=\",IF($M198>=GoalEntryData!$D$11,1,0),\"\")))","v":""},"",{"$f":"IF($M198=\"\",\"\",IF(GoalEntryData!$C$12=\"<=\",IF($M198<=GoalEntryData!$D$12,1,0),IF(GoalEntryData!$C$10=\">=\",IF($M198>=GoalEntryData!$D$12,1,0),\"\")))","v":""},"",{"$f":"IF($M198=\"\",\"\",IF(GoalEntryData!$C$10=\"<=\",IF($M198<=GoalEntryData!$D$10,1,0),IF(GoalEntryData!$C$10=\">=\",IF($M198>=GoalEntryData!$D$10,1,0),\"\")))","v":""},""]
[null,null,null,{"$f":"IF($B199=\"\",\"\",IF(GoalEntryData!$C$6=\"<=\",IF($B199<=GoalEntryData!$D$6,1,0),IF(GoalEntryData!$C$6=\">=\",IF($B199>=GoalEntryData!$D$6,1,0),\"\")))","v":""},"",{"$f":"IF($B199=\"\",\"\",IF(GoalEntryData!$C$7=\"<=\",IF($B199<=GoalEntryData!$D$7,1,0),IF(GoalEntryData!$C$7=\">=\",IF($B199>=GoalEntryData!$D$7,1,0),\"\")))","v":""},"",{"$f":"IF($B199=\"\",\"\",IF(GoalEntryData!$C$8=\"<=\",IF($B199<=GoalEntryData!$D$8,1,0),IF(GoalEntryData!$C$8=\">=\",IF($B199>=GoalEntryData!$D$8,1,0),\"\")))","v":""},"",{"$f":"IF($B199=\"\",\"\",IF(GoalEntryData!$C$6=\"<=\",IF($B199<=GoalEntryData!$D$6,1,0),IF(GoalEntryData!$C$6=\">=\",IF($B199>=GoalEntryData!$D$6,1,0),\"\")))","v":""},"",null,null,null,{"$f":"IF($M199=\"\",\"\",IF(GoalEntryData!$C$10=\"<=\",IF($M199<=GoalEntryData!$D$10,1,0),IF(GoalEntryData!$C$10=\">=\",IF($M199>=GoalEntryData!$D$10,1,0),\"\")))","v":""},"",{"$f":"IF($M199=\"\",\"\",IF(GoalEntryData!$C$11=\"<=\",IF($M199<=GoalEntryData!$D$11,1,0),IF(GoalEntryData!$C$11=\">=\",IF($M199>=GoalEntryData!$D$11,1,0),\"\")))","v":""},"",{"$f":"IF($M199=\"\",\"\",IF(GoalEntryData!$C$12=\"<=\",IF($M199<=GoalEntryData!$D$12,1,0),IF(GoalEntryData!$C$10=\">=\",IF($M199>=GoalEntryData!$D$12,1,0),\"\")))","v":""},"",{"$f":"IF($M199=\"\",\"\",IF(GoalEntryData!$C$10=\"<=\",IF($M199<=GoalEntryData!$D$10,1,0),IF(GoalEntryData!$C$10=\">=\",IF($M199>=GoalEntryData!$D$10,1,0),\"\")))","v":""},""]
[null,null,null,{"$f":"IF($B200=\"\",\"\",IF(GoalEntryData!$C$6=\"<=\",IF($B200<=GoalEntryData!$D$6,1,0),IF(GoalEntryData!$C$6=\">=\",IF($B200>=GoalEntryData!$D$6,1,0),\"\")))","v":""},"",{"$f":"IF($B200=\"\",\"\",IF(GoalEntryData!$C$7=\"<=\",IF($B200<=GoalEntryData!$D$7,1,0),IF(GoalEntryData!$C$7=\">=\",IF($B200>=GoalEntryData!$D$7,1,0),\"\")))","v":""},"",{"$f":"IF($B200=\"\",\"\",IF(GoalEntryData!$C$8=\"<=\",IF($B200<=GoalEntryData!$D$8,1,0),IF(GoalEntryData!$C$8=\">=\",IF($B200>=GoalEntryData!$D$8,1,0),\"\")))","v":""},"",{"$f":"IF($B200=\"\",\"\",IF(GoalEntryData!$C$6=\"<=\",IF($B200<=GoalEntryData!$D$6,1,0),IF(GoalEntryData!$C$6=\">=\",IF($B200>=GoalEntryData!$D$6,1,0),\"\")))","v":""},"",null,null,null,{"$f":"IF($M200=\"\",\"\",IF(GoalEntryData!$C$10=\"<=\",IF($M200<=GoalEntryData!$D$10,1,0),IF(GoalEntryData!$C$10=\">=\",IF($M200>=GoalEntryData!$D$10,1,0),\"\")))","v":""},"",{"$f":"IF($M200=\"\",\"\",IF(GoalEntryData!$C$11=\"<=\",IF($M200<=GoalEntryData!$D$11,1,0),IF(GoalEntryData!$C$11=\">=\",IF($M200>=GoalEntryData!$D$11,1,0),\"\")))","v":""},"",{"$f":"IF($M200=\"\",\"\",IF(GoalEntryData!$C$12=\"<=\",IF($M200<=GoalEntryData!$D$12,1,0),IF(GoalEntryData!$C$10=\">=\",IF($M200>=GoalEntryData!$D$12,1,0),\"\")))","v":""},"",{"$f":"IF($M200=\"\",\"\",IF(GoalEntryData!$C$10=\"<=\",IF($M200<=GoalEntryData!$D$10,1,0),IF(GoalEntryData!$C$10=\">=\",IF($M200>=GoalEntryData!$D$10,1,0),\"\")))","v":""},""]
[null,null,null,{"$f":"IF($B201=\"\",\"\",IF(GoalEntryData!$C$6=\"<=\",IF($B201<=GoalEntryData!$D$6,1,0),IF(GoalEntryData!$C$6=\">=\",IF($B201>=GoalEntryData!$D$6,1,0),\"\")))","v":""},"",{"$f":"IF($B201=\"\",\"\",IF(GoalEntryData!$C$7=\"<=\",IF($B201<=GoalEntryData!$D$7,1,0),IF(GoalEntryData!$C$7=\">=\",IF($B201>=GoalEntryData!$D$7,1,0),\"\")))","v":""},"",{"$f":"IF($B201=\"\",\"\",IF(GoalEntryData!$C$8=\"<=\",IF($B201<=GoalEntryData!$D$8,1,0),IF(GoalEntryData!$C$8=\">=\",IF($B201>=GoalEntryData!$D$8,1,0),\"\")))","v":""},"",{"$f":"IF($B201=\"\",\"\",IF(GoalEntryData!$C$6=\"<=\",IF($B201<=GoalEntryData!$D$6,1,0),IF(GoalEntryData!$C$6=\">=\",IF($B201>=GoalEntryData!$D$6,1,0),\"\")))","v":""},"",null,null,null,{"$f":"IF($M201=\"\",\"\",IF(GoalEntryData!$C$10=\"<=\",IF($M201<=GoalEntryData!$D$10,1,0),IF(GoalEntryData!$C$10=\">=\",IF($M201>=GoalEntryData!$D$10,1,0),\"\")))","v":""},"",{"$f":"IF($M201=\"\",\"\",IF(GoalEntryData!$C$11=\"<=\",IF($M201<=GoalEntryData!$D$11,1,0),IF(GoalEntryData!$C$11=\">=\",IF($M201>=GoalEntryData!$D$11,1,0),\"\")))","v":""},"",{"$f":"IF($M201=\"\",\"\",IF(GoalEntryData!$C$12=\"<=\",IF($M201<=GoalEntryData!$D$12,1,0),IF(GoalEntryData!$C$10=\">=\",IF($M201>=GoalEntryData!$D$12,1,0),\"\")))","v":""},"",{"$f":"IF($M201=\"\",\"\",IF(GoalEntryData!$C$10=\"<=\",IF($M201<=GoalEntryData!$D$10,1,0),IF(GoalEntryData!$C$10=\">=\",IF($M201>=GoalEntryData!$D$10,1,0),\"\")))","v":""},""]
[null,null,null,{"$f":"IF($B202=\"\",\"\",IF(GoalEntryData!$C$6=\"<=\",IF($B202<=GoalEntryData!$D$6,1,0),IF(GoalEntryData!$C$6=\">=\",IF($B202>=GoalEntryData!$D$6,1,0),\"\")))","v":""},"",{"$f":"IF($B202=\"\",\"\",IF(GoalEntryData!$C$7=\"<=\",IF($B202<=GoalEntryData!$D$7,1,0),IF(GoalEntryData!$C$7=\">=\",IF($B202>=GoalEntryData!$D$7,1,0),\"\")))","v":""},"",{"$f":"IF($B202=\"\",\"\",IF(GoalEntryData!$C$8=\"<=\",IF($B202<=GoalEntryData!$D$8,1,0),IF(GoalEntryData!$C$8=\">=\",IF($B202>=GoalEntryData!$D$8,1,0),\"\")))","v":""},"",{"$f":"IF($B202=\"\",\"\",IF(GoalEntryData!$C$6=\"<=\",IF($B202<=GoalEntryData!$D$6,1,0),IF(GoalEntryData!$C$6=\">=\",IF($B202>=GoalEntryData!$D$6,1,0),\"\")))","v":""},"",null,null,null,{"$f":"IF($M202=\"\",\"\",IF(GoalEntryData!$C$10=\"<=\",IF($M202<=GoalEntryData!$D$10,1,0),IF(GoalEntryData!$C$10=\">=\",IF($M202>=GoalEntryData!$D$10,1,0),\"\")))","v":""},"",{"$f":"IF($M202=\"\",\"\",IF(GoalEntryData!$C$11=\"<=\",IF($M202<=GoalEntryData!$D$11,1,0),IF(GoalEntryData!$C$11=\">=\",IF($M202>=GoalEntryData!$D$11,1,0),\"\")))","v":""},"",{"$f":"IF($M202=\"\",\"\",IF(GoalEntryData!$C$12=\"<=\",IF($M202<=GoalEntryData!$D$12,1,0),IF(GoalEntryData!$C$10=\">=\",IF($M202>=GoalEntryData!$D$12,1,0),\"\")))","v":""},"",{"$f":"IF($M202=\"\",\"\",IF(GoalEntryData!$C$10=\"<=\",IF($M202<=GoalEntryData!$D$10,1,0),IF(GoalEntryData!$C$10=\">=\",IF($M202>=GoalEntryData!$D$10,1,0),\"\")))","v":""},""]
[null,null,null,{"$f":"IF($B203=\"\",\"\",IF(GoalEntryData!$C$6=\"<=\",IF($B203<=GoalEntryData!$D$6,1,0),IF(GoalEntryData!$C$6=\">=\",IF($B203>=GoalEntryData!$D$6,1,0),\"\")))","v":""},"",{"$f":"IF($B203=\"\",\"\",IF(GoalEntryData!$C$7=\"<=\",IF($B203<=GoalEntryData!$D$7,1,0),IF(GoalEntryData!$C$7=\">=\",IF($B203>=GoalEntryData!$D$7,1,0),\"\")))","v":""},"",{"$f":"IF($B203=\"\",\"\",IF(GoalEntryData!$C$8=\"<=\",IF($B203<=GoalEntryData!$D$8,1,0),IF(GoalEntryData!$C$8=\">=\",IF($B203>=GoalEntryData!$D$8,1,0),\"\")))","v":""},"",{"$f":"IF($B203=\"\",\"\",IF(GoalEntryData!$C$6=\"<=\",IF($B203<=GoalEntryData!$D$6,1,0),IF(GoalEntryData!$C$6=\">=\",IF($B203>=GoalEntryData!$D$6,1,0),\"\")))","v":""},"",null,null,null,{"$f":"IF($M203=\"\",\"\",IF(GoalEntryData!$C$10=\"<=\",IF($M203<=GoalEntryData!$D$10,1,0),IF(GoalEntryData!$C$10=\">=\",IF($M203>=GoalEntryData!$D$10,1,0),\"\")))","v":""},"",{"$f":"IF($M203=\"\",\"\",IF(GoalEntryData!$C$11=\"<=\",IF($M203<=GoalEntryData!$D$11,1,0),IF(GoalEntryData!$C$11=\">=\",IF($M203>=GoalEntryData!$D$11,1,0),\"\")))","v":""},"",{"$f":"IF($M203=\"\",\"\",IF(GoalEntryData!$C$12=\"<=\",IF($M203<=GoalEntryData!$D$12,1,0),IF(GoalEntryData!$C$10=\">=\",IF($M203>=GoalEntryData!$D$12,1,0),\"\")))","v":""},"",{"$f":"IF($M203=\"\",\"\",IF(GoalEntryData!$C$10=\"<=\",IF($M203<=GoalEntryData!$D$10,1,0),IF(GoalEntryData!$C$10=\">=\",IF($M203>=GoalEntryData!$D$10,1,0),\"\")))","v":""},""]
[null,null,null,{"$f":"IF($B204=\"\",\"\",IF(GoalEntryData!$C$6=\"<=\",IF($B204<=GoalEntryData!$D$6,1,0),IF(GoalEntryData!$C$6=\">=\",IF($B204>=GoalEntryData!$D$6,1,0),\"\")))","v":""},"",{"$f":"IF($B204=\"\",\"\",IF(GoalEntryData!$C$7=\"<=\",IF($B204<=GoalEntryData!$D$7,1,0),IF(GoalEntryData!$C$7=\">=\",IF($B204>=GoalEntryData!$D$7,1,0),\"\")))","v":""},"",{"$f":"IF($B204=\"\",\"\",IF(GoalEntryData!$C$8=\"<=\",IF($B204<=GoalEntryData!$D$8,1,0),IF(GoalEntryData!$C$8=\">=\",IF($B204>=GoalEntryData!$D$8,1,0),\"\")))","v":""},"",{"$f":"IF($B204=\"\",\"\",IF(GoalEntryData!$C$6=\"<=\",IF($B204<=GoalEntryData!$D$6,1,0),IF(GoalEntryData!$C$6=\">=\",IF($B204>=GoalEntryData!$D$6,1,0),\"\")))","v":""},"",null,null,null,{"$f":"IF($M204=\"\",\"\",IF(GoalEntryData!$C$10=\"<=\",IF($M204<=GoalEntryData!$D$10,1,0),IF(GoalEntryData!$C$10=\">=\",IF($M204>=GoalEntryData!$D$10,1,0),\"\")))","v":""},"",{"$f":"IF($M204=\"\",\"\",IF(GoalEntryData!$C$11=\"<=\",IF($M204<=GoalEntryData!$D$11,1,0),IF(GoalEntryData!$C$11=\">=\",IF($M204>=GoalEntryData!$D$11,1,0),\"\")))","v":""},"",{"$f":"IF($M204=\"\",\"\",IF(GoalEntryData!$C$12=\"<=\",IF($M204<=GoalEntryData!$D$12,1,0),IF(GoalEntryData!$C$10=\">=\",IF($M204>=GoalEntryData!$D$12,1,0),\"\")))","v":""},"",{"$f":"IF($M204=\"\",\"\",IF(GoalEntryData!$C$10=\"<=\",IF($M204<=GoalEntryData!$D$10,1,0),IF(GoalEntryData!$C$10=\">=\",IF($M204>=GoalEntryData!$D$10,1,0),\"\")))","v":""},""]
[null,null,null,{"$f":"IF($B205=\"\",\"\",IF(GoalEntryData!$C$6=\"<=\",IF($B205<=GoalEntryData!$D$6,1,0),IF(GoalEntryData!$C$6=\">=\",IF($B205>=GoalEntryData!$D$6,1,0),\"\")))","v":""},"",{"$f":"IF($B205=\"\",\"\",IF(GoalEntryData!$C$7=\"<=\",IF($B205<=GoalEntryData!$D$7,1,0),IF(GoalEntryData!$C$7=\">=\",IF($B205>=GoalEntryData!$D$7,1,0),\"\")))","v":""},"",{"$f":"IF($B205=\"\",\"\",IF(GoalEntryData!$C$8=\"<=\",IF($B205<=GoalEntryData!$D$8,1,0),IF(GoalEntryData!$C$8=\">=\",IF($B205>=GoalEntryData!$D$8,1,0),\"\")))","v":""},"",{"$f":"IF($B205=\"\",\"\",IF(GoalEntryData!$C$6=\"<=\",IF($B205<=GoalEntryData!$D$6,1,0),IF(GoalEntryData!$C$6=\">=\",IF($B205>=GoalEntryData!$D$6,1,0),\"\")))","v":""},"",null,null,null,{"$f":"IF($M205=\"\",\"\",IF(GoalEntryData!$C$10=\"<=\",IF($M205<=GoalEntryData!$D$10,1,0),IF(GoalEntryData!$C$10=\">=\",IF($M205>=GoalEntryData!$D$10,1,0),\"\")))","v":""},"",{"$f":"IF($M205=\"\",\"\",IF(GoalEntryData!$C$11=\"<=\",IF($M205<=GoalEntryData!$D$11,1,0),IF(GoalEntryData!$C$11=\">=\",IF($M205>=GoalEntryData!$D$11,1,0),\"\")))","v":""},"",{"$f":"IF($M205=\"\",\"\",IF(GoalEntryData!$C$12=\"<=\",IF($M205<=GoalEntryData!$D$12,1,0),IF(GoalEntryData!$C$10=\">=\",IF($M205>=GoalEntryData!$D$12,1,0),\"\")))","v":""},"",{"$f":"IF($M205=\"\",\"\",IF(GoalEntryData!$C$10=\"<=\",IF($M205<=GoalEntryData!$D$10,1,0),IF(GoalEntryData!$C$10=\">=\",IF($M205>=GoalEntryData!$D$10,1,0),\"\")))","v":""},""]
[null,null,null,{"$f":"IF($B206=\"\",\"\",IF(GoalEntryData!$C$6=\"<=\",IF($B206<=GoalEntryData!$D$6,1,0),IF(GoalEntryData!$C$6=\">=\",IF($B206>=GoalEntryData!$D$6,1,0),\"\")))","v":""},"",{"$f":"IF($B206=\"\",\"\",IF(GoalEntryData!$C$7=\"<=\",IF($B206<=GoalEntryData!$D$7,1,0),IF(GoalEntryData!$C$7=\">=\",IF($B206>=GoalEntryData!$D$7,1,0),\"\")))","v":""},"",{"$f":"IF($B206=\"\",\"\",IF(GoalEntryData!$C$8=\"<=\",IF($B206<=GoalEntryData!$D$8,1,0),IF(GoalEntryData!$C$8=\">=\",IF($B206>=GoalEntryData!$D$8,1,0),\"\")))","v":""},"",{"$f":"IF($B206=\"\",\"\",IF(GoalEntryData!$C$6=\"<=\",IF($B206<=GoalEntryData!$D$6,1,0),IF(GoalEntryData!$C$6=\">=\",IF($B206>=GoalEntryData!$D$6,1,0),\"\")))","v":""},"",null,null,null,{"$f":"IF($M206=\"\",\"\",IF(GoalEntryData!$C$10=\"<=\",IF($M206<=GoalEntryData!$D$10,1,0),IF(GoalEntryData!$C$10=\">=\",IF($M206>=GoalEntryData!$D$10,1,0),\"\")))","v":""},"",{"$f":"IF($M206=\"\",\"\",IF(GoalEntryData!$C$11=\"<=\",IF($M206<=GoalEntryData!$D$11,1,0),IF(GoalEntryData!$C$11=\">=\",IF($M206>=GoalEntryData!$D$11,1,0),\"\")))","v":""},"",{"$f":"IF($M206=\"\",\"\",IF(GoalEntryData!$C$12=\"<=\",IF($M206<=GoalEntryData!$D$12,1,0),IF(GoalEntryData!$C$10=\">=\",IF($M206>=GoalEntryData!$D$12,1,0),\"\")))","v":""},"",{"$f":"IF($M206=\"\",\"\",IF(GoalEntryData!$C$10=\"<=\",IF($M206<=GoalEntryData!$D$10,1,0),IF(GoalEntryData!$C$10=\">=\",IF($M206>=GoalEntryData!$D$10,1,0),\"\")))","v":""},""]
[null,null,null,{"$f":"IF($B207=\"\",\"\",IF(GoalEntryData!$C$6=\"<=\",IF($B207<=GoalEntryData!$D$6,1,0),IF(GoalEntryData!$C$6=\">=\",IF($B207>=GoalEntryData!$D$6,1,0),\"\")))","v":""},"",{"$f":"IF($B207=\"\",\"\",IF(GoalEntryData!$C$7=\"<=\",IF($B207<=GoalEntryData!$D$7,1,0),IF(GoalEntryData!$C$7=\">=\",IF($B207>=GoalEntryData!$D$7,1,0),\"\")))","v":""},"",{"$f":"IF($B207=\"\",\"\",IF(GoalEntryData!$C$8=\"<=\",IF($B207<=GoalEntryData!$D$8,1,0),IF(GoalEntryData!$C$8=\">=\",IF($B207>=GoalEntryData!$D$8,1,0),\"\")))","v":""},"",{"$f":"IF($B207=\"\",\"\",IF(GoalEntryData!$C$6=\"<=\",IF($B207<=GoalEntryData!$D$6,1,0),IF(GoalEntryData!$C$6=\">=\",IF($B207>=GoalEntryData!$D$6,1,0),\"\")))","v":""},"",null,null,null,{"$f":"IF($M207=\"\",\"\",IF(GoalEntryData!$C$10=\"<=\",IF($M207<=GoalEntryData!$D$10,1,0),IF(GoalEntryData!$C$10=\">=\",IF($M207>=GoalEntryData!$D$10,1,0),\"\")))","v":""},"",{"$f":"IF($M207=\"\",\"\",IF(GoalEntryData!$C$11=\"<=\",IF($M207<=GoalEntryData!$D$11,1,0),IF(GoalEntryData!$C$11=\">=\",IF($M207>=GoalEntryData!$D$11,1,0),\"\")))","v":""},"",{"$f":"IF($M207=\"\",\"\",IF(GoalEntryData!$C$12=\"<=\",IF($M207<=GoalEntryData!$D$12,1,0),IF(GoalEntryData!$C$10=\">=\",IF($M207>=GoalEntryData!$D$12,1,0),\"\")))","v":""},"",{"$f":"IF($M207=\"\",\"\",IF(GoalEntryData!$C$10=\"<=\",IF($M207<=GoalEntryData!$D$10,1,0),IF(GoalEntryData!$C$10=\">=\",IF($M207>=GoalEntryData!$D$10,1,0),\"\")))","v":""},""]
[null,null,null,{"$f":"IF($B208=\"\",\"\",IF(GoalEntryData!$C$6=\"<=\",IF($B208<=GoalEntryData!$D$6,1,0),IF(GoalEntryData!$C$6=\">=\",IF($B208>=GoalEntryData!$D$6,1,0),\"\")))","v":""},"",{"$f":"IF($B208=\"\",\"\",IF(GoalEntryData!$C$7=\"<=\",IF($B208<=GoalEntryData!$D$7,1,0),IF(GoalEntryData!$C$7=\">=\",IF($B208>=GoalEntryData!$D$7,1,0),\"\")))","v":""},"",{"$f":"IF($B208=\"\",\"\",IF(GoalEntryData!$C$8=\"<=\",IF($B208<=GoalEntryData!$D$8,1,0),IF(GoalEntryData!$C$8=\">=\",IF($B208>=GoalEntryData!$D$8,1,0),\"\")))","v":""},"",{"$f":"IF($B208=\"\",\"\",IF(GoalEntryData!$C$6=\"<=\",IF($B208<=GoalEntryData!$D$6,1,0),IF(GoalEntryData!$C$6=\">=\",IF($B208>=GoalEntryData!$D$6,1,0),\"\")))","v":""},"",null,null,null,{"$f":"IF($M208=\"\",\"\",IF(GoalEntryData!$C$10=\"<=\",IF($M208<=GoalEntryData!$D$10,1,0),IF(GoalEntryData!$C$10=\">=\",IF($M208>=GoalEntryData!$D$10,1,0),\"\")))","v":""},"",{"$f":"IF($M208=\"\",\"\",IF(GoalEntryData!$C$11=\"<=\",IF($M208<=GoalEntryData!$D$11,1,0),IF(GoalEntryData!$C$11=\">=\",IF($M208>=GoalEntryData!$D$11,1,0),\"\")))","v":""},"",{"$f":"IF($M208=\"\",\"\",IF(GoalEntryData!$C$12=\"<=\",IF($M208<=GoalEntryData!$D$12,1,0),IF(GoalEntryData!$C$10=\">=\",IF($M208>=GoalEntryData!$D$12,1,0),\"\")))","v":""},"",{"$f":"IF($M208=\"\",\"\",IF(GoalEntryData!$C$10=\"<=\",IF($M208<=GoalEntryData!$D$10,1,0),IF(GoalEntryData!$C$10=\">=\",IF($M208>=GoalEntryData!$D$10,1,0),\"\")))","v":""},""]
[null,null,null,{"$f":"IF($B209=\"\",\"\",IF(GoalEntryData!$C$6=\"<=\",IF($B209<=GoalEntryData!$D$6,1,0),IF(GoalEntryData!$C$6=\">=\",IF($B209>=GoalEntryData!$D$6,1,0),\"\")))","v":""},"",{"$f":"IF($B209=\"\",\"\",IF(GoalEntryData!$C$7=\"<=\",IF($B209<=GoalEntryData!$D$7,1,0),IF(GoalEntryData!$C$7=\">=\",IF($B209>=GoalEntryData!$D$7,1,0),\"\")))","v":""},"",{"$f":"IF($B209=\"\",\"\",IF(GoalEntryData!$C$8=\"<=\",IF($B209<=GoalEntryData!$D$8,1,0),IF(GoalEntryData!$C$8=\">=\",IF($B209>=GoalEntryData!$D$8,1,0),\"\")))","v":""},"",{"$f":"IF($B209=\"\",\"\",IF(GoalEntryData!$C$6=\"<=\",IF($B209<=GoalEntryData!$D$6,1,0),IF(GoalEntryData!$C$6=\">=\",IF($B209>=GoalEntryData!$D$6,1,0),\"\")))","v":""},"",null,null,null,{"$f":"IF($M209=\"\",\"\",IF(GoalEntryData!$C$10=\"<=\",IF($M209<=GoalEntryData!$D$10,1,0),IF(GoalEntryData!$C$10=\">=\",IF($M209>=GoalEntryData!$D$10,1,0),\"\")))","v":""},"",{"$f":"IF($M209=\"\",\"\",IF(GoalEntryData!$C$11=\"<=\",IF($M209<=GoalEntryData!$D$11,1,0),IF(GoalEntryData!$C$11=\">=\",IF($M209>=GoalEntryData!$D$11,1,0),\"\")))","v":""},"",{"$f":"IF($M209=\"\",\"\",IF(GoalEntryData!$C$12=\"<=\",IF($M209<=GoalEntryData!$D$12,1,0),IF(GoalEntryData!$C$10=\">=\",IF($M209>=GoalEntryData!$D$12,1,0),\"\")))","v":""},"",{"$f":"IF($M209=\"\",\"\",IF(GoalEntryData!$C$10=\"<=\",IF($M209<=GoalEntryData!$D$10,1,0),IF(GoalEntryData!$C$10=\">=\",IF($M209>=GoalEntryData!$D$10,1,0),\"\")))","v":""},""]
[null,null,null,{"$f":"IF($B210=\"\",\"\",IF(GoalEntryData!$C$6=\"<=\",IF($B210<=GoalEntryData!$D$6,1,0),IF(GoalEntryData!$C$6=\">=\",IF($B210>=GoalEntryData!$D$6,1,0),\"\")))","v":""},"",{"$f":"IF($B210=\"\",\"\",IF(GoalEntryData!$C$7=\"<=\",IF($B210<=GoalEntryData!$D$7,1,0),IF(GoalEntryData!$C$7=\">=\",IF($B210>=GoalEntryData!$D$7,1,0),\"\")))","v":""},"",{"$f":"IF($B210=\"\",\"\",IF(GoalEntryData!$C$8=\"<=\",IF($B210<=GoalEntryData!$D$8,1,0),IF(GoalEntryData!$C$8=\">=\",IF($B210>=GoalEntryData!$D$8,1,0),\"\")))","v":""},"",{"$f":"IF($B210=\"\",\"\",IF(GoalEntryData!$C$6=\"<=\",IF($B210<=GoalEntryData!$D$6,1,0),IF(GoalEntryData!$C$6=\">=\",IF($B210>=GoalEntryData!$D$6,1,0),\"\")))","v":""},"",null,null,null,{"$f":"IF($M210=\"\",\"\",IF(GoalEntryData!$C$10=\"<=\",IF($M210<=GoalEntryData!$D$10,1,0),IF(GoalEntryData!$C$10=\">=\",IF($M210>=GoalEntryData!$D$10,1,0),\"\")))","v":""},"",{"$f":"IF($M210=\"\",\"\",IF(GoalEntryData!$C$11=\"<=\",IF($M210<=GoalEntryData!$D$11,1,0),IF(GoalEntryData!$C$11=\">=\",IF($M210>=GoalEntryData!$D$11,1,0),\"\")))","v":""},"",{"$f":"IF($M210=\"\",\"\",IF(GoalEntryData!$C$12=\"<=\",IF($M210<=GoalEntryData!$D$12,1,0),IF(GoalEntryData!$C$10=\">=\",IF($M210>=GoalEntryData!$D$12,1,0),\"\")))","v":""},"",{"$f":"IF($M210=\"\",\"\",IF(GoalEntryData!$C$10=\"<=\",IF($M210<=GoalEntryData!$D$10,1,0),IF(GoalEntryData!$C$10=\">=\",IF($M210>=GoalEntryData!$D$10,1,0),\"\")))","v":""},""]
[null,null,null,{"$f":"IF($B211=\"\",\"\",IF(GoalEntryData!$C$6=\"<=\",IF($B211<=GoalEntryData!$D$6,1,0),IF(GoalEntryData!$C$6=\">=\",IF($B211>=GoalEntryData!$D$6,1,0),\"\")))","v":""},"",{"$f":"IF($B211=\"\",\"\",IF(GoalEntryData!$C$7=\"<=\",IF($B211<=GoalEntryData!$D$7,1,0),IF(GoalEntryData!$C$7=\">=\",IF($B211>=GoalEntryData!$D$7,1,0),\"\")))","v":""},"",{"$f":"IF($B211=\"\",\"\",IF(GoalEntryData!$C$8=\"<=\",IF($B211<=GoalEntryData!$D$8,1,0),IF(GoalEntryData!$C$8=\">=\",IF($B211>=GoalEntryData!$D$8,1,0),\"\")))","v":""},"",{"$f":"IF($B211=\"\",\"\",IF(GoalEntryData!$C$6=\"<=\",IF($B211<=GoalEntryData!$D$6,1,0),IF(GoalEntryData!$C$6=\">=\",IF($B211>=GoalEntryData!$D$6,1,0),\"\")))","v":""},"",null,null,null,{"$f":"IF($M211=\"\",\"\",IF(GoalEntryData!$C$10=\"<=\",IF($M211<=GoalEntryData!$D$10,1,0),IF(GoalEntryData!$C$10=\">=\",IF($M211>=GoalEntryData!$D$10,1,0),\"\")))","v":""},"",{"$f":"IF($M211=\"\",\"\",IF(GoalEntryData!$C$11=\"<=\",IF($M211<=GoalEntryData!$D$11,1,0),IF(GoalEntryData!$C$11=\">=\",IF($M211>=GoalEntryData!$D$11,1,0),\"\")))","v":""},"",{"$f":"IF($M211=\"\",\"\",IF(GoalEntryData!$C$12=\"<=\",IF($M211<=GoalEntryData!$D$12,1,0),IF(GoalEntryData!$C$10=\">=\",IF($M211>=GoalEntryData!$D$12,1,0),\"\")))","v":""},"",{"$f":"IF($M211=\"\",\"\",IF(GoalEntryData!$C$10=\"<=\",IF($M211<=GoalEntryData!$D$10,1,0),IF(GoalEntryData!$C$10=\">=\",IF($M211>=GoalEntryData!$D$10,1,0),\"\")))","v":""},""]
[null,null,null,{"$f":"IF($B212=\"\",\"\",IF(GoalEntryData!$C$6=\"<=\",IF($B212<=GoalEntryData!$D$6,1,0),IF(GoalEntryData!$C$6=\">=\",IF($B212>=GoalEntryData!$D$6,1,0),\"\")))","v":""},"",{"$f":"IF($B212=\"\",\"\",IF(GoalEntryData!$C$7=\"<=\",IF($B212<=GoalEntryData!$D$7,1,0),IF(GoalEntryData!$C$7=\">=\",IF($B212>=GoalEntryData!$D$7,1,0),\"\")))","v":""},"",{"$f":"IF($B212=\"\",\"\",IF(GoalEntryData!$C$8=\"<=\",IF($B212<=GoalEntryData!$D$8,1,0),IF(GoalEntryData!$C$8=\">=\",IF($B212>=GoalEntryData!$D$8,1,0),\"\")))","v":""},"",{"$f":"IF($B212=\"\",\"\",IF(GoalEntryData!$C$6=\"<=\",IF($B212<=GoalEntryData!$D$6,1,0),IF(GoalEntryData!$C$6=\">=\",IF($B212>=GoalEntryData!$D$6,1,0),\"\")))","v":""},"",null,null,null,{"$f":"IF($M212=\"\",\"\",IF(GoalEntryData!$C$10=\"<=\",IF($M212<=GoalEntryData!$D$10,1,0),IF(GoalEntryData!$C$10=\">=\",IF($M212>=GoalEntryData!$D$10,1,0),\"\")))","v":""},"",{"$f":"IF($M212=\"\",\"\",IF(GoalEntryData!$C$11=\"<=\",IF($M212<=GoalEntryData!$D$11,1,0),IF(GoalEntryData!$C$11=\">=\",IF($M212>=GoalEntryData!$D$11,1,0),\"\")))","v":""},"",{"$f":"IF($M212=\"\",\"\",IF(GoalEntryData!$C$12=\"<=\",IF($M212<=GoalEntryData!$D$12,1,0),IF(GoalEntryData!$C$10=\">=\",IF($M212>=GoalEntryData!$D$12,1,0),\"\")))","v":""},"",{"$f":"IF($M212=\"\",\"\",IF(GoalEntryData!$C$10=\"<=\",IF($M212<=GoalEntryData!$D$10,1,0),IF(GoalEntryData!$C$10=\">=\",IF($M212>=GoalEntryData!$D$10,1,0),\"\")))","v":""},""]
[null,null,null,{"$f":"IF($B213=\"\",\"\",IF(GoalEntryData!$C$6=\"<=\",IF($B213<=GoalEntryData!$D$6,1,0),IF(GoalEntryData!$C$6=\">=\",IF($B213>=GoalEntryData!$D$6,1,0),\"\")))","v":""},"",{"$f":"IF($B213=\"\",\"\",IF(GoalEntryData!$C$7=\"<=\",IF($B213<=GoalEntryData!$D$7,1,0),IF(GoalEntryData!$C$7=\">=\",IF($B213>=GoalEntryData!$D$7,1,0),\"\")))","v":""},"",{"$f":"IF($B213=\"\",\"\",IF(GoalEntryData!$C$8=\"<=\",IF($B213<=GoalEntryData!$D$8,1,0),IF(GoalEntryData!$C$8=\">=\",IF($B213>=GoalEntryData!$D$8,1,0),\"\")))","v":""},"",{"$f":"IF($B213=\"\",\"\",IF(GoalEntryData!$C$6=\"<=\",IF($B213<=GoalEntryData!$D$6,1,0),IF(GoalEntryData!$C$6=\">=\",IF($B213>=GoalEntryData!$D$6,1,0),\"\")))","v":""},"",null,null,null,{"$f":"IF($M213=\"\",\"\",IF(GoalEntryData!$C$10=\"<=\",IF($M213<=GoalEntryData!$D$10,1,0),IF(GoalEntryData!$C$10=\">=\",IF($M213>=GoalEntryData!$D$10,1,0),\"\")))","v":""},"",{"$f":"IF($M213=\"\",\"\",IF(GoalEntryData!$C$11=\"<=\",IF($M213<=GoalEntryData!$D$11,1,0),IF(GoalEntryData!$C$11=\">=\",IF($M213>=GoalEntryData!$D$11,1,0),\"\")))","v":""},"",{"$f":"IF($M213=\"\",\"\",IF(GoalEntryData!$C$12=\"<=\",IF($M213<=GoalEntryData!$D$12,1,0),IF(GoalEntryData!$C$10=\">=\",IF($M213>=GoalEntryData!$D$12,1,0),\"\")))","v":""},"",{"$f":"IF($M213=\"\",\"\",IF(GoalEntryData!$C$10=\"<=\",IF($M213<=GoalEntryData!$D$10,1,0),IF(GoalEntryData!$C$10=\">=\",IF($M213>=GoalEntryData!$D$10,1,0),\"\")))","v":""},""]
[null,null,null,{"$f":"IF($B214=\"\",\"\",IF(GoalEntryData!$C$6=\"<=\",IF($B214<=GoalEntryData!$D$6,1,0),IF(GoalEntryData!$C$6=\">=\",IF($B214>=GoalEntryData!$D$6,1,0),\"\")))","v":""},"",{"$f":"IF($B214=\"\",\"\",IF(GoalEntryData!$C$7=\"<=\",IF($B214<=GoalEntryData!$D$7,1,0),IF(GoalEntryData!$C$7=\">=\",IF($B214>=GoalEntryData!$D$7,1,0),\"\")))","v":""},"",{"$f":"IF($B214=\"\",\"\",IF(GoalEntryData!$C$8=\"<=\",IF($B214<=GoalEntryData!$D$8,1,0),IF(GoalEntryData!$C$8=\">=\",IF($B214>=GoalEntryData!$D$8,1,0),\"\")))","v":""},"",{"$f":"IF($B214=\"\",\"\",IF(GoalEntryData!$C$6=\"<=\",IF($B214<=GoalEntryData!$D$6,1,0),IF(GoalEntryData!$C$6=\">=\",IF($B214>=GoalEntryData!$D$6,1,0),\"\")))","v":""},"",null,null,null,{"$f":"IF($M214=\"\",\"\",IF(GoalEntryData!$C$10=\"<=\",IF($M214<=GoalEntryData!$D$10,1,0),IF(GoalEntryData!$C$10=\">=\",IF($M214>=GoalEntryData!$D$10,1,0),\"\")))","v":""},"",{"$f":"IF($M214=\"\",\"\",IF(GoalEntryData!$C$11=\"<=\",IF($M214<=GoalEntryData!$D$11,1,0),IF(GoalEntryData!$C$11=\">=\",IF($M214>=GoalEntryData!$D$11,1,0),\"\")))","v":""},"",{"$f":"IF($M214=\"\",\"\",IF(GoalEntryData!$C$12=\"<=\",IF($M214<=GoalEntryData!$D$12,1,0),IF(GoalEntryData!$C$10=\">=\",IF($M214>=GoalEntryData!$D$12,1,0),\"\")))","v":""},"",{"$f":"IF($M214=\"\",\"\",IF(GoalEntryData!$C$10=\"<=\",IF($M214<=GoalEntryData!$D$10,1,0),IF(GoalEntryData!$C$10=\">=\",IF($M214>=GoalEntryData!$D$10,1,0),\"\")))","v":""},""]
[null,null,null,{"$f":"IF($B215=\"\",\"\",IF(GoalEntryData!$C$6=\"<=\",IF($B215<=GoalEntryData!$D$6,1,0),IF(GoalEntryData!$C$6=\">=\",IF($B215>=GoalEntryData!$D$6,1,0),\"\")))","v":""},"",{"$f":"IF($B215=\"\",\"\",IF(GoalEntryData!$C$7=\"<=\",IF($B215<=GoalEntryData!$D$7,1,0),IF(GoalEntryData!$C$7=\">=\",IF($B215>=GoalEntryData!$D$7,1,0),\"\")))","v":""},"",{"$f":"IF($B215=\"\",\"\",IF(GoalEntryData!$C$8=\"<=\",IF($B215<=GoalEntryData!$D$8,1,0),IF(GoalEntryData!$C$8=\">=\",IF($B215>=GoalEntryData!$D$8,1,0),\"\")))","v":""},"",{"$f":"IF($B215=\"\",\"\",IF(GoalEntryData!$C$6=\"<=\",IF($B215<=GoalEntryData!$D$6,1,0),IF(GoalEntryData!$C$6=\">=\",IF($B215>=GoalEntryData!$D$6,1,0),\"\")))","v":""},"",null,null,null,{"$f":"IF($M215=\"\",\"\",IF(GoalEntryData!$C$10=\"<=\",IF($M215<=GoalEntryData!$D$10,1,0),IF(GoalEntryData!$C$10=\">=\",IF($M215>=GoalEntryData!$D$10,1,0),\"\")))","v":""},"",{"$f":"IF($M215=\"\",\"\",IF(GoalEntryData!$C$11=\"<=\",IF($M215<=GoalEntryData!$D$11,1,0),IF(GoalEntryData!$C$11=\">=\",IF($M215>=GoalEntryData!$D$11,1,0),\"\")))","v":""},"",{"$f":"IF($M215=\"\",\"\",IF(GoalEntryData!$C$12=\"<=\",IF($M215<=GoalEntryData!$D$12,1,0),IF(GoalEntryData!$C$10=\">=\",IF($M215>=GoalEntryData!$D$12,1,0),\"\")))","v":""},"",{"$f":"IF($M215=\"\",\"\",IF(GoalEntryData!$C$10=\"<=\",IF($M215<=GoalEntryData!$D$10,1,0),IF(GoalEntryData!$C$10=\">=\",IF($M215>=GoalEntryData!$D$10,1,0),\"\")))","v":""},""]
[null,null,null,{"$f":"IF($B216=\"\",\"\",IF(GoalEntryData!$C$6=\"<=\",IF($B216<=GoalEntryData!$D$6,1,0),IF(GoalEntryData!$C$6=\">=\",IF($B216>=GoalEntryData!$D$6,1,0),\"\")))","v":""},"",{"$f":"IF($B216=\"\",\"\",IF(GoalEntryData!$C$7=\"<=\",IF($B216<=GoalEntryData!$D$7,1,0),IF(GoalEntryData!$C$7=\">=\",IF($B216>=GoalEntryData!$D$7,1,0),\"\")))","v":""},"",{"$f":"IF($B216=\"\",\"\",IF(GoalEntryData!$C$8=\"<=\",IF($B216<=GoalEntryData!$D$8,1,0),IF(GoalEntryData!$C$8=\">=\",IF($B216>=GoalEntryData!$D$8,1,0),\"\")))","v":""},"",{"$f":"IF($B216=\"\",\"\",IF(GoalEntryData!$C$6=\"<=\",IF($B216<=GoalEntryData!$D$6,1,0),IF(GoalEntryData!$C$6=\">=\",IF($B216>=GoalEntryData!$D$6,1,0),\"\")))","v":""},"",null,null,null,{"$f":"IF($M216=\"\",\"\",IF(GoalEntryData!$C$10=\"<=\",IF($M216<=GoalEntryData!$D$10,1,0),IF(GoalEntryData!$C$10=\">=\",IF($M216>=GoalEntryData!$D$10,1,0),\"\")))","v":""},"",{"$f":"IF($M216=\"\",\"\",IF(GoalEntryData!$C$11=\"<=\",IF($M216<=GoalEntryData!$D$11,1,0),IF(GoalEntryData!$C$11=\">=\",IF($M216>=GoalEntryData!$D$11,1,0),\"\")))","v":""},"",{"$f":"IF($M216=\"\",\"\",IF(GoalEntryData!$C$12=\"<=\",IF($M216<=GoalEntryData!$D$12,1,0),IF(GoalEntryData!$C$10=\">=\",IF($M216>=GoalEntryData!$D$12,1,0),\"\")))","v":""},"",{"$f":"IF($M216=\"\",\"\",IF(GoalEntryData!$C$10=\"<=\",IF($M216<=GoalEntryData!$D$10,1,0),IF(GoalEntryData!$C$10=\">=\",IF($M216>=GoalEntryData!$D$10,1,0),\"\")))","v":""},""]
[null,null,null,{"$f":"IF($B217=\"\",\"\",IF(GoalEntryData!$C$6=\"<=\",IF($B217<=GoalEntryData!$D$6,1,0),IF(GoalEntryData!$C$6=\">=\",IF($B217>=GoalEntryData!$D$6,1,0),\"\")))","v":""},"",{"$f":"IF($B217=\"\",\"\",IF(GoalEntryData!$C$7=\"<=\",IF($B217<=GoalEntryData!$D$7,1,0),IF(GoalEntryData!$C$7=\">=\",IF($B217>=GoalEntryData!$D$7,1,0),\"\")))","v":""},"",{"$f":"IF($B217=\"\",\"\",IF(GoalEntryData!$C$8=\"<=\",IF($B217<=GoalEntryData!$D$8,1,0),IF(GoalEntryData!$C$8=\">=\",IF($B217>=GoalEntryData!$D$8,1,0),\"\")))","v":""},"",{"$f":"IF($B217=\"\",\"\",IF(GoalEntryData!$C$6=\"<=\",IF($B217<=GoalEntryData!$D$6,1,0),IF(GoalEntryData!$C$6=\">=\",IF($B217>=GoalEntryData!$D$6,1,0),\"\")))","v":""},"",null,null,null,{"$f":"IF($M217=\"\",\"\",IF(GoalEntryData!$C$10=\"<=\",IF($M217<=GoalEntryData!$D$10,1,0),IF(GoalEntryData!$C$10=\">=\",IF($M217>=GoalEntryData!$D$10,1,0),\"\")))","v":""},"",{"$f":"IF($M217=\"\",\"\",IF(GoalEntryData!$C$11=\"<=\",IF($M217<=GoalEntryData!$D$11,1,0),IF(GoalEntryData!$C$11=\">=\",IF($M217>=GoalEntryData!$D$11,1,0),\"\")))","v":""},"",{"$f":"IF($M217=\"\",\"\",IF(GoalEntryData!$C$12=\"<=\",IF($M217<=GoalEntryData!$D$12,1,0),IF(GoalEntryData!$C$10=\">=\",IF($M217>=GoalEntryData!$D$12,1,0),\"\")))","v":""},"",{"$f":"IF($M217=\"\",\"\",IF(GoalEntryData!$C$10=\"<=\",IF($M217<=GoalEntryData!$D$10,1,0),IF(GoalEntryData!$C$10=\">=\",IF($M217>=GoalEntryData!$D$10,1,0),\"\")))","v":""},""]
[null,null,null,{"$f":"IF($B218=\"\",\"\",IF(GoalEntryData!$C$6=\"<=\",IF($B218<=GoalEntryData!$D$6,1,0),IF(GoalEntryData!$C$6=\">=\",IF($B218>=GoalEntryData!$D$6,1,0),\"\")))","v":""},"",{"$f":"IF($B218=\"\",\"\",IF(GoalEntryData!$C$7=\"<=\",IF($B218<=GoalEntryData!$D$7,1,0),IF(GoalEntryData!$C$7=\">=\",IF($B218>=GoalEntryData!$D$7,1,0),\"\")))","v":""},"",{"$f":"IF($B218=\"\",\"\",IF(GoalEntryData!$C$8=\"<=\",IF($B218<=GoalEntryData!$D$8,1,0),IF(GoalEntryData!$C$8=\">=\",IF($B218>=GoalEntryData!$D$8,1,0),\"\")))","v":""},"",{"$f":"IF($B218=\"\",\"\",IF(GoalEntryData!$C$6=\"<=\",IF($B218<=GoalEntryData!$D$6,1,0),IF(GoalEntryData!$C$6=\">=\",IF($B218>=GoalEntryData!$D$6,1,0),\"\")))","v":""},"",null,null,null,{"$f":"IF($M218=\"\",\"\",IF(GoalEntryData!$C$10=\"<=\",IF($M218<=GoalEntryData!$D$10,1,0),IF(GoalEntryData!$C$10=\">=\",IF($M218>=GoalEntryData!$D$10,1,0),\"\")))","v":""},"",{"$f":"IF($M218=\"\",\"\",IF(GoalEntryData!$C$11=\"<=\",IF($M218<=GoalEntryData!$D$11,1,0),IF(GoalEntryData!$C$11=\">=\",IF($M218>=GoalEntryData!$D$11,1,0),\"\")))","v":""},"",{"$f":"IF($M218=\"\",\"\",IF(GoalEntryData!$C$12=\"<=\",IF($M218<=GoalEntryData!$D$12,1,0),IF(GoalEntryData!$C$10=\">=\",IF($M218>=GoalEntryData!$D$12,1,0),\"\")))","v":""},"",{"$f":"IF($M218=\"\",\"\",IF(GoalEntryData!$C$10=\"<=\",IF($M218<=GoalEntryData!$D$10,1,0),IF(GoalEntryData!$C$10=\">=\",IF($M218>=GoalEntryData!$D$10,1,0),\"\")))","v":""},""]
[null,null,null,{"$f":"IF($B219=\"\",\"\",IF(GoalEntryData!$C$6=\"<=\",IF($B219<=GoalEntryData!$D$6,1,0),IF(GoalEntryData!$C$6=\">=\",IF($B219>=GoalEntryData!$D$6,1,0),\"\")))","v":""},"",{"$f":"IF($B219=\"\",\"\",IF(GoalEntryData!$C$7=\"<=\",IF($B219<=GoalEntryData!$D$7,1,0),IF(GoalEntryData!$C$7=\">=\",IF($B219>=GoalEntryData!$D$7,1,0),\"\")))","v":""},"",{"$f":"IF($B219=\"\",\"\",IF(GoalEntryData!$C$8=\"<=\",IF($B219<=GoalEntryData!$D$8,1,0),IF(GoalEntryData!$C$8=\">=\",IF($B219>=GoalEntryData!$D$8,1,0),\"\")))","v":""},"",{"$f":"IF($B219=\"\",\"\",IF(GoalEntryData!$C$6=\"<=\",IF($B219<=GoalEntryData!$D$6,1,0),IF(GoalEntryData!$C$6=\">=\",IF($B219>=GoalEntryData!$D$6,1,0),\"\")))","v":""},"",null,null,null,{"$f":"IF($M219=\"\",\"\",IF(GoalEntryData!$C$10=\"<=\",IF($M219<=GoalEntryData!$D$10,1,0),IF(GoalEntryData!$C$10=\">=\",IF($M219>=GoalEntryData!$D$10,1,0),\"\")))","v":""},"",{"$f":"IF($M219=\"\",\"\",IF(GoalEntryData!$C$11=\"<=\",IF($M219<=GoalEntryData!$D$11,1,0),IF(GoalEntryData!$C$11=\">=\",IF($M219>=GoalEntryData!$D$11,1,0),\"\")))","v":""},"",{"$f":"IF($M219=\"\",\"\",IF(GoalEntryData!$C$12=\"<=\",IF($M219<=GoalEntryData!$D$12,1,0),IF(GoalEntryData!$C$10=\">=\",IF($M219>=GoalEntryData!$D$12,1,0),\"\")))","v":""},"",{"$f":"IF($M219=\"\",\"\",IF(GoalEntryData!$C$10=\"<=\",IF($M219<=GoalEntryData!$D$10,1,0),IF(GoalEntryData!$C$10=\">=\",IF($M219>=GoalEntryData!$D$10,1,0),\"\")))","v":""},""]
[null,null,null,{"$f":"IF($B220=\"\",\"\",IF(GoalEntryData!$C$6=\"<=\",IF($B220<=GoalEntryData!$D$6,1,0),IF(GoalEntryData!$C$6=\">=\",IF($B220>=GoalEntryData!$D$6,1,0),\"\")))","v":""},"",{"$f":"IF($B220=\"\",\"\",IF(GoalEntryData!$C$7=\"<=\",IF($B220<=GoalEntryData!$D$7,1,0),IF(GoalEntryData!$C$7=\">=\",IF($B220>=GoalEntryData!$D$7,1,0),\"\")))","v":""},"",{"$f":"IF($B220=\"\",\"\",IF(GoalEntryData!$C$8=\"<=\",IF($B220<=GoalEntryData!$D$8,1,0),IF(GoalEntryData!$C$8=\">=\",IF($B220>=GoalEntryData!$D$8,1,0),\"\")))","v":""},"",{"$f":"IF($B220=\"\",\"\",IF(GoalEntryData!$C$6=\"<=\",IF($B220<=GoalEntryData!$D$6,1,0),IF(GoalEntryData!$C$6=\">=\",IF($B220>=GoalEntryData!$D$6,1,0),\"\")))","v":""},"",null,null,null,{"$f":"IF($M220=\"\",\"\",IF(GoalEntryData!$C$10=\"<=\",IF($M220<=GoalEntryData!$D$10,1,0),IF(GoalEntryData!$C$10=\">=\",IF($M220>=GoalEntryData!$D$10,1,0),\"\")))","v":""},"",{"$f":"IF($M220=\"\",\"\",IF(GoalEntryData!$C$11=\"<=\",IF($M220<=GoalEntryData!$D$11,1,0),IF(GoalEntryData!$C$11=\">=\",IF($M220>=GoalEntryData!$D$11,1,0),\"\")))","v":""},"",{"$f":"IF($M220=\"\",\"\",IF(GoalEntryData!$C$12=\"<=\",IF($M220<=GoalEntryData!$D$12,1,0),IF(GoalEntryData!$C$10=\">=\",IF($M220>=GoalEntryData!$D$12,1,0),\"\")))","v":""},"",{"$f":"IF($M220=\"\",\"\",IF(GoalEntryData!$C$10=\"<=\",IF($M220<=GoalEntryData!$D$10,1,0),IF(GoalEntryData!$C$10=\">=\",IF($M220>=GoalEntryData!$D$10,1,0),\"\")))","v":""},""]
[null,null,null,{"$f":"IF($B221=\"\",\"\",IF(GoalEntryData!$C$6=\"<=\",IF($B221<=GoalEntryData!$D$6,1,0),IF(GoalEntryData!$C$6=\">=\",IF($B221>=GoalEntryData!$D$6,1,0),\"\")))","v":""},"",{"$f":"IF($B221=\"\",\"\",IF(GoalEntryData!$C$7=\"<=\",IF($B221<=GoalEntryData!$D$7,1,0),IF(GoalEntryData!$C$7=\">=\",IF($B221>=GoalEntryData!$D$7,1,0),\"\")))","v":""},"",{"$f":"IF($B221=\"\",\"\",IF(GoalEntryData!$C$8=\"<=\",IF($B221<=GoalEntryData!$D$8,1,0),IF(GoalEntryData!$C$8=\">=\",IF($B221>=GoalEntryData!$D$8,1,0),\"\")))","v":""},"",{"$f":"IF($B221=\"\",\"\",IF(GoalEntryData!$C$6=\"<=\",IF($B221<=GoalEntryData!$D$6,1,0),IF(GoalEntryData!$C$6=\">=\",IF($B221>=GoalEntryData!$D$6,1,0),\"\")))","v":""},"",null,null,null,{"$f":"IF($M221=\"\",\"\",IF(GoalEntryData!$C$10=\"<=\",IF($M221<=GoalEntryData!$D$10,1,0),IF(GoalEntryData!$C$10=\">=\",IF($M221>=GoalEntryData!$D$10,1,0),\"\")))","v":""},"",{"$f":"IF($M221=\"\",\"\",IF(GoalEntryData!$C$11=\"<=\",IF($M221<=GoalEntryData!$D$11,1,0),IF(GoalEntryData!$C$11=\">=\",IF($M221>=GoalEntryData!$D$11,1,0),\"\")))","v":""},"",{"$f":"IF($M221=\"\",\"\",IF(GoalEntryData!$C$12=\"<=\",IF($M221<=GoalEntryData!$D$12,1,0),IF(GoalEntryData!$C$10=\">=\",IF($M221>=GoalEntryData!$D$12,1,0),\"\")))","v":""},"",{"$f":"IF($M221=\"\",\"\",IF(GoalEntryData!$C$10=\"<=\",IF($M221<=GoalEntryData!$D$10,1,0),IF(GoalEntryData!$C$10=\">=\",IF($M221>=GoalEntryData!$D$10,1,0),\"\")))","v":""},""]
[null,null,null,{"$f":"IF($B222=\"\",\"\",IF(GoalEntryData!$C$6=\"<=\",IF($B222<=GoalEntryData!$D$6,1,0),IF(GoalEntryData!$C$6=\">=\",IF($B222>=GoalEntryData!$D$6,1,0),\"\")))","v":""},"",{"$f":"IF($B222=\"\",\"\",IF(GoalEntryData!$C$7=\"<=\",IF($B222<=GoalEntryData!$D$7,1,0),IF(GoalEntryData!$C$7=\">=\",IF($B222>=GoalEntryData!$D$7,1,0),\"\")))","v":""},"",{"$f":"IF($B222=\"\",\"\",IF(GoalEntryData!$C$8=\"<=\",IF($B222<=GoalEntryData!$D$8,1,0),IF(GoalEntryData!$C$8=\">=\",IF($B222>=GoalEntryData!$D$8,1,0),\"\")))","v":""},"",{"$f":"IF($B222=\"\",\"\",IF(GoalEntryData!$C$6=\"<=\",IF($B222<=GoalEntryData!$D$6,1,0),IF(GoalEntryData!$C$6=\">=\",IF($B222>=GoalEntryData!$D$6,1,0),\"\")))","v":""},"",null,null,null,{"$f":"IF($M222=\"\",\"\",IF(GoalEntryData!$C$10=\"<=\",IF($M222<=GoalEntryData!$D$10,1,0),IF(GoalEntryData!$C$10=\">=\",IF($M222>=GoalEntryData!$D$10,1,0),\"\")))","v":""},"",{"$f":"IF($M222=\"\",\"\",IF(GoalEntryData!$C$11=\"<=\",IF($M222<=GoalEntryData!$D$11,1,0),IF(GoalEntryData!$C$11=\">=\",IF($M222>=GoalEntryData!$D$11,1,0),\"\")))","v":""},"",{"$f":"IF($M222=\"\",\"\",IF(GoalEntryData!$C$12=\"<=\",IF($M222<=GoalEntryData!$D$12,1,0),IF(GoalEntryData!$C$10=\">=\",IF($M222>=GoalEntryData!$D$12,1,0),\"\")))","v":""},"",{"$f":"IF($M222=\"\",\"\",IF(GoalEntryData!$C$10=\"<=\",IF($M222<=GoalEntryData!$D$10,1,0),IF(GoalEntryData!$C$10=\">=\",IF($M222>=GoalEntryData!$D$10,1,0),\"\")))","v":""},""]
[null,null,null,{"$f":"IF($B223=\"\",\"\",IF(GoalEntryData!$C$6=\"<=\",IF($B223<=GoalEntryData!$D$6,1,0),IF(GoalEntryData!$C$6=\">=\",IF($B223>=GoalEntryData!$D$6,1,0),\"\")))","v":""},"",{"$f":"IF($B223=\"\",\"\",IF(GoalEntryData!$C$7=\"<=\",IF($B223<=GoalEntryData!$D$7,1,0),IF(GoalEntryData!$C$7=\">=\",IF($B223>=GoalEntryData!$D$7,1,0),\"\")))","v":""},"",{"$f":"IF($B223=\"\",\"\",IF(GoalEntryData!$C$8=\"<=\",IF($B223<=GoalEntryData!$D$8,1,0),IF(GoalEntryData!$C$8=\">=\",IF($B223>=GoalEntryData!$D$8,1,0),\"\")))","v":""},"",{"$f":"IF($B223=\"\",\"\",IF(GoalEntryData!$C$6=\"<=\",IF($B223<=GoalEntryData!$D$6,1,0),IF(GoalEntryData!$C$6=\">=\",IF($B223>=GoalEntryData!$D$6,1,0),\"\")))","v":""},"",null,null,null,{"$f":"IF($M223=\"\",\"\",IF(GoalEntryData!$C$10=\"<=\",IF($M223<=GoalEntryData!$D$10,1,0),IF(GoalEntryData!$C$10=\">=\",IF($M223>=GoalEntryData!$D$10,1,0),\"\")))","v":""},"",{"$f":"IF($M223=\"\",\"\",IF(GoalEntryData!$C$11=\"<=\",IF($M223<=GoalEntryData!$D$11,1,0),IF(GoalEntryData!$C$11=\">=\",IF($M223>=GoalEntryData!$D$11,1,0),\"\")))","v":""},"",{"$f":"IF($M223=\"\",\"\",IF(GoalEntryData!$C$12=\"<=\",IF($M223<=GoalEntryData!$D$12,1,0),IF(GoalEntryData!$C$10=\">=\",IF($M223>=GoalEntryData!$D$12,1,0),\"\")))","v":""},"",{"$f":"IF($M223=\"\",\"\",IF(GoalEntryData!$C$10=\"<=\",IF($M223<=GoalEntryData!$D$10,1,0),IF(GoalEntryData!$C$10=\">=\",IF($M223>=GoalEntryData!$D$10,1,0),\"\")))","v":""},""]
[null,null,null,{"$f":"IF($B224=\"\",\"\",IF(GoalEntryData!$C$6=\"<=\",IF($B224<=GoalEntryData!$D$6,1,0),IF(GoalEntryData!$C$6=\">=\",IF($B224>=GoalEntryData!$D$6,1,0),\"\")))","v":""},"",{"$f":"IF($B224=\"\",\"\",IF(GoalEntryData!$C$7=\"<=\",IF($B224<=GoalEntryData!$D$7,1,0),IF(GoalEntryData!$C$7=\">=\",IF($B224>=GoalEntryData!$D$7,1,0),\"\")))","v":""},"",{"$f":"IF($B224=\"\",\"\",IF(GoalEntryData!$C$8=\"<=\",IF($B224<=GoalEntryData!$D$8,1,0),IF(GoalEntryData!$C$8=\">=\",IF($B224>=GoalEntryData!$D$8,1,0),\"\")))","v":""},"",{"$f":"IF($B224=\"\",\"\",IF(GoalEntryData!$C$6=\"<=\",IF($B224<=GoalEntryData!$D$6,1,0),IF(GoalEntryData!$C$6=\">=\",IF($B224>=GoalEntryData!$D$6,1,0),\"\")))","v":""},"",null,null,null,{"$f":"IF($M224=\"\",\"\",IF(GoalEntryData!$C$10=\"<=\",IF($M224<=GoalEntryData!$D$10,1,0),IF(GoalEntryData!$C$10=\">=\",IF($M224>=GoalEntryData!$D$10,1,0),\"\")))","v":""},"",{"$f":"IF($M224=\"\",\"\",IF(GoalEntryData!$C$11=\"<=\",IF($M224<=GoalEntryData!$D$11,1,0),IF(GoalEntryData!$C$11=\">=\",IF($M224>=GoalEntryData!$D$11,1,0),\"\")))","v":""},"",{"$f":"IF($M224=\"\",\"\",IF(GoalEntryData!$C$12=\"<=\",IF($M224<=GoalEntryData!$D$12,1,0),IF(GoalEntryData!$C$10=\">=\",IF($M224>=GoalEntryData!$D$12,1,0),\"\")))","v":""},"",{"$f":"IF($M224=\"\",\"\",IF(GoalEntryData!$C$10=\"<=\",IF($M224<=GoalEntryData!$D$10,1,0),IF(GoalEntryData!$C$10=\">=\",IF($M224>=GoalEntryData!$D$10,1,0),\"\")))","v":""},""]
[null,null,null,{"$f":"IF($B225=\"\",\"\",IF(GoalEntryData!$C$6=\"<=\",IF($B225<=GoalEntryData!$D$6,1,0),IF(GoalEntryData!$C$6=\">=\",IF($B225>=GoalEntryData!$D$6,1,0),\"\")))","v":""},"",{"$f":"IF($B225=\"\",\"\",IF(GoalEntryData!$C$7=\"<=\",IF($B225<=GoalEntryData!$D$7,1,0),IF(GoalEntryData!$C$7=\">=\",IF($B225>=GoalEntryData!$D$7,1,0),\"\")))","v":""},"",{"$f":"IF($B225=\"\",\"\",IF(GoalEntryData!$C$8=\"<=\",IF($B225<=GoalEntryData!$D$8,1,0),IF(GoalEntryData!$C$8=\">=\",IF($B225>=GoalEntryData!$D$8,1,0),\"\")))","v":""},"",{"$f":"IF($B225=\"\",\"\",IF(GoalEntryData!$C$6=\"<=\",IF($B225<=GoalEntryData!$D$6,1,0),IF(GoalEntryData!$C$6=\">=\",IF($B225>=GoalEntryData!$D$6,1,0),\"\")))","v":""},"",null,null,null,{"$f":"IF($M225=\"\",\"\",IF(GoalEntryData!$C$10=\"<=\",IF($M225<=GoalEntryData!$D$10,1,0),IF(GoalEntryData!$C$10=\">=\",IF($M225>=GoalEntryData!$D$10,1,0),\"\")))","v":""},"",{"$f":"IF($M225=\"\",\"\",IF(GoalEntryData!$C$11=\"<=\",IF($M225<=GoalEntryData!$D$11,1,0),IF(GoalEntryData!$C$11=\">=\",IF($M225>=GoalEntryData!$D$11,1,0),\"\")))","v":""},"",{"$f":"IF($M225=\"\",\"\",IF(GoalEntryData!$C$12=\"<=\",IF($M225<=GoalEntryData!$D$12,1,0),IF(GoalEntryData!$C$10=\">=\",IF($M225>=GoalEntryData!$D$12,1,0),\"\")))","v":""},"",{"$f":"IF($M225=\"\",\"\",IF(GoalEntryData!$C$10=\"<=\",IF($M225<=GoalEntryData!$D$10,1,0),IF(GoalEntryData!$C$10=\">=\",IF($M225>=GoalEntryData!$D$10,1,0),\"\")))","v":""},""]
[null,null,null,{"$f":"IF($B226=\"\",\"\",IF(GoalEntryData!$C$6=\"<=\",IF($B226<=GoalEntryData!$D$6,1,0),IF(GoalEntryData!$C$6=\">=\",IF($B226>=GoalEntryData!$D$6,1,0),\"\")))","v":""},"",{"$f":"IF($B226=\"\",\"\",IF(GoalEntryData!$C$7=\"<=\",IF($B226<=GoalEntryData!$D$7,1,0),IF(GoalEntryData!$C$7=\">=\",IF($B226>=GoalEntryData!$D$7,1,0),\"\")))","v":""},"",{"$f":"IF($B226=\"\",\"\",IF(GoalEntryData!$C$8=\"<=\",IF($B226<=GoalEntryData!$D$8,1,0),IF(GoalEntryData!$C$8=\">=\",IF($B226>=GoalEntryData!$D$8,1,0),\"\")))","v":""},"",{"$f":"IF($B226=\"\",\"\",IF(GoalEntryData!$C$6=\"<=\",IF($B226<=GoalEntryData!$D$6,1,0),IF(GoalEntryData!$C$6=\">=\",IF($B226>=GoalEntryData!$D$6,1,0),\"\")))","v":""},"",null,null,null,{"$f":"IF($M226=\"\",\"\",IF(GoalEntryData!$C$10=\"<=\",IF($M226<=GoalEntryData!$D$10,1,0),IF(GoalEntryData!$C$10=\">=\",IF($M226>=GoalEntryData!$D$10,1,0),\"\")))","v":""},"",{"$f":"IF($M226=\"\",\"\",IF(GoalEntryData!$C$11=\"<=\",IF($M226<=GoalEntryData!$D$11,1,0),IF(GoalEntryData!$C$11=\">=\",IF($M226>=GoalEntryData!$D$11,1,0),\"\")))","v":""},"",{"$f":"IF($M226=\"\",\"\",IF(GoalEntryData!$C$12=\"<=\",IF($M226<=GoalEntryData!$D$12,1,0),IF(GoalEntryData!$C$10=\">=\",IF($M226>=GoalEntryData!$D$12,1,0),\"\")))","v":""},"",{"$f":"IF($M226=\"\",\"\",IF(GoalEntryData!$C$10=\"<=\",IF($M226<=GoalEntryData!$D$10,1,0),IF(GoalEntryData!$C$10=\">=\",IF($M226>=GoalEntryData!$D$10,1,0),\"\")))","v":""},""]
[null,null,null,{"$f":"IF($B227=\"\",\"\",IF(GoalEntryData!$C$6=\"<=\",IF($B227<=GoalEntryData!$D$6,1,0),IF(GoalEntryData!$C$6=\">=\",IF($B227>=GoalEntryData!$D$6,1,0),\"\")))","v":""},"",{"$f":"IF($B227=\"\",\"\",IF(GoalEntryData!$C$7=\"<=\",IF($B227<=GoalEntryData!$D$7,1,0),IF(GoalEntryData!$C$7=\">=\",IF($B227>=GoalEntryData!$D$7,1,0),\"\")))","v":""},"",{"$f":"IF($B227=\"\",\"\",IF(GoalEntryData!$C$8=\"<=\",IF($B227<=GoalEntryData!$D$8,1,0),IF(GoalEntryData!$C$8=\">=\",IF($B227>=GoalEntryData!$D$8,1,0),\"\")))","v":""},"",{"$f":"IF($B227=\"\",\"\",IF(GoalEntryData!$C$6=\"<=\",IF($B227<=GoalEntryData!$D$6,1,0),IF(GoalEntryData!$C$6=\">=\",IF($B227>=GoalEntryData!$D$6,1,0),\"\")))","v":""},"",null,null,null,{"$f":"IF($M227=\"\",\"\",IF(GoalEntryData!$C$10=\"<=\",IF($M227<=GoalEntryData!$D$10,1,0),IF(GoalEntryData!$C$10=\">=\",IF($M227>=GoalEntryData!$D$10,1,0),\"\")))","v":""},"",{"$f":"IF($M227=\"\",\"\",IF(GoalEntryData!$C$11=\"<=\",IF($M227<=GoalEntryData!$D$11,1,0),IF(GoalEntryData!$C$11=\">=\",IF($M227>=GoalEntryData!$D$11,1,0),\"\")))","v":""},"",{"$f":"IF($M227=\"\",\"\",IF(GoalEntryData!$C$12=\"<=\",IF($M227<=GoalEntryData!$D$12,1,0),IF(GoalEntryData!$C$10=\">=\",IF($M227>=GoalEntryData!$D$12,1,0),\"\")))","v":""},"",{"$f":"IF($M227=\"\",\"\",IF(GoalEntryData!$C$10=\"<=\",IF($M227<=GoalEntryData!$D$10,1,0),IF(GoalEntryData!$C$10=\">=\",IF($M227>=GoalEntryData!$D$10,1,0),\"\")))","v":""},""]
[null,null,null,{"$f":"IF($B228=\"\",\"\",IF(GoalEntryData!$C$6=\"<=\",IF($B228<=GoalEntryData!$D$6,1,0),IF(GoalEntryData!$C$6=\">=\",IF($B228>=GoalEntryData!$D$6,1,0),\"\")))","v":""},"",{"$f":"IF($B228=\"\",\"\",IF(GoalEntryData!$C$7=\"<=\",IF($B228<=GoalEntryData!$D$7,1,0),IF(GoalEntryData!$C$7=\">=\",IF($B228>=GoalEntryData!$D$7,1,0),\"\")))","v":""},"",{"$f":"IF($B228=\"\",\"\",IF(GoalEntryData!$C$8=\"<=\",IF($B228<=GoalEntryData!$D$8,1,0),IF(GoalEntryData!$C$8=\">=\",IF($B228>=GoalEntryData!$D$8,1,0),\"\")))","v":""},"",{"$f":"IF($B228=\"\",\"\",IF(GoalEntryData!$C$6=\"<=\",IF($B228<=GoalEntryData!$D$6,1,0),IF(GoalEntryData!$C$6=\">=\",IF($B228>=GoalEntryData!$D$6,1,0),\"\")))","v":""},"",null,null,null,{"$f":"IF($M228=\"\",\"\",IF(GoalEntryData!$C$10=\"<=\",IF($M228<=GoalEntryData!$D$10,1,0),IF(GoalEntryData!$C$10=\">=\",IF($M228>=GoalEntryData!$D$10,1,0),\"\")))","v":""},"",{"$f":"IF($M228=\"\",\"\",IF(GoalEntryData!$C$11=\"<=\",IF($M228<=GoalEntryData!$D$11,1,0),IF(GoalEntryData!$C$11=\">=\",IF($M228>=GoalEntryData!$D$11,1,0),\"\")))","v":""},"",{"$f":"IF($M228=\"\",\"\",IF(GoalEntryData!$C$12=\"<=\",IF($M228<=GoalEntryData!$D$12,1,0),IF(GoalEntryData!$C$10=\">=\",IF($M228>=GoalEntryData!$D$12,1,0),\"\")))","v":""},"",{"$f":"IF($M228=\"\",\"\",IF(GoalEntryData!$C$10=\"<=\",IF($M228<=GoalEntryData!$D$10,1,0),IF(GoalEntryData!$C$10=\">=\",IF($M228>=GoalEntryData!$D$10,1,0),\"\")))","v":""},""]
[null,null,null,{"$f":"IF($B229=\"\",\"\",IF(GoalEntryData!$C$6=\"<=\",IF($B229<=GoalEntryData!$D$6,1,0),IF(GoalEntryData!$C$6=\">=\",IF($B229>=GoalEntryData!$D$6,1,0),\"\")))","v":""},"",{"$f":"IF($B229=\"\",\"\",IF(GoalEntryData!$C$7=\"<=\",IF($B229<=GoalEntryData!$D$7,1,0),IF(GoalEntryData!$C$7=\">=\",IF($B229>=GoalEntryData!$D$7,1,0),\"\")))","v":""},"",{"$f":"IF($B229=\"\",\"\",IF(GoalEntryData!$C$8=\"<=\",IF($B229<=GoalEntryData!$D$8,1,0),IF(GoalEntryData!$C$8=\">=\",IF($B229>=GoalEntryData!$D$8,1,0),\"\")))","v":""},"",{"$f":"IF($B229=\"\",\"\",IF(GoalEntryData!$C$6=\"<=\",IF($B229<=GoalEntryData!$D$6,1,0),IF(GoalEntryData!$C$6=\">=\",IF($B229>=GoalEntryData!$D$6,1,0),\"\")))","v":""},"",null,null,null,{"$f":"IF($M229=\"\",\"\",IF(GoalEntryData!$C$10=\"<=\",IF($M229<=GoalEntryData!$D$10,1,0),IF(GoalEntryData!$C$10=\">=\",IF($M229>=GoalEntryData!$D$10,1,0),\"\")))","v":""},"",{"$f":"IF($M229=\"\",\"\",IF(GoalEntryData!$C$11=\"<=\",IF($M229<=GoalEntryData!$D$11,1,0),IF(GoalEntryData!$C$11=\">=\",IF($M229>=GoalEntryData!$D$11,1,0),\"\")))","v":""},"",{"$f":"IF($M229=\"\",\"\",IF(GoalEntryData!$C$12=\"<=\",IF($M229<=GoalEntryData!$D$12,1,0),IF(GoalEntryData!$C$10=\">=\",IF($M229>=GoalEntryData!$D$12,1,0),\"\")))","v":""},"",{"$f":"IF($M229=\"\",\"\",IF(GoalEntryData!$C$10=\"<=\",IF($M229<=GoalEntryData!$D$10,1,0),IF(GoalEntryData!$C$10=\">=\",IF($M229>=GoalEntryData!$D$10,1,0),\"\")))","v":""},""]
[null,null,null,{"$f":"IF($B230=\"\",\"\",IF(GoalEntryData!$C$6=\"<=\",IF($B230<=GoalEntryData!$D$6,1,0),IF(GoalEntryData!$C$6=\">=\",IF($B230>=GoalEntryData!$D$6,1,0),\"\")))","v":""},"",{"$f":"IF($B230=\"\",\"\",IF(GoalEntryData!$C$7=\"<=\",IF($B230<=GoalEntryData!$D$7,1,0),IF(GoalEntryData!$C$7=\">=\",IF($B230>=GoalEntryData!$D$7,1,0),\"\")))","v":""},"",{"$f":"IF($B230=\"\",\"\",IF(GoalEntryData!$C$8=\"<=\",IF($B230<=GoalEntryData!$D$8,1,0),IF(GoalEntryData!$C$8=\">=\",IF($B230>=GoalEntryData!$D$8,1,0),\"\")))","v":""},"",{"$f":"IF($B230=\"\",\"\",IF(GoalEntryData!$C$6=\"<=\",IF($B230<=GoalEntryData!$D$6,1,0),IF(GoalEntryData!$C$6=\">=\",IF($B230>=GoalEntryData!$D$6,1,0),\"\")))","v":""},"",null,null,null,{"$f":"IF($M230=\"\",\"\",IF(GoalEntryData!$C$10=\"<=\",IF($M230<=GoalEntryData!$D$10,1,0),IF(GoalEntryData!$C$10=\">=\",IF($M230>=GoalEntryData!$D$10,1,0),\"\")))","v":""},"",{"$f":"IF($M230=\"\",\"\",IF(GoalEntryData!$C$11=\"<=\",IF($M230<=GoalEntryData!$D$11,1,0),IF(GoalEntryData!$C$11=\">=\",IF($M230>=GoalEntryData!$D$11,1,0),\"\")))","v":""},"",{"$f":"IF($M230=\"\",\"\",IF(GoalEntryData!$C$12=\"<=\",IF($M230<=GoalEntryData!$D$12,1,0),IF(GoalEntryData!$C$10=\">=\",IF($M230>=GoalEntryData!$D$12,1,0),\"\")))","v":""},"",{"$f":"IF($M230=\"\",\"\",IF(GoalEntryData!$C$10=\"<=\",IF($M230<=GoalEntryData!$D$10,1,0),IF(GoalEntryData!$C$10=\">=\",IF($M230>=GoalEntryData!$D$10,1,0),\"\")))","v":""},""]
[null,null,null,{"$f":"IF($B231=\"\",\"\",IF(GoalEntryData!$C$6=\"<=\",IF($B231<=GoalEntryData!$D$6,1,0),IF(GoalEntryData!$C$6=\">=\",IF($B231>=GoalEntryData!$D$6,1,0),\"\")))","v":""},"",{"$f":"IF($B231=\"\",\"\",IF(GoalEntryData!$C$7=\"<=\",IF($B231<=GoalEntryData!$D$7,1,0),IF(GoalEntryData!$C$7=\">=\",IF($B231>=GoalEntryData!$D$7,1,0),\"\")))","v":""},"",{"$f":"IF($B231=\"\",\"\",IF(GoalEntryData!$C$8=\"<=\",IF($B231<=GoalEntryData!$D$8,1,0),IF(GoalEntryData!$C$8=\">=\",IF($B231>=GoalEntryData!$D$8,1,0),\"\")))","v":""},"",{"$f":"IF($B231=\"\",\"\",IF(GoalEntryData!$C$6=\"<=\",IF($B231<=GoalEntryData!$D$6,1,0),IF(GoalEntryData!$C$6=\">=\",IF($B231>=GoalEntryData!$D$6,1,0),\"\")))","v":""},"",null,null,null,{"$f":"IF($M231=\"\",\"\",IF(GoalEntryData!$C$10=\"<=\",IF($M231<=GoalEntryData!$D$10,1,0),IF(GoalEntryData!$C$10=\">=\",IF($M231>=GoalEntryData!$D$10,1,0),\"\")))","v":""},"",{"$f":"IF($M231=\"\",\"\",IF(GoalEntryData!$C$11=\"<=\",IF($M231<=GoalEntryData!$D$11,1,0),IF(GoalEntryData!$C$11=\">=\",IF($M231>=GoalEntryData!$D$11,1,0),\"\")))","v":""},"",{"$f":"IF($M231=\"\",\"\",IF(GoalEntryData!$C$12=\"<=\",IF($M231<=GoalEntryData!$D$12,1,0),IF(GoalEntryData!$C$10=\">=\",IF($M231>=GoalEntryData!$D$12,1,0),\"\")))","v":""},"",{"$f":"IF($M231=\"\",\"\",IF(GoalEntryData!$C$10=\"<=\",IF($M231<=GoalEntryData!$D$10,1,0),IF(GoalEntryData!$C$10=\">=\",IF($M231>=GoalEntryData!$D$10,1,0),\"\")))","v":""},""]
[null,null,null,{"$f":"IF($B232=\"\",\"\",IF(GoalEntryData!$C$6=\"<=\",IF($B232<=GoalEntryData!$D$6,1,0),IF(GoalEntryData!$C$6=\">=\",IF($B232>=GoalEntryData!$D$6,1,0),\"\")))","v":""},"",{"$f":"IF($B232=\"\",\"\",IF(GoalEntryData!$C$7=\"<=\",IF($B232<=GoalEntryData!$D$7,1,0),IF(GoalEntryData!$C$7=\">=\",IF($B232>=GoalEntryData!$D$7,1,0),\"\")))","v":""},"",{"$f":"IF($B232=\"\",\"\",IF(GoalEntryData!$C$8=\"<=\",IF($B232<=GoalEntryData!$D$8,1,0),IF(GoalEntryData!$C$8=\">=\",IF($B232>=GoalEntryData!$D$8,1,0),\"\")))","v":""},"",{"$f":"IF($B232=\"\",\"\",IF(GoalEntryData!$C$6=\"<=\",IF($B232<=GoalEntryData!$D$6,1,0),IF(GoalEntryData!$C$6=\">=\",IF($B232>=GoalEntryData!$D$6,1,0),\"\")))","v":""},"",null,null,null,{"$f":"IF($M232=\"\",\"\",IF(GoalEntryData!$C$10=\"<=\",IF($M232<=GoalEntryData!$D$10,1,0),IF(GoalEntryData!$C$10=\">=\",IF($M232>=GoalEntryData!$D$10,1,0),\"\")))","v":""},"",{"$f":"IF($M232=\"\",\"\",IF(GoalEntryData!$C$11=\"<=\",IF($M232<=GoalEntryData!$D$11,1,0),IF(GoalEntryData!$C$11=\">=\",IF($M232>=GoalEntryData!$D$11,1,0),\"\")))","v":""},"",{"$f":"IF($M232=\"\",\"\",IF(GoalEntryData!$C$12=\"<=\",IF($M232<=GoalEntryData!$D$12,1,0),IF(GoalEntryData!$C$10=\">=\",IF($M232>=GoalEntryData!$D$12,1,0),\"\")))","v":""},"",{"$f":"IF($M232=\"\",\"\",IF(GoalEntryData!$C$10=\"<=\",IF($M232<=GoalEntryData!$D$10,1,0),IF(GoalEntryData!$C$10=\">=\",IF($M232>=GoalEntryData!$D$10,1,0),\"\")))","v":""},""]
[null,null,null,{"$f":"IF($B233=\"\",\"\",IF(GoalEntryData!$C$6=\"<=\",IF($B233<=GoalEntryData!$D$6,1,0),IF(GoalEntryData!$C$6=\">=\",IF($B233>=GoalEntryData!$D$6,1,0),\"\")))","v":""},"",{"$f":"IF($B233=\"\",\"\",IF(GoalEntryData!$C$7=\"<=\",IF($B233<=GoalEntryData!$D$7,1,0),IF(GoalEntryData!$C$7=\">=\",IF($B233>=GoalEntryData!$D$7,1,0),\"\")))","v":""},"",{"$f":"IF($B233=\"\",\"\",IF(GoalEntryData!$C$8=\"<=\",IF($B233<=GoalEntryData!$D$8,1,0),IF(GoalEntryData!$C$8=\">=\",IF($B233>=GoalEntryData!$D$8,1,0),\"\")))","v":""},"",{"$f":"IF($B233=\"\",\"\",IF(GoalEntryData!$C$6=\"<=\",IF($B233<=GoalEntryData!$D$6,1,0),IF(GoalEntryData!$C$6=\">=\",IF($B233>=GoalEntryData!$D$6,1,0),\"\")))","v":""},"",null,null,null,{"$f":"IF($M233=\"\",\"\",IF(GoalEntryData!$C$10=\"<=\",IF($M233<=GoalEntryData!$D$10,1,0),IF(GoalEntryData!$C$10=\">=\",IF($M233>=GoalEntryData!$D$10,1,0),\"\")))","v":""},"",{"$f":"IF($M233=\"\",\"\",IF(GoalEntryData!$C$11=\"<=\",IF($M233<=GoalEntryData!$D$11,1,0),IF(GoalEntryData!$C$11=\">=\",IF($M233>=GoalEntryData!$D$11,1,0),\"\")))","v":""},"",{"$f":"IF($M233=\"\",\"\",IF(GoalEntryData!$C$12=\"<=\",IF($M233<=GoalEntryData!$D$12,1,0),IF(GoalEntryData!$C$10=\">=\",IF($M233>=GoalEntryData!$D$12,1,0),\"\")))","v":""},"",{"$f":"IF($M233=\"\",\"\",IF(GoalEntryData!$C$10=\"<=\",IF($M233<=GoalEntryData!$D$10,1,0),IF(GoalEntryData!$C$10=\">=\",IF($M233>=GoalEntryData!$D$10,1,0),\"\")))","v":""},""]
[null,null,null,{"$f":"IF($B234=\"\",\"\",IF(GoalEntryData!$C$6=\"<=\",IF($B234<=GoalEntryData!$D$6,1,0),IF(GoalEntryData!$C$6=\">=\",IF($B234>=GoalEntryData!$D$6,1,0),\"\")))","v":""},"",{"$f":"IF($B234=\"\",\"\",IF(GoalEntryData!$C$7=\"<=\",IF($B234<=GoalEntryData!$D$7,1,0),IF(GoalEntryData!$C$7=\">=\",IF($B234>=GoalEntryData!$D$7,1,0),\"\")))","v":""},"",{"$f":"IF($B234=\"\",\"\",IF(GoalEntryData!$C$8=\"<=\",IF($B234<=GoalEntryData!$D$8,1,0),IF(GoalEntryData!$C$8=\">=\",IF($B234>=GoalEntryData!$D$8,1,0),\"\")))","v":""},"",{"$f":"IF($B234=\"\",\"\",IF(GoalEntryData!$C$6=\"<=\",IF($B234<=GoalEntryData!$D$6,1,0),IF(GoalEntryData!$C$6=\">=\",IF($B234>=GoalEntryData!$D$6,1,0),\"\")))","v":""},"",null,null,null,{"$f":"IF($M234=\"\",\"\",IF(GoalEntryData!$C$10=\"<=\",IF($M234<=GoalEntryData!$D$10,1,0),IF(GoalEntryData!$C$10=\">=\",IF($M234>=GoalEntryData!$D$10,1,0),\"\")))","v":""},"",{"$f":"IF($M234=\"\",\"\",IF(GoalEntryData!$C$11=\"<=\",IF($M234<=GoalEntryData!$D$11,1,0),IF(GoalEntryData!$C$11=\">=\",IF($M234>=GoalEntryData!$D$11,1,0),\"\")))","v":""},"",{"$f":"IF($M234=\"\",\"\",IF(GoalEntryData!$C$12=\"<=\",IF($M234<=GoalEntryData!$D$12,1,0),IF(GoalEntryData!$C$10=\">=\",IF($M234>=GoalEntryData!$D$12,1,0),\"\")))","v":""},"",{"$f":"IF($M234=\"\",\"\",IF(GoalEntryData!$C$10=\"<=\",IF($M234<=GoalEntryData!$D$10,1,0),IF(GoalEntryData!$C$10=\">=\",IF($M234>=GoalEntryData!$D$10,1,0),\"\")))","v":""},""]
[null,null,null,{"$f":"IF($B235=\"\",\"\",IF(GoalEntryData!$C$6=\"<=\",IF($B235<=GoalEntryData!$D$6,1,0),IF(GoalEntryData!$C$6=\">=\",IF($B235>=GoalEntryData!$D$6,1,0),\"\")))","v":""},"",{"$f":"IF($B235=\"\",\"\",IF(GoalEntryData!$C$7=\"<=\",IF($B235<=GoalEntryData!$D$7,1,0),IF(GoalEntryData!$C$7=\">=\",IF($B235>=GoalEntryData!$D$7,1,0),\"\")))","v":""},"",{"$f":"IF($B235=\"\",\"\",IF(GoalEntryData!$C$8=\"<=\",IF($B235<=GoalEntryData!$D$8,1,0),IF(GoalEntryData!$C$8=\">=\",IF($B235>=GoalEntryData!$D$8,1,0),\"\")))","v":""},"",{"$f":"IF($B235=\"\",\"\",IF(GoalEntryData!$C$6=\"<=\",IF($B235<=GoalEntryData!$D$6,1,0),IF(GoalEntryData!$C$6=\">=\",IF($B235>=GoalEntryData!$D$6,1,0),\"\")))","v":""},"",null,null,null,{"$f":"IF($M235=\"\",\"\",IF(GoalEntryData!$C$10=\"<=\",IF($M235<=GoalEntryData!$D$10,1,0),IF(GoalEntryData!$C$10=\">=\",IF($M235>=GoalEntryData!$D$10,1,0),\"\")))","v":""},"",{"$f":"IF($M235=\"\",\"\",IF(GoalEntryData!$C$11=\"<=\",IF($M235<=GoalEntryData!$D$11,1,0),IF(GoalEntryData!$C$11=\">=\",IF($M235>=GoalEntryData!$D$11,1,0),\"\")))","v":""},"",{"$f":"IF($M235=\"\",\"\",IF(GoalEntryData!$C$12=\"<=\",IF($M235<=GoalEntryData!$D$12,1,0),IF(GoalEntryData!$C$10=\">=\",IF($M235>=GoalEntryData!$D$12,1,0),\"\")))","v":""},"",{"$f":"IF($M235=\"\",\"\",IF(GoalEntryData!$C$10=\"<=\",IF($M235<=GoalEntryData!$D$10,1,0),IF(GoalEntryData!$C$10=\">=\",IF($M235>=GoalEntryData!$D$10,1,0),\"\")))","v":""},""]
[null,null,null,{"$f":"IF($B236=\"\",\"\",IF(GoalEntryData!$C$6=\"<=\",IF($B236<=GoalEntryData!$D$6,1,0),IF(GoalEntryData!$C$6=\">=\",IF($B236>=GoalEntryData!$D$6,1,0),\"\")))","v":""},"",{"$f":"IF($B236=\"\",\"\",IF(GoalEntryData!$C$7=\"<=\",IF($B236<=GoalEntryData!$D$7,1,0),IF(GoalEntryData!$C$7=\">=\",IF($B236>=GoalEntryData!$D$7,1,0),\"\")))","v":""},"",{"$f":"IF($B236=\"\",\"\",IF(GoalEntryData!$C$8=\"<=\",IF($B236<=GoalEntryData!$D$8,1,0),IF(GoalEntryData!$C$8=\">=\",IF($B236>=GoalEntryData!$D$8,1,0),\"\")))","v":""},"",{"$f":"IF($B236=\"\",\"\",IF(GoalEntryData!$C$6=\"<=\",IF($B236<=GoalEntryData!$D$6,1,0),IF(GoalEntryData!$C$6=\">=\",IF($B236>=GoalEntryData!$D$6,1,0),\"\")))","v":""},"",null,null,null,{"$f":"IF($M236=\"\",\"\",IF(GoalEntryData!$C$10=\"<=\",IF($M236<=GoalEntryData!$D$10,1,0),IF(GoalEntryData!$C$10=\">=\",IF($M236>=GoalEntryData!$D$10,1,0),\"\")))","v":""},"",{"$f":"IF($M236=\"\",\"\",IF(GoalEntryData!$C$11=\"<=\",IF($M236<=GoalEntryData!$D$11,1,0),IF(GoalEntryData!$C$11=\">=\",IF($M236>=GoalEntryData!$D$11,1,0),\"\")))","v":""},"",{"$f":"IF($M236=\"\",\"\",IF(GoalEntryData!$C$12=\"<=\",IF($M236<=GoalEntryData!$D$12,1,0),IF(GoalEntryData!$C$10=\">=\",IF($M236>=GoalEntryData!$D$12,1,0),\"\")))","v":""},"",{"$f":"IF($M236=\"\",\"\",IF(GoalEntryData!$C$10=\"<=\",IF($M236<=GoalEntryData!$D$10,1,0),IF(GoalEntryData!$C$10=\">=\",IF($M236>=GoalEntryData!$D$10,1,0),\"\")))","v":""},""]
[null,null,null,{"$f":"IF($B237=\"\",\"\",IF(GoalEntryData!$C$6=\"<=\",IF($B237<=GoalEntryData!$D$6,1,0),IF(GoalEntryData!$C$6=\">=\",IF($B237>=GoalEntryData!$D$6,1,0),\"\")))","v":""},"",{"$f":"IF($B237=\"\",\"\",IF(GoalEntryData!$C$7=\"<=\",IF($B237<=GoalEntryData!$D$7,1,0),IF(GoalEntryData!$C$7=\">=\",IF($B237>=GoalEntryData!$D$7,1,0),\"\")))","v":""},"",{"$f":"IF($B237=\"\",\"\",IF(GoalEntryData!$C$8=\"<=\",IF($B237<=GoalEntryData!$D$8,1,0),IF(GoalEntryData!$C$8=\">=\",IF($B237>=GoalEntryData!$D$8,1,0),\"\")))","v":""},"",{"$f":"IF($B237=\"\",\"\",IF(GoalEntryData!$C$6=\"<=\",IF($B237<=GoalEntryData!$D$6,1,0),IF(GoalEntryData!$C$6=\">=\",IF($B237>=GoalEntryData!$D$6,1,0),\"\")))","v":""},"",null,null,null,{"$f":"IF($M237=\"\",\"\",IF(GoalEntryData!$C$10=\"<=\",IF($M237<=GoalEntryData!$D$10,1,0),IF(GoalEntryData!$C$10=\">=\",IF($M237>=GoalEntryData!$D$10,1,0),\"\")))","v":""},"",{"$f":"IF($M237=\"\",\"\",IF(GoalEntryData!$C$11=\"<=\",IF($M237<=GoalEntryData!$D$11,1,0),IF(GoalEntryData!$C$11=\">=\",IF($M237>=GoalEntryData!$D$11,1,0),\"\")))","v":""},"",{"$f":"IF($M237=\"\",\"\",IF(GoalEntryData!$C$12=\"<=\",IF($M237<=GoalEntryData!$D$12,1,0),IF(GoalEntryData!$C$10=\">=\",IF($M237>=GoalEntryData!$D$12,1,0),\"\")))","v":""},"",{"$f":"IF($M237=\"\",\"\",IF(GoalEntryData!$C$10=\"<=\",IF($M237<=GoalEntryData!$D$10,1,0),IF(GoalEntryData!$C$10=\">=\",IF($M237>=GoalEntryData!$D$10,1,0),\"\")))","v":""},""]
[null,null,null,{"$f":"IF($B238=\"\",\"\",IF(GoalEntryData!$C$6=\"<=\",IF($B238<=GoalEntryData!$D$6,1,0),IF(GoalEntryData!$C$6=\">=\",IF($B238>=GoalEntryData!$D$6,1,0),\"\")))","v":""},"",{"$f":"IF($B238=\"\",\"\",IF(GoalEntryData!$C$7=\"<=\",IF($B238<=GoalEntryData!$D$7,1,0),IF(GoalEntryData!$C$7=\">=\",IF($B238>=GoalEntryData!$D$7,1,0),\"\")))","v":""},"",{"$f":"IF($B238=\"\",\"\",IF(GoalEntryData!$C$8=\"<=\",IF($B238<=GoalEntryData!$D$8,1,0),IF(GoalEntryData!$C$8=\">=\",IF($B238>=GoalEntryData!$D$8,1,0),\"\")))","v":""},"",{"$f":"IF($B238=\"\",\"\",IF(GoalEntryData!$C$6=\"<=\",IF($B238<=GoalEntryData!$D$6,1,0),IF(GoalEntryData!$C$6=\">=\",IF($B238>=GoalEntryData!$D$6,1,0),\"\")))","v":""},"",null,null,null,{"$f":"IF($M238=\"\",\"\",IF(GoalEntryData!$C$10=\"<=\",IF($M238<=GoalEntryData!$D$10,1,0),IF(GoalEntryData!$C$10=\">=\",IF($M238>=GoalEntryData!$D$10,1,0),\"\")))","v":""},"",{"$f":"IF($M238=\"\",\"\",IF(GoalEntryData!$C$11=\"<=\",IF($M238<=GoalEntryData!$D$11,1,0),IF(GoalEntryData!$C$11=\">=\",IF($M238>=GoalEntryData!$D$11,1,0),\"\")))","v":""},"",{"$f":"IF($M238=\"\",\"\",IF(GoalEntryData!$C$12=\"<=\",IF($M238<=GoalEntryData!$D$12,1,0),IF(GoalEntryData!$C$10=\">=\",IF($M238>=GoalEntryData!$D$12,1,0),\"\")))","v":""},"",{"$f":"IF($M238=\"\",\"\",IF(GoalEntryData!$C$10=\"<=\",IF($M238<=GoalEntryData!$D$10,1,0),IF(GoalEntryData!$C$10=\">=\",IF($M238>=GoalEntryData!$D$10,1,0),\"\")))","v":""},""]
[null,null,null,{"$f":"IF($B239=\"\",\"\",IF(GoalEntryData!$C$6=\"<=\",IF($B239<=GoalEntryData!$D$6,1,0),IF(GoalEntryData!$C$6=\">=\",IF($B239>=GoalEntryData!$D$6,1,0),\"\")))","v":""},"",{"$f":"IF($B239=\"\",\"\",IF(GoalEntryData!$C$7=\"<=\",IF($B239<=GoalEntryData!$D$7,1,0),IF(GoalEntryData!$C$7=\">=\",IF($B239>=GoalEntryData!$D$7,1,0),\"\")))","v":""},"",{"$f":"IF($B239=\"\",\"\",IF(GoalEntryData!$C$8=\"<=\",IF($B239<=GoalEntryData!$D$8,1,0),IF(GoalEntryData!$C$8=\">=\",IF($B239>=GoalEntryData!$D$8,1,0),\"\")))","v":""},"",{"$f":"IF($B239=\"\",\"\",IF(GoalEntryData!$C$6=\"<=\",IF($B239<=GoalEntryData!$D$6,1,0),IF(GoalEntryData!$C$6=\">=\",IF($B239>=GoalEntryData!$D$6,1,0),\"\")))","v":""},"",null,null,null,{"$f":"IF($M239=\"\",\"\",IF(GoalEntryData!$C$10=\"<=\",IF($M239<=GoalEntryData!$D$10,1,0),IF(GoalEntryData!$C$10=\">=\",IF($M239>=GoalEntryData!$D$10,1,0),\"\")))","v":""},"",{"$f":"IF($M239=\"\",\"\",IF(GoalEntryData!$C$11=\"<=\",IF($M239<=GoalEntryData!$D$11,1,0),IF(GoalEntryData!$C$11=\">=\",IF($M239>=GoalEntryData!$D$11,1,0),\"\")))","v":""},"",{"$f":"IF($M239=\"\",\"\",IF(GoalEntryData!$C$12=\"<=\",IF($M239<=GoalEntryData!$D$12,1,0),IF(GoalEntryData!$C$10=\">=\",IF($M239>=GoalEntryData!$D$12,1,0),\"\")))","v":""},"",{"$f":"IF($M239=\"\",\"\",IF(GoalEntryData!$C$10=\"<=\",IF($M239<=GoalEntryData!$D$10,1,0),IF(GoalEntryData!$C$10=\">=\",IF($M239>=GoalEntryData!$D$10,1,0),\"\")))","v":""},""]
[null,null,null,{"$f":"IF($B240=\"\",\"\",IF(GoalEntryData!$C$6=\"<=\",IF($B240<=GoalEntryData!$D$6,1,0),IF(GoalEntryData!$C$6=\">=\",IF($B240>=GoalEntryData!$D$6,1,0),\"\")))","v":""},"",{"$f":"IF($B240=\"\",\"\",IF(GoalEntryData!$C$7=\"<=\",IF($B240<=GoalEntryData!$D$7,1,0),IF(GoalEntryData!$C$7=\">=\",IF($B240>=GoalEntryData!$D$7,1,0),\"\")))","v":""},"",{"$f":"IF($B240=\"\",\"\",IF(GoalEntryData!$C$8=\"<=\",IF($B240<=GoalEntryData!$D$8,1,0),IF(GoalEntryData!$C$8=\">=\",IF($B240>=GoalEntryData!$D$8,1,0),\"\")))","v":""},"",{"$f":"IF($B240=\"\",\"\",IF(GoalEntryData!$C$6=\"<=\",IF($B240<=GoalEntryData!$D$6,1,0),IF(GoalEntryData!$C$6=\">=\",IF($B240>=GoalEntryData!$D$6,1,0),\"\")))","v":""},"",null,null,null,{"$f":"IF($M240=\"\",\"\",IF(GoalEntryData!$C$10=\"<=\",IF($M240<=GoalEntryData!$D$10,1,0),IF(GoalEntryData!$C$10=\">=\",IF($M240>=GoalEntryData!$D$10,1,0),\"\")))","v":""},"",{"$f":"IF($M240=\"\",\"\",IF(GoalEntryData!$C$11=\"<=\",IF($M240<=GoalEntryData!$D$11,1,0),IF(GoalEntryData!$C$11=\">=\",IF($M240>=GoalEntryData!$D$11,1,0),\"\")))","v":""},"",{"$f":"IF($M240=\"\",\"\",IF(GoalEntryData!$C$12=\"<=\",IF($M240<=GoalEntryData!$D$12,1,0),IF(GoalEntryData!$C$10=\">=\",IF($M240>=GoalEntryData!$D$12,1,0),\"\")))","v":""},"",{"$f":"IF($M240=\"\",\"\",IF(GoalEntryData!$C$10=\"<=\",IF($M240<=GoalEntryData!$D$10,1,0),IF(GoalEntryData!$C$10=\">=\",IF($M240>=GoalEntryData!$D$10,1,0),\"\")))","v":""},""]
[null,null,null,{"$f":"IF($B241=\"\",\"\",IF(GoalEntryData!$C$6=\"<=\",IF($B241<=GoalEntryData!$D$6,1,0),IF(GoalEntryData!$C$6=\">=\",IF($B241>=GoalEntryData!$D$6,1,0),\"\")))","v":""},"",{"$f":"IF($B241=\"\",\"\",IF(GoalEntryData!$C$7=\"<=\",IF($B241<=GoalEntryData!$D$7,1,0),IF(GoalEntryData!$C$7=\">=\",IF($B241>=GoalEntryData!$D$7,1,0),\"\")))","v":""},"",{"$f":"IF($B241=\"\",\"\",IF(GoalEntryData!$C$8=\"<=\",IF($B241<=GoalEntryData!$D$8,1,0),IF(GoalEntryData!$C$8=\">=\",IF($B241>=GoalEntryData!$D$8,1,0),\"\")))","v":""},"",{"$f":"IF($B241=\"\",\"\",IF(GoalEntryData!$C$6=\"<=\",IF($B241<=GoalEntryData!$D$6,1,0),IF(GoalEntryData!$C$6=\">=\",IF($B241>=GoalEntryData!$D$6,1,0),\"\")))","v":""},"",null,null,null,{"$f":"IF($M241=\"\",\"\",IF(GoalEntryData!$C$10=\"<=\",IF($M241<=GoalEntryData!$D$10,1,0),IF(GoalEntryData!$C$10=\">=\",IF($M241>=GoalEntryData!$D$10,1,0),\"\")))","v":""},"",{"$f":"IF($M241=\"\",\"\",IF(GoalEntryData!$C$11=\"<=\",IF($M241<=GoalEntryData!$D$11,1,0),IF(GoalEntryData!$C$11=\">=\",IF($M241>=GoalEntryData!$D$11,1,0),\"\")))","v":""},"",{"$f":"IF($M241=\"\",\"\",IF(GoalEntryData!$C$12=\"<=\",IF($M241<=GoalEntryData!$D$12,1,0),IF(GoalEntryData!$C$10=\">=\",IF($M241>=GoalEntryData!$D$12,1,0),\"\")))","v":""},"",{"$f":"IF($M241=\"\",\"\",IF(GoalEntryData!$C$10=\"<=\",IF($M241<=GoalEntryData!$D$10,1,0),IF(GoalEntryData!$C$10=\">=\",IF($M241>=GoalEntryData!$D$10,1,0),\"\")))","v":""},""]
[null,null,null,{"$f":"IF($B242=\"\",\"\",IF(GoalEntryData!$C$6=\"<=\",IF($B242<=GoalEntryData!$D$6,1,0),IF(GoalEntryData!$C$6=\">=\",IF($B242>=GoalEntryData!$D$6,1,0),\"\")))","v":""},"",{"$f":"IF($B242=\"\",\"\",IF(GoalEntryData!$C$7=\"<=\",IF($B242<=GoalEntryData!$D$7,1,0),IF(GoalEntryData!$C$7=\">=\",IF($B242>=GoalEntryData!$D$7,1,0),\"\")))","v":""},"",{"$f":"IF($B242=\"\",\"\",IF(GoalEntryData!$C$8=\"<=\",IF($B242<=GoalEntryData!$D$8,1,0),IF(GoalEntryData!$C$8=\">=\",IF($B242>=GoalEntryData!$D$8,1,0),\"\")))","v":""},"",{"$f":"IF($B242=\"\",\"\",IF(GoalEntryData!$C$6=\"<=\",IF($B242<=GoalEntryData!$D$6,1,0),IF(GoalEntryData!$C$6=\">=\",IF($B242>=GoalEntryData!$D$6,1,0),\"\")))","v":""},"",null,null,null,{"$f":"IF($M242=\"\",\"\",IF(GoalEntryData!$C$10=\"<=\",IF($M242<=GoalEntryData!$D$10,1,0),IF(GoalEntryData!$C$10=\">=\",IF($M242>=GoalEntryData!$D$10,1,0),\"\")))","v":""},"",{"$f":"IF($M242=\"\",\"\",IF(GoalEntryData!$C$11=\"<=\",IF($M242<=GoalEntryData!$D$11,1,0),IF(GoalEntryData!$C$11=\">=\",IF($M242>=GoalEntryData!$D$11,1,0),\"\")))","v":""},"",{"$f":"IF($M242=\"\",\"\",IF(GoalEntryData!$C$12=\"<=\",IF($M242<=GoalEntryData!$D$12,1,0),IF(GoalEntryData!$C$10=\">=\",IF($M242>=GoalEntryData!$D$12,1,0),\"\")))","v":""},"",{"$f":"IF($M242=\"\",\"\",IF(GoalEntryData!$C$10=\"<=\",IF($M242<=GoalEntryData!$D$10,1,0),IF(GoalEntryData!$C$10=\">=\",IF($M242>=GoalEntryData!$D$10,1,0),\"\")))","v":""},""]
[null,null,null,{"$f":"IF($B243=\"\",\"\",IF(GoalEntryData!$C$6=\"<=\",IF($B243<=GoalEntryData!$D$6,1,0),IF(GoalEntryData!$C$6=\">=\",IF($B243>=GoalEntryData!$D$6,1,0),\"\")))","v":""},"",{"$f":"IF($B243=\"\",\"\",IF(GoalEntryData!$C$7=\"<=\",IF($B243<=GoalEntryData!$D$7,1,0),IF(GoalEntryData!$C$7=\">=\",IF($B243>=GoalEntryData!$D$7,1,0),\"\")))","v":""},"",{"$f":"IF($B243=\"\",\"\",IF(GoalEntryData!$C$8=\"<=\",IF($B243<=GoalEntryData!$D$8,1,0),IF(GoalEntryData!$C$8=\">=\",IF($B243>=GoalEntryData!$D$8,1,0),\"\")))","v":""},"",{"$f":"IF($B243=\"\",\"\",IF(GoalEntryData!$C$6=\"<=\",IF($B243<=GoalEntryData!$D$6,1,0),IF(GoalEntryData!$C$6=\">=\",IF($B243>=GoalEntryData!$D$6,1,0),\"\")))","v":""},"",null,null,null,{"$f":"IF($M243=\"\",\"\",IF(GoalEntryData!$C$10=\"<=\",IF($M243<=GoalEntryData!$D$10,1,0),IF(GoalEntryData!$C$10=\">=\",IF($M243>=GoalEntryData!$D$10,1,0),\"\")))","v":""},"",{"$f":"IF($M243=\"\",\"\",IF(GoalEntryData!$C$11=\"<=\",IF($M243<=GoalEntryData!$D$11,1,0),IF(GoalEntryData!$C$11=\">=\",IF($M243>=GoalEntryData!$D$11,1,0),\"\")))","v":""},"",{"$f":"IF($M243=\"\",\"\",IF(GoalEntryData!$C$12=\"<=\",IF($M243<=GoalEntryData!$D$12,1,0),IF(GoalEntryData!$C$10=\">=\",IF($M243>=GoalEntryData!$D$12,1,0),\"\")))","v":""},"",{"$f":"IF($M243=\"\",\"\",IF(GoalEntryData!$C$10=\"<=\",IF($M243<=GoalEntryData!$D$10,1,0),IF(GoalEntryData!$C$10=\">=\",IF($M243>=GoalEntryData!$D$10,1,0),\"\")))","v":""},""]
[null,null,null,{"$f":"IF($B244=\"\",\"\",IF(GoalEntryData!$C$6=\"<=\",IF($B244<=GoalEntryData!$D$6,1,0),IF(GoalEntryData!$C$6=\">=\",IF($B244>=GoalEntryData!$D$6,1,0),\"\")))","v":""},"",{"$f":"IF($B244=\"\",\"\",IF(GoalEntryData!$C$7=\"<=\",IF($B244<=GoalEntryData!$D$7,1,0),IF(GoalEntryData!$C$7=\">=\",IF($B244>=GoalEntryData!$D$7,1,0),\"\")))","v":""},"",{"$f":"IF($B244=\"\",\"\",IF(GoalEntryData!$C$8=\"<=\",IF($B244<=GoalEntryData!$D$8,1,0),IF(GoalEntryData!$C$8=\">=\",IF($B244>=GoalEntryData!$D$8,1,0),\"\")))","v":""},"",{"$f":"IF($B244=\"\",\"\",IF(GoalEntryData!$C$6=\"<=\",IF($B244<=GoalEntryData!$D$6,1,0),IF(GoalEntryData!$C$6=\">=\",IF($B244>=GoalEntryData!$D$6,1,0),\"\")))","v":""},"",null,null,null,{"$f":"IF($M244=\"\",\"\",IF(GoalEntryData!$C$10=\"<=\",IF($M244<=GoalEntryData!$D$10,1,0),IF(GoalEntryData!$C$10=\">=\",IF($M244>=GoalEntryData!$D$10,1,0),\"\")))","v":""},"",{"$f":"IF($M244=\"\",\"\",IF(GoalEntryData!$C$11=\"<=\",IF($M244<=GoalEntryData!$D$11,1,0),IF(GoalEntryData!$C$11=\">=\",IF($M244>=GoalEntryData!$D$11,1,0),\"\")))","v":""},"",{"$f":"IF($M244=\"\",\"\",IF(GoalEntryData!$C$12=\"<=\",IF($M244<=GoalEntryData!$D$12,1,0),IF(GoalEntryData!$C$10=\">=\",IF($M244>=GoalEntryData!$D$12,1,0),\"\")))","v":""},"",{"$f":"IF($M244=\"\",\"\",IF(GoalEntryData!$C$10=\"<=\",IF($M244<=GoalEntryData!$D$10,1,0),IF(GoalEntryData!$C$10=\">=\",IF($M244>=GoalEntryData!$D$10,1,0),\"\")))","v":""},""]
[null,null,null,{"$f":"IF($B245=\"\",\"\",IF(GoalEntryData!$C$6=\"<=\",IF($B245<=GoalEntryData!$D$6,1,0),IF(GoalEntryData!$C$6=\">=\",IF($B245>=GoalEntryData!$D$6,1,0),\"\")))","v":""},"",{"$f":"IF($B245=\"\",\"\",IF(GoalEntryData!$C$7=\"<=\",IF($B245<=GoalEntryData!$D$7,1,0),IF(GoalEntryData!$C$7=\">=\",IF($B245>=GoalEntryData!$D$7,1,0),\"\")))","v":""},"",{"$f":"IF($B245=\"\",\"\",IF(GoalEntryData!$C$8=\"<=\",IF($B245<=GoalEntryData!$D$8,1,0),IF(GoalEntryData!$C$8=\">=\",IF($B245>=GoalEntryData!$D$8,1,0),\"\")))","v":""},"",{"$f":"IF($B245=\"\",\"\",IF(GoalEntryData!$C$6=\"<=\",IF($B245<=GoalEntryData!$D$6,1,0),IF(GoalEntryData!$C$6=\">=\",IF($B245>=GoalEntryData!$D$6,1,0),\"\")))","v":""},"",null,null,null,{"$f":"IF($M245=\"\",\"\",IF(GoalEntryData!$C$10=\"<=\",IF($M245<=GoalEntryData!$D$10,1,0),IF(GoalEntryData!$C$10=\">=\",IF($M245>=GoalEntryData!$D$10,1,0),\"\")))","v":""},"",{"$f":"IF($M245=\"\",\"\",IF(GoalEntryData!$C$11=\"<=\",IF($M245<=GoalEntryData!$D$11,1,0),IF(GoalEntryData!$C$11=\">=\",IF($M245>=GoalEntryData!$D$11,1,0),\"\")))","v":""},"",{"$f":"IF($M245=\"\",\"\",IF(GoalEntryData!$C$12=\"<=\",IF($M245<=GoalEntryData!$D$12,1,0),IF(GoalEntryData!$C$10=\">=\",IF($M245>=GoalEntryData!$D$12,1,0),\"\")))","v":""},"",{"$f":"IF($M245=\"\",\"\",IF(GoalEntryData!$C$10=\"<=\",IF($M245<=GoalEntryData!$D$10,1,0),IF(GoalEntryData!$C$10=\">=\",IF($M245>=GoalEntryData!$D$10,1,0),\"\")))","v":""},""]
[null,null,null,{"$f":"IF($B246=\"\",\"\",IF(GoalEntryData!$C$6=\"<=\",IF($B246<=GoalEntryData!$D$6,1,0),IF(GoalEntryData!$C$6=\">=\",IF($B246>=GoalEntryData!$D$6,1,0),\"\")))","v":""},"",{"$f":"IF($B246=\"\",\"\",IF(GoalEntryData!$C$7=\"<=\",IF($B246<=GoalEntryData!$D$7,1,0),IF(GoalEntryData!$C$7=\">=\",IF($B246>=GoalEntryData!$D$7,1,0),\"\")))","v":""},"",{"$f":"IF($B246=\"\",\"\",IF(GoalEntryData!$C$8=\"<=\",IF($B246<=GoalEntryData!$D$8,1,0),IF(GoalEntryData!$C$8=\">=\",IF($B246>=GoalEntryData!$D$8,1,0),\"\")))","v":""},"",{"$f":"IF($B246=\"\",\"\",IF(GoalEntryData!$C$6=\"<=\",IF($B246<=GoalEntryData!$D$6,1,0),IF(GoalEntryData!$C$6=\">=\",IF($B246>=GoalEntryData!$D$6,1,0),\"\")))","v":""},"",null,null,null,{"$f":"IF($M246=\"\",\"\",IF(GoalEntryData!$C$10=\"<=\",IF($M246<=GoalEntryData!$D$10,1,0),IF(GoalEntryData!$C$10=\">=\",IF($M246>=GoalEntryData!$D$10,1,0),\"\")))","v":""},"",{"$f":"IF($M246=\"\",\"\",IF(GoalEntryData!$C$11=\"<=\",IF($M246<=GoalEntryData!$D$11,1,0),IF(GoalEntryData!$C$11=\">=\",IF($M246>=GoalEntryData!$D$11,1,0),\"\")))","v":""},"",{"$f":"IF($M246=\"\",\"\",IF(GoalEntryData!$C$12=\"<=\",IF($M246<=GoalEntryData!$D$12,1,0),IF(GoalEntryData!$C$10=\">=\",IF($M246>=GoalEntryData!$D$12,1,0),\"\")))","v":""},"",{"$f":"IF($M246=\"\",\"\",IF(GoalEntryData!$C$10=\"<=\",IF($M246<=GoalEntryData!$D$10,1,0),IF(GoalEntryData!$C$10=\">=\",IF($M246>=GoalEntryData!$D$10,1,0),\"\")))","v":""},""]
[null,null,null,{"$f":"IF($B247=\"\",\"\",IF(GoalEntryData!$C$6=\"<=\",IF($B247<=GoalEntryData!$D$6,1,0),IF(GoalEntryData!$C$6=\">=\",IF($B247>=GoalEntryData!$D$6,1,0),\"\")))","v":""},"",{"$f":"IF($B247=\"\",\"\",IF(GoalEntryData!$C$7=\"<=\",IF($B247<=GoalEntryData!$D$7,1,0),IF(GoalEntryData!$C$7=\">=\",IF($B247>=GoalEntryData!$D$7,1,0),\"\")))","v":""},"",{"$f":"IF($B247=\"\",\"\",IF(GoalEntryData!$C$8=\"<=\",IF($B247<=GoalEntryData!$D$8,1,0),IF(GoalEntryData!$C$8=\">=\",IF($B247>=GoalEntryData!$D$8,1,0),\"\")))","v":""},"",{"$f":"IF($B247=\"\",\"\",IF(GoalEntryData!$C$6=\"<=\",IF($B247<=GoalEntryData!$D$6,1,0),IF(GoalEntryData!$C$6=\">=\",IF($B247>=GoalEntryData!$D$6,1,0),\"\")))","v":""},"",null,null,null,{"$f":"IF($M247=\"\",\"\",IF(GoalEntryData!$C$10=\"<=\",IF($M247<=GoalEntryData!$D$10,1,0),IF(GoalEntryData!$C$10=\">=\",IF($M247>=GoalEntryData!$D$10,1,0),\"\")))","v":""},"",{"$f":"IF($M247=\"\",\"\",IF(GoalEntryData!$C$11=\"<=\",IF($M247<=GoalEntryData!$D$11,1,0),IF(GoalEntryData!$C$11=\">=\",IF($M247>=GoalEntryData!$D$11,1,0),\"\")))","v":""},"",{"$f":"IF($M247=\"\",\"\",IF(GoalEntryData!$C$12=\"<=\",IF($M247<=GoalEntryData!$D$12,1,0),IF(GoalEntryData!$C$10=\">=\",IF($M247>=GoalEntryData!$D$12,1,0),\"\")))","v":""},"",{"$f":"IF($M247=\"\",\"\",IF(GoalEntryData!$C$10=\"<=\",IF($M247<=GoalEntryData!$D$10,1,0),IF(GoalEntryData!$C$10=\">=\",IF($M247>=GoalEntryData!$D$10,1,0),\"\")))","v":""},""]
[null,null,null,{"$f":"IF($B248=\"\",\"\",IF(GoalEntryData!$C$6=\"<=\",IF($B248<=GoalEntryData!$D$6,1,0),IF(GoalEntryData!$C$6=\">=\",IF($B248>=GoalEntryData!$D$6,1,0),\"\")))","v":""},"",{"$f":"IF($B248=\"\",\"\",IF(GoalEntryData!$C$7=\"<=\",IF($B248<=GoalEntryData!$D$7,1,0),IF(GoalEntryData!$C$7=\">=\",IF($B248>=GoalEntryData!$D$7,1,0),\"\")))","v":""},"",{"$f":"IF($B248=\"\",\"\",IF(GoalEntryData!$C$8=\"<=\",IF($B248<=GoalEntryData!$D$8,1,0),IF(GoalEntryData!$C$8=\">=\",IF($B248>=GoalEntryData!$D$8,1,0),\"\")))","v":""},"",{"$f":"IF($B248=\"\",\"\",IF(GoalEntryData!$C$6=\"<=\",IF($B248<=GoalEntryData!$D$6,1,0),IF(GoalEntryData!$C$6=\">=\",IF($B248>=GoalEntryData!$D$6,1,0),\"\")))","v":""},"",null,null,null,{"$f":"IF($M248=\"\",\"\",IF(GoalEntryData!$C$10=\"<=\",IF($M248<=GoalEntryData!$D$10,1,0),IF(GoalEntryData!$C$10=\">=\",IF($M248>=GoalEntryData!$D$10,1,0),\"\")))","v":""},"",{"$f":"IF($M248=\"\",\"\",IF(GoalEntryData!$C$11=\"<=\",IF($M248<=GoalEntryData!$D$11,1,0),IF(GoalEntryData!$C$11=\">=\",IF($M248>=GoalEntryData!$D$11,1,0),\"\")))","v":""},"",{"$f":"IF($M248=\"\",\"\",IF(GoalEntryData!$C$12=\"<=\",IF($M248<=GoalEntryData!$D$12,1,0),IF(GoalEntryData!$C$10=\">=\",IF($M248>=GoalEntryData!$D$12,1,0),\"\")))","v":""},"",{"$f":"IF($M248=\"\",\"\",IF(GoalEntryData!$C$10=\"<=\",IF($M248<=GoalEntryData!$D$10,1,0),IF(GoalEntryData!$C$10=\">=\",IF($M248>=GoalEntryData!$D$10,1,0),\"\")))","v":""},""]
[null,null,null,{"$f":"IF($B249=\"\",\"\",IF(GoalEntryData!$C$6=\"<=\",IF($B249<=GoalEntryData!$D$6,1,0),IF(GoalEntryData!$C$6=\">=\",IF($B249>=GoalEntryData!$D$6,1,0),\"\")))","v":""},"",{"$f":"IF($B249=\"\",\"\",IF(GoalEntryData!$C$7=\"<=\",IF($B249<=GoalEntryData!$D$7,1,0),IF(GoalEntryData!$C$7=\">=\",IF($B249>=GoalEntryData!$D$7,1,0),\"\")))","v":""},"",{"$f":"IF($B249=\"\",\"\",IF(GoalEntryData!$C$8=\"<=\",IF($B249<=GoalEntryData!$D$8,1,0),IF(GoalEntryData!$C$8=\">=\",IF($B249>=GoalEntryData!$D$8,1,0),\"\")))","v":""},"",{"$f":"IF($B249=\"\",\"\",IF(GoalEntryData!$C$6=\"<=\",IF($B249<=GoalEntryData!$D$6,1,0),IF(GoalEntryData!$C$6=\">=\",IF($B249>=GoalEntryData!$D$6,1,0),\"\")))","v":""},"",null,null,null,{"$f":"IF($M249=\"\",\"\",IF(GoalEntryData!$C$10=\"<=\",IF($M249<=GoalEntryData!$D$10,1,0),IF(GoalEntryData!$C$10=\">=\",IF($M249>=GoalEntryData!$D$10,1,0),\"\")))","v":""},"",{"$f":"IF($M249=\"\",\"\",IF(GoalEntryData!$C$11=\"<=\",IF($M249<=GoalEntryData!$D$11,1,0),IF(GoalEntryData!$C$11=\">=\",IF($M249>=GoalEntryData!$D$11,1,0),\"\")))","v":""},"",{"$f":"IF($M249=\"\",\"\",IF(GoalEntryData!$C$12=\"<=\",IF($M249<=GoalEntryData!$D$12,1,0),IF(GoalEntryData!$C$10=\">=\",IF($M249>=GoalEntryData!$D$12,1,0),\"\")))","v":""},"",{"$f":"IF($M249=\"\",\"\",IF(GoalEntryData!$C$10=\"<=\",IF($M249<=GoalEntryData!$D$10,1,0),IF(GoalEntryData!$C$10=\">=\",IF($M249>=GoalEntryData!$D$10,1,0),\"\")))","v":""},""]
[null,null,null,{"$f":"IF($B250=\"\",\"\",IF(GoalEntryData!$C$6=\"<=\",IF($B250<=GoalEntryData!$D$6,1,0),IF(GoalEntryData!$C$6=\">=\",IF($B250>=GoalEntryData!$D$6,1,0),\"\")))","v":""},"",{"$f":"IF($B250=\"\",\"\",IF(GoalEntryData!$C$7=\"<=\",IF($B250<=GoalEntryData!$D$7,1,0),IF(GoalEntryData!$C$7=\">=\",IF($B250>=GoalEntryData!$D$7,1,0),\"\")))","v":""},"",{"$f":"IF($B250=\"\",\"\",IF(GoalEntryData!$C$8=\"<=\",IF($B250<=GoalEntryData!$D$8,1,0),IF(GoalEntryData!$C$8=\">=\",IF($B250>=GoalEntryData!$D$8,1,0),\"\")))","v":""},"",{"$f":"IF($B250=\"\",\"\",IF(GoalEntryData!$C$6=\"<=\",IF($B250<=GoalEntryData!$D$6,1,0),IF(GoalEntryData!$C$6=\">=\",IF($B250>=GoalEntryData!$D$6,1,0),\"\")))","v":""},"",null,null,null,{"$f":"IF($M250=\"\",\"\",IF(GoalEntryData!$C$10=\"<=\",IF($M250<=GoalEntryData!$D$10,1,0),IF(GoalEntryData!$C$10=\">=\",IF($M250>=GoalEntryData!$D$10,1,0),\"\")))","v":""},"",{"$f":"IF($M250=\"\",\"\",IF(GoalEntryData!$C$11=\"<=\",IF($M250<=GoalEntryData!$D$11,1,0),IF(GoalEntryData!$C$11=\">=\",IF($M250>=GoalEntryData!$D$11,1,0),\"\")))","v":""},"",{"$f":"IF($M250=\"\",\"\",IF(GoalEntryData!$C$12=\"<=\",IF($M250<=GoalEntryData!$D$12,1,0),IF(GoalEntryData!$C$10=\">=\",IF($M250>=GoalEntryData!$D$12,1,0),\"\")))","v":""},"",{"$f":"IF($M250=\"\",\"\",IF(GoalEntryData!$C$10=\"<=\",IF($M250<=GoalEntryData!$D$10,1,0),IF(GoalEntryData!$C$10=\">=\",IF($M250>=GoalEntryData!$D$10,1,0),\"\")))","v":""},""]
[null,null,null,{"$f":"IF($B251=\"\",\"\",IF(GoalEntryData!$C$6=\"<=\",IF($B251<=GoalEntryData!$D$6,1,0),IF(GoalEntryData!$C$6=\">=\",IF($B251>=GoalEntryData!$D$6,1,0),\"\")))","v":""},"",{"$f":"IF($B251=\"\",\"\",IF(GoalEntryData!$C$7=\"<=\",IF($B251<=GoalEntryData!$D$7,1,0),IF(GoalEntryData!$C$7=\">=\",IF($B251>=GoalEntryData!$D$7,1,0),\"\")))","v":""},"",{"$f":"IF($B251=\"\",\"\",IF(GoalEntryData!$C$8=\"<=\",IF($B251<=GoalEntryData!$D$8,1,0),IF(GoalEntryData!$C$8=\">=\",IF($B251>=GoalEntryData!$D$8,1,0),\"\")))","v":""},"",{"$f":"IF($B251=\"\",\"\",IF(GoalEntryData!$C$6=\"<=\",IF($B251<=GoalEntryData!$D$6,1,0),IF(GoalEntryData!$C$6=\">=\",IF($B251>=GoalEntryData!$D$6,1,0),\"\")))","v":""},"",null,null,null,{"$f":"IF($M251=\"\",\"\",IF(GoalEntryData!$C$10=\"<=\",IF($M251<=GoalEntryData!$D$10,1,0),IF(GoalEntryData!$C$10=\">=\",IF($M251>=GoalEntryData!$D$10,1,0),\"\")))","v":""},"",{"$f":"IF($M251=\"\",\"\",IF(GoalEntryData!$C$11=\"<=\",IF($M251<=GoalEntryData!$D$11,1,0),IF(GoalEntryData!$C$11=\">=\",IF($M251>=GoalEntryData!$D$11,1,0),\"\")))","v":""},"",{"$f":"IF($M251=\"\",\"\",IF(GoalEntryData!$C$12=\"<=\",IF($M251<=GoalEntryData!$D$12,1,0),IF(GoalEntryData!$C$10=\">=\",IF($M251>=GoalEntryData!$D$12,1,0),\"\")))","v":""},"",{"$f":"IF($M251=\"\",\"\",IF(GoalEntryData!$C$10=\"<=\",IF($M251<=GoalEntryData!$D$10,1,0),IF(GoalEntryData!$C$10=\">=\",IF($M251>=GoalEntryData!$D$10,1,0),\"\")))","v":""},""]
[null,null,null,{"$f":"IF($B252=\"\",\"\",IF(GoalEntryData!$C$6=\"<=\",IF($B252<=GoalEntryData!$D$6,1,0),IF(GoalEntryData!$C$6=\">=\",IF($B252>=GoalEntryData!$D$6,1,0),\"\")))","v":""},"",{"$f":"IF($B252=\"\",\"\",IF(GoalEntryData!$C$7=\"<=\",IF($B252<=GoalEntryData!$D$7,1,0),IF(GoalEntryData!$C$7=\">=\",IF($B252>=GoalEntryData!$D$7,1,0),\"\")))","v":""},"",{"$f":"IF($B252=\"\",\"\",IF(GoalEntryData!$C$8=\"<=\",IF($B252<=GoalEntryData!$D$8,1,0),IF(GoalEntryData!$C$8=\">=\",IF($B252>=GoalEntryData!$D$8,1,0),\"\")))","v":""},"",{"$f":"IF($B252=\"\",\"\",IF(GoalEntryData!$C$6=\"<=\",IF($B252<=GoalEntryData!$D$6,1,0),IF(GoalEntryData!$C$6=\">=\",IF($B252>=GoalEntryData!$D$6,1,0),\"\")))","v":""},"",null,null,null,{"$f":"IF($M252=\"\",\"\",IF(GoalEntryData!$C$10=\"<=\",IF($M252<=GoalEntryData!$D$10,1,0),IF(GoalEntryData!$C$10=\">=\",IF($M252>=GoalEntryData!$D$10,1,0),\"\")))","v":""},"",{"$f":"IF($M252=\"\",\"\",IF(GoalEntryData!$C$11=\"<=\",IF($M252<=GoalEntryData!$D$11,1,0),IF(GoalEntryData!$C$11=\">=\",IF($M252>=GoalEntryData!$D$11,1,0),\"\")))","v":""},"",{"$f":"IF($M252=\"\",\"\",IF(GoalEntryData!$C$12=\"<=\",IF($M252<=GoalEntryData!$D$12,1,0),IF(GoalEntryData!$C$10=\">=\",IF($M252>=GoalEntryData!$D$12,1,0),\"\")))","v":""},"",{"$f":"IF($M252=\"\",\"\",IF(GoalEntryData!$C$10=\"<=\",IF($M252<=GoalEntryData!$D$10,1,0),IF(GoalEntryData!$C$10=\">=\",IF($M252>=GoalEntryData!$D$10,1,0),\"\")))","v":""},""]
[null,null,null,{"$f":"IF($B253=\"\",\"\",IF(GoalEntryData!$C$6=\"<=\",IF($B253<=GoalEntryData!$D$6,1,0),IF(GoalEntryData!$C$6=\">=\",IF($B253>=GoalEntryData!$D$6,1,0),\"\")))","v":""},"",{"$f":"IF($B253=\"\",\"\",IF(GoalEntryData!$C$7=\"<=\",IF($B253<=GoalEntryData!$D$7,1,0),IF(GoalEntryData!$C$7=\">=\",IF($B253>=GoalEntryData!$D$7,1,0),\"\")))","v":""},"",{"$f":"IF($B253=\"\",\"\",IF(GoalEntryData!$C$8=\"<=\",IF($B253<=GoalEntryData!$D$8,1,0),IF(GoalEntryData!$C$8=\">=\",IF($B253>=GoalEntryData!$D$8,1,0),\"\")))","v":""},"",{"$f":"IF($B253=\"\",\"\",IF(GoalEntryData!$C$6=\"<=\",IF($B253<=GoalEntryData!$D$6,1,0),IF(GoalEntryData!$C$6=\">=\",IF($B253>=GoalEntryData!$D$6,1,0),\"\")))","v":""},"",null,null,null,{"$f":"IF($M253=\"\",\"\",IF(GoalEntryData!$C$10=\"<=\",IF($M253<=GoalEntryData!$D$10,1,0),IF(GoalEntryData!$C$10=\">=\",IF($M253>=GoalEntryData!$D$10,1,0),\"\")))","v":""},"",{"$f":"IF($M253=\"\",\"\",IF(GoalEntryData!$C$11=\"<=\",IF($M253<=GoalEntryData!$D$11,1,0),IF(GoalEntryData!$C$11=\">=\",IF($M253>=GoalEntryData!$D$11,1,0),\"\")))","v":""},"",{"$f":"IF($M253=\"\",\"\",IF(GoalEntryData!$C$12=\"<=\",IF($M253<=GoalEntryData!$D$12,1,0),IF(GoalEntryData!$C$10=\">=\",IF($M253>=GoalEntryData!$D$12,1,0),\"\")))","v":""},"",{"$f":"IF($M253=\"\",\"\",IF(GoalEntryData!$C$10=\"<=\",IF($M253<=GoalEntryData!$D$10,1,0),IF(GoalEntryData!$C$10=\">=\",IF($M253>=GoalEntryData!$D$10,1,0),\"\")))","v":""},""]
[null,null,null,{"$f":"IF($B254=\"\",\"\",IF(GoalEntryData!$C$6=\"<=\",IF($B254<=GoalEntryData!$D$6,1,0),IF(GoalEntryData!$C$6=\">=\",IF($B254>=GoalEntryData!$D$6,1,0),\"\")))","v":""},"",{"$f":"IF($B254=\"\",\"\",IF(GoalEntryData!$C$7=\"<=\",IF($B254<=GoalEntryData!$D$7,1,0),IF(GoalEntryData!$C$7=\">=\",IF($B254>=GoalEntryData!$D$7,1,0),\"\")))","v":""},"",{"$f":"IF($B254=\"\",\"\",IF(GoalEntryData!$C$8=\"<=\",IF($B254<=GoalEntryData!$D$8,1,0),IF(GoalEntryData!$C$8=\">=\",IF($B254>=GoalEntryData!$D$8,1,0),\"\")))","v":""},"",{"$f":"IF($B254=\"\",\"\",IF(GoalEntryData!$C$6=\"<=\",IF($B254<=GoalEntryData!$D$6,1,0),IF(GoalEntryData!$C$6=\">=\",IF($B254>=GoalEntryData!$D$6,1,0),\"\")))","v":""},"",null,null,null,{"$f":"IF($M254=\"\",\"\",IF(GoalEntryData!$C$10=\"<=\",IF($M254<=GoalEntryData!$D$10,1,0),IF(GoalEntryData!$C$10=\">=\",IF($M254>=GoalEntryData!$D$10,1,0),\"\")))","v":""},"",{"$f":"IF($M254=\"\",\"\",IF(GoalEntryData!$C$11=\"<=\",IF($M254<=GoalEntryData!$D$11,1,0),IF(GoalEntryData!$C$11=\">=\",IF($M254>=GoalEntryData!$D$11,1,0),\"\")))","v":""},"",{"$f":"IF($M254=\"\",\"\",IF(GoalEntryData!$C$12=\"<=\",IF($M254<=GoalEntryData!$D$12,1,0),IF(GoalEntryData!$C$10=\">=\",IF($M254>=GoalEntryData!$D$12,1,0),\"\")))","v":""},"",{"$f":"IF($M254=\"\",\"\",IF(GoalEntryData!$C$10=\"<=\",IF($M254<=GoalEntryData!$D$10,1,0),IF(GoalEntryData!$C$10=\">=\",IF($M254>=GoalEntryData!$D$10,1,0),\"\")))","v":""},""]
[null,null,null,{"$f":"IF($B255=\"\",\"\",IF(GoalEntryData!$C$6=\"<=\",IF($B255<=GoalEntryData!$D$6,1,0),IF(GoalEntryData!$C$6=\">=\",IF($B255>=GoalEntryData!$D$6,1,0),\"\")))","v":""},"",{"$f":"IF($B255=\"\",\"\",IF(GoalEntryData!$C$7=\"<=\",IF($B255<=GoalEntryData!$D$7,1,0),IF(GoalEntryData!$C$7=\">=\",IF($B255>=GoalEntryData!$D$7,1,0),\"\")))","v":""},"",{"$f":"IF($B255=\"\",\"\",IF(GoalEntryData!$C$8=\"<=\",IF($B255<=GoalEntryData!$D$8,1,0),IF(GoalEntryData!$C$8=\">=\",IF($B255>=GoalEntryData!$D$8,1,0),\"\")))","v":""},"",{"$f":"IF($B255=\"\",\"\",IF(GoalEntryData!$C$6=\"<=\",IF($B255<=GoalEntryData!$D$6,1,0),IF(GoalEntryData!$C$6=\">=\",IF($B255>=GoalEntryData!$D$6,1,0),\"\")))","v":""},"",null,null,null,{"$f":"IF($M255=\"\",\"\",IF(GoalEntryData!$C$10=\"<=\",IF($M255<=GoalEntryData!$D$10,1,0),IF(GoalEntryData!$C$10=\">=\",IF($M255>=GoalEntryData!$D$10,1,0),\"\")))","v":""},"",{"$f":"IF($M255=\"\",\"\",IF(GoalEntryData!$C$11=\"<=\",IF($M255<=GoalEntryData!$D$11,1,0),IF(GoalEntryData!$C$11=\">=\",IF($M255>=GoalEntryData!$D$11,1,0),\"\")))","v":""},"",{"$f":"IF($M255=\"\",\"\",IF(GoalEntryData!$C$12=\"<=\",IF($M255<=GoalEntryData!$D$12,1,0),IF(GoalEntryData!$C$10=\">=\",IF($M255>=GoalEntryData!$D$12,1,0),\"\")))","v":""},"",{"$f":"IF($M255=\"\",\"\",IF(GoalEntryData!$C$10=\"<=\",IF($M255<=GoalEntryData!$D$10,1,0),IF(GoalEntryData!$C$10=\">=\",IF($M255>=GoalEntryData!$D$10,1,0),\"\")))","v":""},""]
[null,null,null,{"$f":"IF($B256=\"\",\"\",IF(GoalEntryData!$C$6=\"<=\",IF($B256<=GoalEntryData!$D$6,1,0),IF(GoalEntryData!$C$6=\">=\",IF($B256>=GoalEntryData!$D$6,1,0),\"\")))","v":""},"",{"$f":"IF($B256=\"\",\"\",IF(GoalEntryData!$C$7=\"<=\",IF($B256<=GoalEntryData!$D$7,1,0),IF(GoalEntryData!$C$7=\">=\",IF($B256>=GoalEntryData!$D$7,1,0),\"\")))","v":""},"",{"$f":"IF($B256=\"\",\"\",IF(GoalEntryData!$C$8=\"<=\",IF($B256<=GoalEntryData!$D$8,1,0),IF(GoalEntryData!$C$8=\">=\",IF($B256>=GoalEntryData!$D$8,1,0),\"\")))","v":""},"",{"$f":"IF($B256=\"\",\"\",IF(GoalEntryData!$C$6=\"<=\",IF($B256<=GoalEntryData!$D$6,1,0),IF(GoalEntryData!$C$6=\">=\",IF($B256>=GoalEntryData!$D$6,1,0),\"\")))","v":""},"",null,null,null,{"$f":"IF($M256=\"\",\"\",IF(GoalEntryData!$C$10=\"<=\",IF($M256<=GoalEntryData!$D$10,1,0),IF(GoalEntryData!$C$10=\">=\",IF($M256>=GoalEntryData!$D$10,1,0),\"\")))","v":""},"",{"$f":"IF($M256=\"\",\"\",IF(GoalEntryData!$C$11=\"<=\",IF($M256<=GoalEntryData!$D$11,1,0),IF(GoalEntryData!$C$11=\">=\",IF($M256>=GoalEntryData!$D$11,1,0),\"\")))","v":""},"",{"$f":"IF($M256=\"\",\"\",IF(GoalEntryData!$C$12=\"<=\",IF($M256<=GoalEntryData!$D$12,1,0),IF(GoalEntryData!$C$10=\">=\",IF($M256>=GoalEntryData!$D$12,1,0),\"\")))","v":""},"",{"$f":"IF($M256=\"\",\"\",IF(GoalEntryData!$C$10=\"<=\",IF($M256<=GoalEntryData!$D$10,1,0),IF(GoalEntryData!$C$10=\">=\",IF($M256>=GoalEntryData!$D$10,1,0),\"\")))","v":""},""]
[null,null,null,{"$f":"IF($B257=\"\",\"\",IF(GoalEntryData!$C$6=\"<=\",IF($B257<=GoalEntryData!$D$6,1,0),IF(GoalEntryData!$C$6=\">=\",IF($B257>=GoalEntryData!$D$6,1,0),\"\")))","v":""},"",{"$f":"IF($B257=\"\",\"\",IF(GoalEntryData!$C$7=\"<=\",IF($B257<=GoalEntryData!$D$7,1,0),IF(GoalEntryData!$C$7=\">=\",IF($B257>=GoalEntryData!$D$7,1,0),\"\")))","v":""},"",{"$f":"IF($B257=\"\",\"\",IF(GoalEntryData!$C$8=\"<=\",IF($B257<=GoalEntryData!$D$8,1,0),IF(GoalEntryData!$C$8=\">=\",IF($B257>=GoalEntryData!$D$8,1,0),\"\")))","v":""},"",{"$f":"IF($B257=\"\",\"\",IF(GoalEntryData!$C$6=\"<=\",IF($B257<=GoalEntryData!$D$6,1,0),IF(GoalEntryData!$C$6=\">=\",IF($B257>=GoalEntryData!$D$6,1,0),\"\")))","v":""},"",null,null,null,{"$f":"IF($M257=\"\",\"\",IF(GoalEntryData!$C$10=\"<=\",IF($M257<=GoalEntryData!$D$10,1,0),IF(GoalEntryData!$C$10=\">=\",IF($M257>=GoalEntryData!$D$10,1,0),\"\")))","v":""},"",{"$f":"IF($M257=\"\",\"\",IF(GoalEntryData!$C$11=\"<=\",IF($M257<=GoalEntryData!$D$11,1,0),IF(GoalEntryData!$C$11=\">=\",IF($M257>=GoalEntryData!$D$11,1,0),\"\")))","v":""},"",{"$f":"IF($M257=\"\",\"\",IF(GoalEntryData!$C$12=\"<=\",IF($M257<=GoalEntryData!$D$12,1,0),IF(GoalEntryData!$C$10=\">=\",IF($M257>=GoalEntryData!$D$12,1,0),\"\")))","v":""},"",{"$f":"IF($M257=\"\",\"\",IF(GoalEntryData!$C$10=\"<=\",IF($M257<=GoalEntryData!$D$10,1,0),IF(GoalEntryData!$C$10=\">=\",IF($M257>=GoalEntryData!$D$10,1,0),\"\")))","v":""},""]
[null,null,null,{"$f":"IF($B258=\"\",\"\",IF(GoalEntryData!$C$6=\"<=\",IF($B258<=GoalEntryData!$D$6,1,0),IF(GoalEntryData!$C$6=\">=\",IF($B258>=GoalEntryData!$D$6,1,0),\"\")))","v":""},"",{"$f":"IF($B258=\"\",\"\",IF(GoalEntryData!$C$7=\"<=\",IF($B258<=GoalEntryData!$D$7,1,0),IF(GoalEntryData!$C$7=\">=\",IF($B258>=GoalEntryData!$D$7,1,0),\"\")))","v":""},"",{"$f":"IF($B258=\"\",\"\",IF(GoalEntryData!$C$8=\"<=\",IF($B258<=GoalEntryData!$D$8,1,0),IF(GoalEntryData!$C$8=\">=\",IF($B258>=GoalEntryData!$D$8,1,0),\"\")))","v":""},"",{"$f":"IF($B258=\"\",\"\",IF(GoalEntryData!$C$6=\"<=\",IF($B258<=GoalEntryData!$D$6,1,0),IF(GoalEntryData!$C$6=\">=\",IF($B258>=GoalEntryData!$D$6,1,0),\"\")))","v":""},"",null,null,null,{"$f":"IF($M258=\"\",\"\",IF(GoalEntryData!$C$10=\"<=\",IF($M258<=GoalEntryData!$D$10,1,0),IF(GoalEntryData!$C$10=\">=\",IF($M258>=GoalEntryData!$D$10,1,0),\"\")))","v":""},"",{"$f":"IF($M258=\"\",\"\",IF(GoalEntryData!$C$11=\"<=\",IF($M258<=GoalEntryData!$D$11,1,0),IF(GoalEntryData!$C$11=\">=\",IF($M258>=GoalEntryData!$D$11,1,0),\"\")))","v":""},"",{"$f":"IF($M258=\"\",\"\",IF(GoalEntryData!$C$12=\"<=\",IF($M258<=GoalEntryData!$D$12,1,0),IF(GoalEntryData!$C$10=\">=\",IF($M258>=GoalEntryData!$D$12,1,0),\"\")))","v":""},"",{"$f":"IF($M258=\"\",\"\",IF(GoalEntryData!$C$10=\"<=\",IF($M258<=GoalEntryData!$D$10,1,0),IF(GoalEntryData!$C$10=\">=\",IF($M258>=GoalEntryData!$D$10,1,0),\"\")))","v":""},""]
[null,null,null,{"$f":"IF($B259=\"\",\"\",IF(GoalEntryData!$C$6=\"<=\",IF($B259<=GoalEntryData!$D$6,1,0),IF(GoalEntryData!$C$6=\">=\",IF($B259>=GoalEntryData!$D$6,1,0),\"\")))","v":""},"",{"$f":"IF($B259=\"\",\"\",IF(GoalEntryData!$C$7=\"<=\",IF($B259<=GoalEntryData!$D$7,1,0),IF(GoalEntryData!$C$7=\">=\",IF($B259>=GoalEntryData!$D$7,1,0),\"\")))","v":""},"",{"$f":"IF($B259=\"\",\"\",IF(GoalEntryData!$C$8=\"<=\",IF($B259<=GoalEntryData!$D$8,1,0),IF(GoalEntryData!$C$8=\">=\",IF($B259>=GoalEntryData!$D$8,1,0),\"\")))","v":""},"",{"$f":"IF($B259=\"\",\"\",IF(GoalEntryData!$C$6=\"<=\",IF($B259<=GoalEntryData!$D$6,1,0),IF(GoalEntryData!$C$6=\">=\",IF($B259>=GoalEntryData!$D$6,1,0),\"\")))","v":""},"",null,null,null,{"$f":"IF($M259=\"\",\"\",IF(GoalEntryData!$C$10=\"<=\",IF($M259<=GoalEntryData!$D$10,1,0),IF(GoalEntryData!$C$10=\">=\",IF($M259>=GoalEntryData!$D$10,1,0),\"\")))","v":""},"",{"$f":"IF($M259=\"\",\"\",IF(GoalEntryData!$C$11=\"<=\",IF($M259<=GoalEntryData!$D$11,1,0),IF(GoalEntryData!$C$11=\">=\",IF($M259>=GoalEntryData!$D$11,1,0),\"\")))","v":""},"",{"$f":"IF($M259=\"\",\"\",IF(GoalEntryData!$C$12=\"<=\",IF($M259<=GoalEntryData!$D$12,1,0),IF(GoalEntryData!$C$10=\">=\",IF($M259>=GoalEntryData!$D$12,1,0),\"\")))","v":""},"",{"$f":"IF($M259=\"\",\"\",IF(GoalEntryData!$C$10=\"<=\",IF($M259<=GoalEntryData!$D$10,1,0),IF(GoalEntryData!$C$10=\">=\",IF($M259>=GoalEntryData!$D$10,1,0),\"\")))","v":""},""]
[null,null,null,{"$f":"IF($B260=\"\",\"\",IF(GoalEntryData!$C$6=\"<=\",IF($B260<=GoalEntryData!$D$6,1,0),IF(GoalEntryData!$C$6=\">=\",IF($B260>=GoalEntryData!$D$6,1,0),\"\")))","v":""},{"$f":"IF(AND(E259>=1,D260=1),E259+1,D260)","v":""},{"$f":"IF($B260=\"\",\"\",IF(GoalEntryData!$C$7=\"<=\",IF($B260<=GoalEntryData!$D$7,1,0),IF(GoalEntryData!$C$7=\">=\",IF($B260>=GoalEntryData!$D$7,1,0),\"\")))","v":""},{"$f":"IF(AND(G259>=1,F260=1),G259+1,F260)","v":""},{"$f":"IF($B260=\"\",\"\",IF(GoalEntryData!$C$8=\"<=\",IF($B260<=GoalEntryData!$D$8,1,0),IF(GoalEntryData!$C$8=\">=\",IF($B260>=GoalEntryData!$D$8,1,0),\"\")))","v":""},{"$f":"IF(AND(I259>=1,H260=1),I259+1,H260)","v":""},{"$f":"IF($B260=\"\",\"\",IF(GoalEntryData!$C$6=\"<=\",IF($B260<=GoalEntryData!$D$6,1,0),IF(GoalEntryData!$C$6=\">=\",IF($B260>=GoalEntryData!$D$6,1,0),\"\")))","v":""},{"$f":"IF(AND(K259>=1,J260=1),K259+1,J260)","v":""},null,null,null,{"$f":"IF($M260=\"\",\"\",IF(GoalEntryData!$C$10=\"<=\",IF($M260<=GoalEntryData!$D$10,1,0),IF(GoalEntryData!$C$10=\">=\",IF($M260>=GoalEntryData!$D$10,1,0),\"\")))","v":""},{"$f":"IF(AND(P259>=1,O260=1),P259+1,O260)","v":""},{"$f":"IF($M260=\"\",\"\",IF(GoalEntryData!$C$11=\"<=\",IF($M260<=GoalEntryData!$D$11,1,0),IF(GoalEntryData!$C$11=\">=\",IF($M260>=GoalEntryData!$D$11,1,0),\"\")))","v":""},{"$f":"IF(AND(R259>=1,Q260=1),R259+1,Q260)","v":""},{"$f":"IF($M260=\"\",\"\",IF(GoalEntryData!$C$12=\"<=\",IF($M260<=GoalEntryData!$D$12,1,0),IF(GoalEntryData!$C$10=\">=\",IF($M260>=GoalEntryData!$D$12,1,0),\"\")))","v":""},{"$f":"IF(AND(T259>=1,S260=1),T259+1,S260)","v":""},{"$f":"IF($M260=\"\",\"\",IF(GoalEntryData!$C$10=\"<=\",IF($M260<=GoalEntryData!$D$10,1,0),IF(GoalEntryData!$C$10=\">=\",IF($M260>=GoalEntryData!$D$10,1,0),\"\")))","v":""},{"$f":"IF(AND(V259>=1,U260=1),V259+1,U260)","v":""}]
[null,null,null,{"$f":"IF($B261=\"\",\"\",IF(GoalEntryData!$C$6=\"<=\",IF($B261<=GoalEntryData!$D$6,1,0),IF(GoalEntryData!$C$6=\">=\",IF($B261>=GoalEntryData!$D$6,1,0),\"\")))","v":""},"",{"$f":"IF($B261=\"\",\"\",IF(GoalEntryData!$C$7=\"<=\",IF($B261<=GoalEntryData!$D$7,1,0),IF(GoalEntryData!$C$7=\">=\",IF($B261>=GoalEntryData!$D$7,1,0),\"\")))","v":""},"",{"$f":"IF($B261=\"\",\"\",IF(GoalEntryData!$C$8=\"<=\",IF($B261<=GoalEntryData!$D$8,1,0),IF(GoalEntryData!$C$8=\">=\",IF($B261>=GoalEntryData!$D$8,1,0),\"\")))","v":""},"",{"$f":"IF($B261=\"\",\"\",IF(GoalEntryData!$C$6=\"<=\",IF($B261<=GoalEntryData!$D$6,1,0),IF(GoalEntryData!$C$6=\">=\",IF($B261>=GoalEntryData!$D$6,1,0),\"\")))","v":""},"",null,null,null,{"$f":"IF($M261=\"\",\"\",IF(GoalEntryData!$C$10=\"<=\",IF($M261<=GoalEntryData!$D$10,1,0),IF(GoalEntryData!$C$10=\">=\",IF($M261>=GoalEntryData!$D$10,1,0),\"\")))","v":""},"",{"$f":"IF($M261=\"\",\"\",IF(GoalEntryData!$C$11=\"<=\",IF($M261<=GoalEntryData!$D$11,1,0),IF(GoalEntryData!$C$11=\">=\",IF($M261>=GoalEntryData!$D$11,1,0),\"\")))","v":""},"",{"$f":"IF($M261=\"\",\"\",IF(GoalEntryData!$C$12=\"<=\",IF($M261<=GoalEntryData!$D$12,1,0),IF(GoalEntryData!$C$10=\">=\",IF($M261>=GoalEntryData!$D$12,1,0),\"\")))","v":""},"",{"$f":"IF($M261=\"\",\"\",IF(GoalEntryData!$C$10=\"<=\",IF($M261<=GoalEntryData!$D$10,1,0),IF(GoalEntryData!$C$10=\">=\",IF($M261>=GoalEntryData!$D$10,1,0),\"\")))","v":""},""]
[null,null,null,{"$f":"IF($B262=\"\",\"\",IF(GoalEntryData!$C$6=\"<=\",IF($B262<=GoalEntryData!$D$6,1,0),IF(GoalEntryData!$C$6=\">=\",IF($B262>=GoalEntryData!$D$6,1,0),\"\")))","v":""},"",{"$f":"IF($B262=\"\",\"\",IF(GoalEntryData!$C$7=\"<=\",IF($B262<=GoalEntryData!$D$7,1,0),IF(GoalEntryData!$C$7=\">=\",IF($B262>=GoalEntryData!$D$7,1,0),\"\")))","v":""},"",{"$f":"IF($B262=\"\",\"\",IF(GoalEntryData!$C$8=\"<=\",IF($B262<=GoalEntryData!$D$8,1,0),IF(GoalEntryData!$C$8=\">=\",IF($B262>=GoalEntryData!$D$8,1,0),\"\")))","v":""},"",{"$f":"IF($B262=\"\",\"\",IF(GoalEntryData!$C$6=\"<=\",IF($B262<=GoalEntryData!$D$6,1,0),IF(GoalEntryData!$C$6=\">=\",IF($B262>=GoalEntryData!$D$6,1,0),\"\")))","v":""},"",null,null,null,{"$f":"IF($M262=\"\",\"\",IF(GoalEntryData!$C$10=\"<=\",IF($M262<=GoalEntryData!$D$10,1,0),IF(GoalEntryData!$C$10=\">=\",IF($M262>=GoalEntryData!$D$10,1,0),\"\")))","v":""},"",{"$f":"IF($M262=\"\",\"\",IF(GoalEntryData!$C$11=\"<=\",IF($M262<=GoalEntryData!$D$11,1,0),IF(GoalEntryData!$C$11=\">=\",IF($M262>=GoalEntryData!$D$11,1,0),\"\")))","v":""},"",{"$f":"IF($M262=\"\",\"\",IF(GoalEntryData!$C$12=\"<=\",IF($M262<=GoalEntryData!$D$12,1,0),IF(GoalEntryData!$C$10=\">=\",IF($M262>=GoalEntryData!$D$12,1,0),\"\")))","v":""},"",{"$f":"IF($M262=\"\",\"\",IF(GoalEntryData!$C$10=\"<=\",IF($M262<=GoalEntryData!$D$10,1,0),IF(GoalEntryData!$C$10=\">=\",IF($M262>=GoalEntryData!$D$10,1,0),\"\")))","v":""},""]
[null,null,null,{"$f":"IF($B263=\"\",\"\",IF(GoalEntryData!$C$6=\"<=\",IF($B263<=GoalEntryData!$D$6,1,0),IF(GoalEntryData!$C$6=\">=\",IF($B263>=GoalEntryData!$D$6,1,0),\"\")))","v":""},"",{"$f":"IF($B263=\"\",\"\",IF(GoalEntryData!$C$7=\"<=\",IF($B263<=GoalEntryData!$D$7,1,0),IF(GoalEntryData!$C$7=\">=\",IF($B263>=GoalEntryData!$D$7,1,0),\"\")))","v":""},"",{"$f":"IF($B263=\"\",\"\",IF(GoalEntryData!$C$8=\"<=\",IF($B263<=GoalEntryData!$D$8,1,0),IF(GoalEntryData!$C$8=\">=\",IF($B263>=GoalEntryData!$D$8,1,0),\"\")))","v":""},"",{"$f":"IF($B263=\"\",\"\",IF(GoalEntryData!$C$6=\"<=\",IF($B263<=GoalEntryData!$D$6,1,0),IF(GoalEntryData!$C$6=\">=\",IF($B263>=GoalEntryData!$D$6,1,0),\"\")))","v":""},"",null,null,null,{"$f":"IF($M263=\"\",\"\",IF(GoalEntryData!$C$10=\"<=\",IF($M263<=GoalEntryData!$D$10,1,0),IF(GoalEntryData!$C$10=\">=\",IF($M263>=GoalEntryData!$D$10,1,0),\"\")))","v":""},"",{"$f":"IF($M263=\"\",\"\",IF(GoalEntryData!$C$11=\"<=\",IF($M263<=GoalEntryData!$D$11,1,0),IF(GoalEntryData!$C$11=\">=\",IF($M263>=GoalEntryData!$D$11,1,0),\"\")))","v":""},"",{"$f":"IF($M263=\"\",\"\",IF(GoalEntryData!$C$12=\"<=\",IF($M263<=GoalEntryData!$D$12,1,0),IF(GoalEntryData!$C$10=\">=\",IF($M263>=GoalEntryData!$D$12,1,0),\"\")))","v":""},"",{"$f":"IF($M263=\"\",\"\",IF(GoalEntryData!$C$10=\"<=\",IF($M263<=GoalEntryData!$D$10,1,0),IF(GoalEntryData!$C$10=\">=\",IF($M263>=GoalEntryData!$D$10,1,0),\"\")))","v":""},""]
[null,null,null,{"$f":"IF($B264=\"\",\"\",IF(GoalEntryData!$C$6=\"<=\",IF($B264<=GoalEntryData!$D$6,1,0),IF(GoalEntryData!$C$6=\">=\",IF($B264>=GoalEntryData!$D$6,1,0),\"\")))","v":""},"",{"$f":"IF($B264=\"\",\"\",IF(GoalEntryData!$C$7=\"<=\",IF($B264<=GoalEntryData!$D$7,1,0),IF(GoalEntryData!$C$7=\">=\",IF($B264>=GoalEntryData!$D$7,1,0),\"\")))","v":""},"",{"$f":"IF($B264=\"\",\"\",IF(GoalEntryData!$C$8=\"<=\",IF($B264<=GoalEntryData!$D$8,1,0),IF(GoalEntryData!$C$8=\">=\",IF($B264>=GoalEntryData!$D$8,1,0),\"\")))","v":""},"",{"$f":"IF($B264=\"\",\"\",IF(GoalEntryData!$C$6=\"<=\",IF($B264<=GoalEntryData!$D$6,1,0),IF(GoalEntryData!$C$6=\">=\",IF($B264>=GoalEntryData!$D$6,1,0),\"\")))","v":""},"",null,null,null,{"$f":"IF($M264=\"\",\"\",IF(GoalEntryData!$C$10=\"<=\",IF($M264<=GoalEntryData!$D$10,1,0),IF(GoalEntryData!$C$10=\">=\",IF($M264>=GoalEntryData!$D$10,1,0),\"\")))","v":""},"",{"$f":"IF($M264=\"\",\"\",IF(GoalEntryData!$C$11=\"<=\",IF($M264<=GoalEntryData!$D$11,1,0),IF(GoalEntryData!$C$11=\">=\",IF($M264>=GoalEntryData!$D$11,1,0),\"\")))","v":""},"",{"$f":"IF($M264=\"\",\"\",IF(GoalEntryData!$C$12=\"<=\",IF($M264<=GoalEntryData!$D$12,1,0),IF(GoalEntryData!$C$10=\">=\",IF($M264>=GoalEntryData!$D$12,1,0),\"\")))","v":""},"",{"$f":"IF($M264=\"\",\"\",IF(GoalEntryData!$C$10=\"<=\",IF($M264<=GoalEntryData!$D$10,1,0),IF(GoalEntryData!$C$10=\">=\",IF($M264>=GoalEntryData!$D$10,1,0),\"\")))","v":""},""]
[null,null,null,{"$f":"IF($B265=\"\",\"\",IF(GoalEntryData!$C$6=\"<=\",IF($B265<=GoalEntryData!$D$6,1,0),IF(GoalEntryData!$C$6=\">=\",IF($B265>=GoalEntryData!$D$6,1,0),\"\")))","v":""},"",{"$f":"IF($B265=\"\",\"\",IF(GoalEntryData!$C$7=\"<=\",IF($B265<=GoalEntryData!$D$7,1,0),IF(GoalEntryData!$C$7=\">=\",IF($B265>=GoalEntryData!$D$7,1,0),\"\")))","v":""},"",{"$f":"IF($B265=\"\",\"\",IF(GoalEntryData!$C$8=\"<=\",IF($B265<=GoalEntryData!$D$8,1,0),IF(GoalEntryData!$C$8=\">=\",IF($B265>=GoalEntryData!$D$8,1,0),\"\")))","v":""},"",{"$f":"IF($B265=\"\",\"\",IF(GoalEntryData!$C$6=\"<=\",IF($B265<=GoalEntryData!$D$6,1,0),IF(GoalEntryData!$C$6=\">=\",IF($B265>=GoalEntryData!$D$6,1,0),\"\")))","v":""},"",null,null,null,{"$f":"IF($M265=\"\",\"\",IF(GoalEntryData!$C$10=\"<=\",IF($M265<=GoalEntryData!$D$10,1,0),IF(GoalEntryData!$C$10=\">=\",IF($M265>=GoalEntryData!$D$10,1,0),\"\")))","v":""},"",{"$f":"IF($M265=\"\",\"\",IF(GoalEntryData!$C$11=\"<=\",IF($M265<=GoalEntryData!$D$11,1,0),IF(GoalEntryData!$C$11=\">=\",IF($M265>=GoalEntryData!$D$11,1,0),\"\")))","v":""},"",{"$f":"IF($M265=\"\",\"\",IF(GoalEntryData!$C$12=\"<=\",IF($M265<=GoalEntryData!$D$12,1,0),IF(GoalEntryData!$C$10=\">=\",IF($M265>=GoalEntryData!$D$12,1,0),\"\")))","v":""},"",{"$f":"IF($M265=\"\",\"\",IF(GoalEntryData!$C$10=\"<=\",IF($M265<=GoalEntryData!$D$10,1,0),IF(GoalEntryData!$C$10=\">=\",IF($M265>=GoalEntryData!$D$10,1,0),\"\")))","v":""},""]
[null,null,null,{"$f":"IF($B266=\"\",\"\",IF(GoalEntryData!$C$6=\"<=\",IF($B266<=GoalEntryData!$D$6,1,0),IF(GoalEntryData!$C$6=\">=\",IF($B266>=GoalEntryData!$D$6,1,0),\"\")))","v":""},"",{"$f":"IF($B266=\"\",\"\",IF(GoalEntryData!$C$7=\"<=\",IF($B266<=GoalEntryData!$D$7,1,0),IF(GoalEntryData!$C$7=\">=\",IF($B266>=GoalEntryData!$D$7,1,0),\"\")))","v":""},"",{"$f":"IF($B266=\"\",\"\",IF(GoalEntryData!$C$8=\"<=\",IF($B266<=GoalEntryData!$D$8,1,0),IF(GoalEntryData!$C$8=\">=\",IF($B266>=GoalEntryData!$D$8,1,0),\"\")))","v":""},"",{"$f":"IF($B266=\"\",\"\",IF(GoalEntryData!$C$6=\"<=\",IF($B266<=GoalEntryData!$D$6,1,0),IF(GoalEntryData!$C$6=\">=\",IF($B266>=GoalEntryData!$D$6,1,0),\"\")))","v":""},"",null,null,null,{"$f":"IF($M266=\"\",\"\",IF(GoalEntryData!$C$10=\"<=\",IF($M266<=GoalEntryData!$D$10,1,0),IF(GoalEntryData!$C$10=\">=\",IF($M266>=GoalEntryData!$D$10,1,0),\"\")))","v":""},"",{"$f":"IF($M266=\"\",\"\",IF(GoalEntryData!$C$11=\"<=\",IF($M266<=GoalEntryData!$D$11,1,0),IF(GoalEntryData!$C$11=\">=\",IF($M266>=GoalEntryData!$D$11,1,0),\"\")))","v":""},"",{"$f":"IF($M266=\"\",\"\",IF(GoalEntryData!$C$12=\"<=\",IF($M266<=GoalEntryData!$D$12,1,0),IF(GoalEntryData!$C$10=\">=\",IF($M266>=GoalEntryData!$D$12,1,0),\"\")))","v":""},"",{"$f":"IF($M266=\"\",\"\",IF(GoalEntryData!$C$10=\"<=\",IF($M266<=GoalEntryData!$D$10,1,0),IF(GoalEntryData!$C$10=\">=\",IF($M266>=GoalEntryData!$D$10,1,0),\"\")))","v":""},""]
[null,null,null,{"$f":"IF($B267=\"\",\"\",IF(GoalEntryData!$C$6=\"<=\",IF($B267<=GoalEntryData!$D$6,1,0),IF(GoalEntryData!$C$6=\">=\",IF($B267>=GoalEntryData!$D$6,1,0),\"\")))","v":""},"",{"$f":"IF($B267=\"\",\"\",IF(GoalEntryData!$C$7=\"<=\",IF($B267<=GoalEntryData!$D$7,1,0),IF(GoalEntryData!$C$7=\">=\",IF($B267>=GoalEntryData!$D$7,1,0),\"\")))","v":""},"",{"$f":"IF($B267=\"\",\"\",IF(GoalEntryData!$C$8=\"<=\",IF($B267<=GoalEntryData!$D$8,1,0),IF(GoalEntryData!$C$8=\">=\",IF($B267>=GoalEntryData!$D$8,1,0),\"\")))","v":""},"",{"$f":"IF($B267=\"\",\"\",IF(GoalEntryData!$C$6=\"<=\",IF($B267<=GoalEntryData!$D$6,1,0),IF(GoalEntryData!$C$6=\">=\",IF($B267>=GoalEntryData!$D$6,1,0),\"\")))","v":""},"",null,null,null,{"$f":"IF($M267=\"\",\"\",IF(GoalEntryData!$C$10=\"<=\",IF($M267<=GoalEntryData!$D$10,1,0),IF(GoalEntryData!$C$10=\">=\",IF($M267>=GoalEntryData!$D$10,1,0),\"\")))","v":""},"",{"$f":"IF($M267=\"\",\"\",IF(GoalEntryData!$C$11=\"<=\",IF($M267<=GoalEntryData!$D$11,1,0),IF(GoalEntryData!$C$11=\">=\",IF($M267>=GoalEntryData!$D$11,1,0),\"\")))","v":""},"",{"$f":"IF($M267=\"\",\"\",IF(GoalEntryData!$C$12=\"<=\",IF($M267<=GoalEntryData!$D$12,1,0),IF(GoalEntryData!$C$10=\">=\",IF($M267>=GoalEntryData!$D$12,1,0),\"\")))","v":""},"",{"$f":"IF($M267=\"\",\"\",IF(GoalEntryData!$C$10=\"<=\",IF($M267<=GoalEntryData!$D$10,1,0),IF(GoalEntryData!$C$10=\">=\",IF($M267>=GoalEntryData!$D$10,1,0),\"\")))","v":""},""]
[null,null,null,{"$f":"IF($B268=\"\",\"\",IF(GoalEntryData!$C$6=\"<=\",IF($B268<=GoalEntryData!$D$6,1,0),IF(GoalEntryData!$C$6=\">=\",IF($B268>=GoalEntryData!$D$6,1,0),\"\")))","v":""},"",{"$f":"IF($B268=\"\",\"\",IF(GoalEntryData!$C$7=\"<=\",IF($B268<=GoalEntryData!$D$7,1,0),IF(GoalEntryData!$C$7=\">=\",IF($B268>=GoalEntryData!$D$7,1,0),\"\")))","v":""},"",{"$f":"IF($B268=\"\",\"\",IF(GoalEntryData!$C$8=\"<=\",IF($B268<=GoalEntryData!$D$8,1,0),IF(GoalEntryData!$C$8=\">=\",IF($B268>=GoalEntryData!$D$8,1,0),\"\")))","v":""},"",{"$f":"IF($B268=\"\",\"\",IF(GoalEntryData!$C$6=\"<=\",IF($B268<=GoalEntryData!$D$6,1,0),IF(GoalEntryData!$C$6=\">=\",IF($B268>=GoalEntryData!$D$6,1,0),\"\")))","v":""},"",null,null,null,{"$f":"IF($M268=\"\",\"\",IF(GoalEntryData!$C$10=\"<=\",IF($M268<=GoalEntryData!$D$10,1,0),IF(GoalEntryData!$C$10=\">=\",IF($M268>=GoalEntryData!$D$10,1,0),\"\")))","v":""},"",{"$f":"IF($M268=\"\",\"\",IF(GoalEntryData!$C$11=\"<=\",IF($M268<=GoalEntryData!$D$11,1,0),IF(GoalEntryData!$C$11=\">=\",IF($M268>=GoalEntryData!$D$11,1,0),\"\")))","v":""},"",{"$f":"IF($M268=\"\",\"\",IF(GoalEntryData!$C$12=\"<=\",IF($M268<=GoalEntryData!$D$12,1,0),IF(GoalEntryData!$C$10=\">=\",IF($M268>=GoalEntryData!$D$12,1,0),\"\")))","v":""},"",{"$f":"IF($M268=\"\",\"\",IF(GoalEntryData!$C$10=\"<=\",IF($M268<=GoalEntryData!$D$10,1,0),IF(GoalEntryData!$C$10=\">=\",IF($M268>=GoalEntryData!$D$10,1,0),\"\")))","v":""},""]
[null,null,null,{"$f":"IF($B269=\"\",\"\",IF(GoalEntryData!$C$6=\"<=\",IF($B269<=GoalEntryData!$D$6,1,0),IF(GoalEntryData!$C$6=\">=\",IF($B269>=GoalEntryData!$D$6,1,0),\"\")))","v":""},"",{"$f":"IF($B269=\"\",\"\",IF(GoalEntryData!$C$7=\"<=\",IF($B269<=GoalEntryData!$D$7,1,0),IF(GoalEntryData!$C$7=\">=\",IF($B269>=GoalEntryData!$D$7,1,0),\"\")))","v":""},"",{"$f":"IF($B269=\"\",\"\",IF(GoalEntryData!$C$8=\"<=\",IF($B269<=GoalEntryData!$D$8,1,0),IF(GoalEntryData!$C$8=\">=\",IF($B269>=GoalEntryData!$D$8,1,0),\"\")))","v":""},"",{"$f":"IF($B269=\"\",\"\",IF(GoalEntryData!$C$6=\"<=\",IF($B269<=GoalEntryData!$D$6,1,0),IF(GoalEntryData!$C$6=\">=\",IF($B269>=GoalEntryData!$D$6,1,0),\"\")))","v":""},"",null,null,null,{"$f":"IF($M269=\"\",\"\",IF(GoalEntryData!$C$10=\"<=\",IF($M269<=GoalEntryData!$D$10,1,0),IF(GoalEntryData!$C$10=\">=\",IF($M269>=GoalEntryData!$D$10,1,0),\"\")))","v":""},"",{"$f":"IF($M269=\"\",\"\",IF(GoalEntryData!$C$11=\"<=\",IF($M269<=GoalEntryData!$D$11,1,0),IF(GoalEntryData!$C$11=\">=\",IF($M269>=GoalEntryData!$D$11,1,0),\"\")))","v":""},"",{"$f":"IF($M269=\"\",\"\",IF(GoalEntryData!$C$12=\"<=\",IF($M269<=GoalEntryData!$D$12,1,0),IF(GoalEntryData!$C$10=\">=\",IF($M269>=GoalEntryData!$D$12,1,0),\"\")))","v":""},"",{"$f":"IF($M269=\"\",\"\",IF(GoalEntryData!$C$10=\"<=\",IF($M269<=GoalEntryData!$D$10,1,0),IF(GoalEntryData!$C$10=\">=\",IF($M269>=GoalEntryData!$D$10,1,0),\"\")))","v":""},""]
[null,null,null,{"$f":"IF($B270=\"\",\"\",IF(GoalEntryData!$C$6=\"<=\",IF($B270<=GoalEntryData!$D$6,1,0),IF(GoalEntryData!$C$6=\">=\",IF($B270>=GoalEntryData!$D$6,1,0),\"\")))","v":""},"",{"$f":"IF($B270=\"\",\"\",IF(GoalEntryData!$C$7=\"<=\",IF($B270<=GoalEntryData!$D$7,1,0),IF(GoalEntryData!$C$7=\">=\",IF($B270>=GoalEntryData!$D$7,1,0),\"\")))","v":""},"",{"$f":"IF($B270=\"\",\"\",IF(GoalEntryData!$C$8=\"<=\",IF($B270<=GoalEntryData!$D$8,1,0),IF(GoalEntryData!$C$8=\">=\",IF($B270>=GoalEntryData!$D$8,1,0),\"\")))","v":""},"",{"$f":"IF($B270=\"\",\"\",IF(GoalEntryData!$C$6=\"<=\",IF($B270<=GoalEntryData!$D$6,1,0),IF(GoalEntryData!$C$6=\">=\",IF($B270>=GoalEntryData!$D$6,1,0),\"\")))","v":""},"",null,null,null,{"$f":"IF($M270=\"\",\"\",IF(GoalEntryData!$C$10=\"<=\",IF($M270<=GoalEntryData!$D$10,1,0),IF(GoalEntryData!$C$10=\">=\",IF($M270>=GoalEntryData!$D$10,1,0),\"\")))","v":""},"",{"$f":"IF($M270=\"\",\"\",IF(GoalEntryData!$C$11=\"<=\",IF($M270<=GoalEntryData!$D$11,1,0),IF(GoalEntryData!$C$11=\">=\",IF($M270>=GoalEntryData!$D$11,1,0),\"\")))","v":""},"",{"$f":"IF($M270=\"\",\"\",IF(GoalEntryData!$C$12=\"<=\",IF($M270<=GoalEntryData!$D$12,1,0),IF(GoalEntryData!$C$10=\">=\",IF($M270>=GoalEntryData!$D$12,1,0),\"\")))","v":""},"",{"$f":"IF($M270=\"\",\"\",IF(GoalEntryData!$C$10=\"<=\",IF($M270<=GoalEntryData!$D$10,1,0),IF(GoalEntryData!$C$10=\">=\",IF($M270>=GoalEntryData!$D$10,1,0),\"\")))","v":""},""]
[null,null,null,{"$f":"IF($B271=\"\",\"\",IF(GoalEntryData!$C$6=\"<=\",IF($B271<=GoalEntryData!$D$6,1,0),IF(GoalEntryData!$C$6=\">=\",IF($B271>=GoalEntryData!$D$6,1,0),\"\")))","v":""},"",{"$f":"IF($B271=\"\",\"\",IF(GoalEntryData!$C$7=\"<=\",IF($B271<=GoalEntryData!$D$7,1,0),IF(GoalEntryData!$C$7=\">=\",IF($B271>=GoalEntryData!$D$7,1,0),\"\")))","v":""},"",{"$f":"IF($B271=\"\",\"\",IF(GoalEntryData!$C$8=\"<=\",IF($B271<=GoalEntryData!$D$8,1,0),IF(GoalEntryData!$C$8=\">=\",IF($B271>=GoalEntryData!$D$8,1,0),\"\")))","v":""},"",{"$f":"IF($B271=\"\",\"\",IF(GoalEntryData!$C$6=\"<=\",IF($B271<=GoalEntryData!$D$6,1,0),IF(GoalEntryData!$C$6=\">=\",IF($B271>=GoalEntryData!$D$6,1,0),\"\")))","v":""},"",null,null,null,{"$f":"IF($M271=\"\",\"\",IF(GoalEntryData!$C$10=\"<=\",IF($M271<=GoalEntryData!$D$10,1,0),IF(GoalEntryData!$C$10=\">=\",IF($M271>=GoalEntryData!$D$10,1,0),\"\")))","v":""},"",{"$f":"IF($M271=\"\",\"\",IF(GoalEntryData!$C$11=\"<=\",IF($M271<=GoalEntryData!$D$11,1,0),IF(GoalEntryData!$C$11=\">=\",IF($M271>=GoalEntryData!$D$11,1,0),\"\")))","v":""},"",{"$f":"IF($M271=\"\",\"\",IF(GoalEntryData!$C$12=\"<=\",IF($M271<=GoalEntryData!$D$12,1,0),IF(GoalEntryData!$C$10=\">=\",IF($M271>=GoalEntryData!$D$12,1,0),\"\")))","v":""},"",{"$f":"IF($M271=\"\",\"\",IF(GoalEntryData!$C$10=\"<=\",IF($M271<=GoalEntryData!$D$10,1,0),IF(GoalEntryData!$C$10=\">=\",IF($M271>=GoalEntryData!$D$10,1,0),\"\")))","v":""},""]
[null,null,null,{"$f":"IF($B272=\"\",\"\",IF(GoalEntryData!$C$6=\"<=\",IF($B272<=GoalEntryData!$D$6,1,0),IF(GoalEntryData!$C$6=\">=\",IF($B272>=GoalEntryData!$D$6,1,0),\"\")))","v":""},"",{"$f":"IF($B272=\"\",\"\",IF(GoalEntryData!$C$7=\"<=\",IF($B272<=GoalEntryData!$D$7,1,0),IF(GoalEntryData!$C$7=\">=\",IF($B272>=GoalEntryData!$D$7,1,0),\"\")))","v":""},"",{"$f":"IF($B272=\"\",\"\",IF(GoalEntryData!$C$8=\"<=\",IF($B272<=GoalEntryData!$D$8,1,0),IF(GoalEntryData!$C$8=\">=\",IF($B272>=GoalEntryData!$D$8,1,0),\"\")))","v":""},"",{"$f":"IF($B272=\"\",\"\",IF(GoalEntryData!$C$6=\"<=\",IF($B272<=GoalEntryData!$D$6,1,0),IF(GoalEntryData!$C$6=\">=\",IF($B272>=GoalEntryData!$D$6,1,0),\"\")))","v":""},"",null,null,null,{"$f":"IF($M272=\"\",\"\",IF(GoalEntryData!$C$10=\"<=\",IF($M272<=GoalEntryData!$D$10,1,0),IF(GoalEntryData!$C$10=\">=\",IF($M272>=GoalEntryData!$D$10,1,0),\"\")))","v":""},"",{"$f":"IF($M272=\"\",\"\",IF(GoalEntryData!$C$11=\"<=\",IF($M272<=GoalEntryData!$D$11,1,0),IF(GoalEntryData!$C$11=\">=\",IF($M272>=GoalEntryData!$D$11,1,0),\"\")))","v":""},"",{"$f":"IF($M272=\"\",\"\",IF(GoalEntryData!$C$12=\"<=\",IF($M272<=GoalEntryData!$D$12,1,0),IF(GoalEntryData!$C$10=\">=\",IF($M272>=GoalEntryData!$D$12,1,0),\"\")))","v":""},"",{"$f":"IF($M272=\"\",\"\",IF(GoalEntryData!$C$10=\"<=\",IF($M272<=GoalEntryData!$D$10,1,0),IF(GoalEntryData!$C$10=\">=\",IF($M272>=GoalEntryData!$D$10,1,0),\"\")))","v":""},""]
[null,null,null,{"$f":"IF($B273=\"\",\"\",IF(GoalEntryData!$C$6=\"<=\",IF($B273<=GoalEntryData!$D$6,1,0),IF(GoalEntryData!$C$6=\">=\",IF($B273>=GoalEntryData!$D$6,1,0),\"\")))","v":""},"",{"$f":"IF($B273=\"\",\"\",IF(GoalEntryData!$C$7=\"<=\",IF($B273<=GoalEntryData!$D$7,1,0),IF(GoalEntryData!$C$7=\">=\",IF($B273>=GoalEntryData!$D$7,1,0),\"\")))","v":""},"",{"$f":"IF($B273=\"\",\"\",IF(GoalEntryData!$C$8=\"<=\",IF($B273<=GoalEntryData!$D$8,1,0),IF(GoalEntryData!$C$8=\">=\",IF($B273>=GoalEntryData!$D$8,1,0),\"\")))","v":""},"",{"$f":"IF($B273=\"\",\"\",IF(GoalEntryData!$C$6=\"<=\",IF($B273<=GoalEntryData!$D$6,1,0),IF(GoalEntryData!$C$6=\">=\",IF($B273>=GoalEntryData!$D$6,1,0),\"\")))","v":""},"",null,null,null,{"$f":"IF($M273=\"\",\"\",IF(GoalEntryData!$C$10=\"<=\",IF($M273<=GoalEntryData!$D$10,1,0),IF(GoalEntryData!$C$10=\">=\",IF($M273>=GoalEntryData!$D$10,1,0),\"\")))","v":""},"",{"$f":"IF($M273=\"\",\"\",IF(GoalEntryData!$C$11=\"<=\",IF($M273<=GoalEntryData!$D$11,1,0),IF(GoalEntryData!$C$11=\">=\",IF($M273>=GoalEntryData!$D$11,1,0),\"\")))","v":""},"",{"$f":"IF($M273=\"\",\"\",IF(GoalEntryData!$C$12=\"<=\",IF($M273<=GoalEntryData!$D$12,1,0),IF(GoalEntryData!$C$10=\">=\",IF($M273>=GoalEntryData!$D$12,1,0),\"\")))","v":""},"",{"$f":"IF($M273=\"\",\"\",IF(GoalEntryData!$C$10=\"<=\",IF($M273<=GoalEntryData!$D$10,1,0),IF(GoalEntryData!$C$10=\">=\",IF($M273>=GoalEntryData!$D$10,1,0),\"\")))","v":""},""]
[null,null,null,{"$f":"IF($B274=\"\",\"\",IF(GoalEntryData!$C$6=\"<=\",IF($B274<=GoalEntryData!$D$6,1,0),IF(GoalEntryData!$C$6=\">=\",IF($B274>=GoalEntryData!$D$6,1,0),\"\")))","v":""},"",{"$f":"IF($B274=\"\",\"\",IF(GoalEntryData!$C$7=\"<=\",IF($B274<=GoalEntryData!$D$7,1,0),IF(GoalEntryData!$C$7=\">=\",IF($B274>=GoalEntryData!$D$7,1,0),\"\")))","v":""},"",{"$f":"IF($B274=\"\",\"\",IF(GoalEntryData!$C$8=\"<=\",IF($B274<=GoalEntryData!$D$8,1,0),IF(GoalEntryData!$C$8=\">=\",IF($B274>=GoalEntryData!$D$8,1,0),\"\")))","v":""},"",{"$f":"IF($B274=\"\",\"\",IF(GoalEntryData!$C$6=\"<=\",IF($B274<=GoalEntryData!$D$6,1,0),IF(GoalEntryData!$C$6=\">=\",IF($B274>=GoalEntryData!$D$6,1,0),\"\")))","v":""},"",null,null,null,{"$f":"IF($M274=\"\",\"\",IF(GoalEntryData!$C$10=\"<=\",IF($M274<=GoalEntryData!$D$10,1,0),IF(GoalEntryData!$C$10=\">=\",IF($M274>=GoalEntryData!$D$10,1,0),\"\")))","v":""},"",{"$f":"IF($M274=\"\",\"\",IF(GoalEntryData!$C$11=\"<=\",IF($M274<=GoalEntryData!$D$11,1,0),IF(GoalEntryData!$C$11=\">=\",IF($M274>=GoalEntryData!$D$11,1,0),\"\")))","v":""},"",{"$f":"IF($M274=\"\",\"\",IF(GoalEntryData!$C$12=\"<=\",IF($M274<=GoalEntryData!$D$12,1,0),IF(GoalEntryData!$C$10=\">=\",IF($M274>=GoalEntryData!$D$12,1,0),\"\")))","v":""},"",{"$f":"IF($M274=\"\",\"\",IF(GoalEntryData!$C$10=\"<=\",IF($M274<=GoalEntryData!$D$10,1,0),IF(GoalEntryData!$C$10=\">=\",IF($M274>=GoalEntryData!$D$10,1,0),\"\")))","v":""},""]
[null,null,null,{"$f":"IF($B275=\"\",\"\",IF(GoalEntryData!$C$6=\"<=\",IF($B275<=GoalEntryData!$D$6,1,0),IF(GoalEntryData!$C$6=\">=\",IF($B275>=GoalEntryData!$D$6,1,0),\"\")))","v":""},"",{"$f":"IF($B275=\"\",\"\",IF(GoalEntryData!$C$7=\"<=\",IF($B275<=GoalEntryData!$D$7,1,0),IF(GoalEntryData!$C$7=\">=\",IF($B275>=GoalEntryData!$D$7,1,0),\"\")))","v":""},"",{"$f":"IF($B275=\"\",\"\",IF(GoalEntryData!$C$8=\"<=\",IF($B275<=GoalEntryData!$D$8,1,0),IF(GoalEntryData!$C$8=\">=\",IF($B275>=GoalEntryData!$D$8,1,0),\"\")))","v":""},"",{"$f":"IF($B275=\"\",\"\",IF(GoalEntryData!$C$6=\"<=\",IF($B275<=GoalEntryData!$D$6,1,0),IF(GoalEntryData!$C$6=\">=\",IF($B275>=GoalEntryData!$D$6,1,0),\"\")))","v":""},"",null,null,null,{"$f":"IF($M275=\"\",\"\",IF(GoalEntryData!$C$10=\"<=\",IF($M275<=GoalEntryData!$D$10,1,0),IF(GoalEntryData!$C$10=\">=\",IF($M275>=GoalEntryData!$D$10,1,0),\"\")))","v":""},"",{"$f":"IF($M275=\"\",\"\",IF(GoalEntryData!$C$11=\"<=\",IF($M275<=GoalEntryData!$D$11,1,0),IF(GoalEntryData!$C$11=\">=\",IF($M275>=GoalEntryData!$D$11,1,0),\"\")))","v":""},"",{"$f":"IF($M275=\"\",\"\",IF(GoalEntryData!$C$12=\"<=\",IF($M275<=GoalEntryData!$D$12,1,0),IF(GoalEntryData!$C$10=\">=\",IF($M275>=GoalEntryData!$D$12,1,0),\"\")))","v":""},"",{"$f":"IF($M275=\"\",\"\",IF(GoalEntryData!$C$10=\"<=\",IF($M275<=GoalEntryData!$D$10,1,0),IF(GoalEntryData!$C$10=\">=\",IF($M275>=GoalEntryData!$D$10,1,0),\"\")))","v":""},""]
[null,null,null,{"$f":"IF($B276=\"\",\"\",IF(GoalEntryData!$C$6=\"<=\",IF($B276<=GoalEntryData!$D$6,1,0),IF(GoalEntryData!$C$6=\">=\",IF($B276>=GoalEntryData!$D$6,1,0),\"\")))","v":""},"",{"$f":"IF($B276=\"\",\"\",IF(GoalEntryData!$C$7=\"<=\",IF($B276<=GoalEntryData!$D$7,1,0),IF(GoalEntryData!$C$7=\">=\",IF($B276>=GoalEntryData!$D$7,1,0),\"\")))","v":""},"",{"$f":"IF($B276=\"\",\"\",IF(GoalEntryData!$C$8=\"<=\",IF($B276<=GoalEntryData!$D$8,1,0),IF(GoalEntryData!$C$8=\">=\",IF($B276>=GoalEntryData!$D$8,1,0),\"\")))","v":""},"",{"$f":"IF($B276=\"\",\"\",IF(GoalEntryData!$C$6=\"<=\",IF($B276<=GoalEntryData!$D$6,1,0),IF(GoalEntryData!$C$6=\">=\",IF($B276>=GoalEntryData!$D$6,1,0),\"\")))","v":""},"",null,null,null,{"$f":"IF($M276=\"\",\"\",IF(GoalEntryData!$C$10=\"<=\",IF($M276<=GoalEntryData!$D$10,1,0),IF(GoalEntryData!$C$10=\">=\",IF($M276>=GoalEntryData!$D$10,1,0),\"\")))","v":""},"",{"$f":"IF($M276=\"\",\"\",IF(GoalEntryData!$C$11=\"<=\",IF($M276<=GoalEntryData!$D$11,1,0),IF(GoalEntryData!$C$11=\">=\",IF($M276>=GoalEntryData!$D$11,1,0),\"\")))","v":""},"",{"$f":"IF($M276=\"\",\"\",IF(GoalEntryData!$C$12=\"<=\",IF($M276<=GoalEntryData!$D$12,1,0),IF(GoalEntryData!$C$10=\">=\",IF($M276>=GoalEntryData!$D$12,1,0),\"\")))","v":""},"",{"$f":"IF($M276=\"\",\"\",IF(GoalEntryData!$C$10=\"<=\",IF($M276<=GoalEntryData!$D$10,1,0),IF(GoalEntryData!$C$10=\">=\",IF($M276>=GoalEntryData!$D$10,1,0),\"\")))","v":""},""]
[null,null,null,{"$f":"IF($B277=\"\",\"\",IF(GoalEntryData!$C$6=\"<=\",IF($B277<=GoalEntryData!$D$6,1,0),IF(GoalEntryData!$C$6=\">=\",IF($B277>=GoalEntryData!$D$6,1,0),\"\")))","v":""},"",{"$f":"IF($B277=\"\",\"\",IF(GoalEntryData!$C$7=\"<=\",IF($B277<=GoalEntryData!$D$7,1,0),IF(GoalEntryData!$C$7=\">=\",IF($B277>=GoalEntryData!$D$7,1,0),\"\")))","v":""},"",{"$f":"IF($B277=\"\",\"\",IF(GoalEntryData!$C$8=\"<=\",IF($B277<=GoalEntryData!$D$8,1,0),IF(GoalEntryData!$C$8=\">=\",IF($B277>=GoalEntryData!$D$8,1,0),\"\")))","v":""},"",{"$f":"IF($B277=\"\",\"\",IF(GoalEntryData!$C$6=\"<=\",IF($B277<=GoalEntryData!$D$6,1,0),IF(GoalEntryData!$C$6=\">=\",IF($B277>=GoalEntryData!$D$6,1,0),\"\")))","v":""},"",null,null,null,{"$f":"IF($M277=\"\",\"\",IF(GoalEntryData!$C$10=\"<=\",IF($M277<=GoalEntryData!$D$10,1,0),IF(GoalEntryData!$C$10=\">=\",IF($M277>=GoalEntryData!$D$10,1,0),\"\")))","v":""},"",{"$f":"IF($M277=\"\",\"\",IF(GoalEntryData!$C$11=\"<=\",IF($M277<=GoalEntryData!$D$11,1,0),IF(GoalEntryData!$C$11=\">=\",IF($M277>=GoalEntryData!$D$11,1,0),\"\")))","v":""},"",{"$f":"IF($M277=\"\",\"\",IF(GoalEntryData!$C$12=\"<=\",IF($M277<=GoalEntryData!$D$12,1,0),IF(GoalEntryData!$C$10=\">=\",IF($M277>=GoalEntryData!$D$12,1,0),\"\")))","v":""},"",{"$f":"IF($M277=\"\",\"\",IF(GoalEntryData!$C$10=\"<=\",IF($M277<=GoalEntryData!$D$10,1,0),IF(GoalEntryData!$C$10=\">=\",IF($M277>=GoalEntryData!$D$10,1,0),\"\")))","v":""},""]
[null,null,null,{"$f":"IF($B278=\"\",\"\",IF(GoalEntryData!$C$6=\"<=\",IF($B278<=GoalEntryData!$D$6,1,0),IF(GoalEntryData!$C$6=\">=\",IF($B278>=GoalEntryData!$D$6,1,0),\"\")))","v":""},"",{"$f":"IF($B278=\"\",\"\",IF(GoalEntryData!$C$7=\"<=\",IF($B278<=GoalEntryData!$D$7,1,0),IF(GoalEntryData!$C$7=\">=\",IF($B278>=GoalEntryData!$D$7,1,0),\"\")))","v":""},"",{"$f":"IF($B278=\"\",\"\",IF(GoalEntryData!$C$8=\"<=\",IF($B278<=GoalEntryData!$D$8,1,0),IF(GoalEntryData!$C$8=\">=\",IF($B278>=GoalEntryData!$D$8,1,0),\"\")))","v":""},"",{"$f":"IF($B278=\"\",\"\",IF(GoalEntryData!$C$6=\"<=\",IF($B278<=GoalEntryData!$D$6,1,0),IF(GoalEntryData!$C$6=\">=\",IF($B278>=GoalEntryData!$D$6,1,0),\"\")))","v":""},"",null,null,null,{"$f":"IF($M278=\"\",\"\",IF(GoalEntryData!$C$10=\"<=\",IF($M278<=GoalEntryData!$D$10,1,0),IF(GoalEntryData!$C$10=\">=\",IF($M278>=GoalEntryData!$D$10,1,0),\"\")))","v":""},"",{"$f":"IF($M278=\"\",\"\",IF(GoalEntryData!$C$11=\"<=\",IF($M278<=GoalEntryData!$D$11,1,0),IF(GoalEntryData!$C$11=\">=\",IF($M278>=GoalEntryData!$D$11,1,0),\"\")))","v":""},"",{"$f":"IF($M278=\"\",\"\",IF(GoalEntryData!$C$12=\"<=\",IF($M278<=GoalEntryData!$D$12,1,0),IF(GoalEntryData!$C$10=\">=\",IF($M278>=GoalEntryData!$D$12,1,0),\"\")))","v":""},"",{"$f":"IF($M278=\"\",\"\",IF(GoalEntryData!$C$10=\"<=\",IF($M278<=GoalEntryData!$D$10,1,0),IF(GoalEntryData!$C$10=\">=\",IF($M278>=GoalEntryData!$D$10,1,0),\"\")))","v":""},""]
[null,null,null,{"$f":"IF($B279=\"\",\"\",IF(GoalEntryData!$C$6=\"<=\",IF($B279<=GoalEntryData!$D$6,1,0),IF(GoalEntryData!$C$6=\">=\",IF($B279>=GoalEntryData!$D$6,1,0),\"\")))","v":""},"",{"$f":"IF($B279=\"\",\"\",IF(GoalEntryData!$C$7=\"<=\",IF($B279<=GoalEntryData!$D$7,1,0),IF(GoalEntryData!$C$7=\">=\",IF($B279>=GoalEntryData!$D$7,1,0),\"\")))","v":""},"",{"$f":"IF($B279=\"\",\"\",IF(GoalEntryData!$C$8=\"<=\",IF($B279<=GoalEntryData!$D$8,1,0),IF(GoalEntryData!$C$8=\">=\",IF($B279>=GoalEntryData!$D$8,1,0),\"\")))","v":""},"",{"$f":"IF($B279=\"\",\"\",IF(GoalEntryData!$C$6=\"<=\",IF($B279<=GoalEntryData!$D$6,1,0),IF(GoalEntryData!$C$6=\">=\",IF($B279>=GoalEntryData!$D$6,1,0),\"\")))","v":""},"",null,null,null,{"$f":"IF($M279=\"\",\"\",IF(GoalEntryData!$C$10=\"<=\",IF($M279<=GoalEntryData!$D$10,1,0),IF(GoalEntryData!$C$10=\">=\",IF($M279>=GoalEntryData!$D$10,1,0),\"\")))","v":""},"",{"$f":"IF($M279=\"\",\"\",IF(GoalEntryData!$C$11=\"<=\",IF($M279<=GoalEntryData!$D$11,1,0),IF(GoalEntryData!$C$11=\">=\",IF($M279>=GoalEntryData!$D$11,1,0),\"\")))","v":""},"",{"$f":"IF($M279=\"\",\"\",IF(GoalEntryData!$C$12=\"<=\",IF($M279<=GoalEntryData!$D$12,1,0),IF(GoalEntryData!$C$10=\">=\",IF($M279>=GoalEntryData!$D$12,1,0),\"\")))","v":""},"",{"$f":"IF($M279=\"\",\"\",IF(GoalEntryData!$C$10=\"<=\",IF($M279<=GoalEntryData!$D$10,1,0),IF(GoalEntryData!$C$10=\">=\",IF($M279>=GoalEntryData!$D$10,1,0),\"\")))","v":""},""]
[null,null,null,{"$f":"IF($B280=\"\",\"\",IF(GoalEntryData!$C$6=\"<=\",IF($B280<=GoalEntryData!$D$6,1,0),IF(GoalEntryData!$C$6=\">=\",IF($B280>=GoalEntryData!$D$6,1,0),\"\")))","v":""},"",{"$f":"IF($B280=\"\",\"\",IF(GoalEntryData!$C$7=\"<=\",IF($B280<=GoalEntryData!$D$7,1,0),IF(GoalEntryData!$C$7=\">=\",IF($B280>=GoalEntryData!$D$7,1,0),\"\")))","v":""},"",{"$f":"IF($B280=\"\",\"\",IF(GoalEntryData!$C$8=\"<=\",IF($B280<=GoalEntryData!$D$8,1,0),IF(GoalEntryData!$C$8=\">=\",IF($B280>=GoalEntryData!$D$8,1,0),\"\")))","v":""},"",{"$f":"IF($B280=\"\",\"\",IF(GoalEntryData!$C$6=\"<=\",IF($B280<=GoalEntryData!$D$6,1,0),IF(GoalEntryData!$C$6=\">=\",IF($B280>=GoalEntryData!$D$6,1,0),\"\")))","v":""},"",null,null,null,{"$f":"IF($M280=\"\",\"\",IF(GoalEntryData!$C$10=\"<=\",IF($M280<=GoalEntryData!$D$10,1,0),IF(GoalEntryData!$C$10=\">=\",IF($M280>=GoalEntryData!$D$10,1,0),\"\")))","v":""},"",{"$f":"IF($M280=\"\",\"\",IF(GoalEntryData!$C$11=\"<=\",IF($M280<=GoalEntryData!$D$11,1,0),IF(GoalEntryData!$C$11=\">=\",IF($M280>=GoalEntryData!$D$11,1,0),\"\")))","v":""},"",{"$f":"IF($M280=\"\",\"\",IF(GoalEntryData!$C$12=\"<=\",IF($M280<=GoalEntryData!$D$12,1,0),IF(GoalEntryData!$C$10=\">=\",IF($M280>=GoalEntryData!$D$12,1,0),\"\")))","v":""},"",{"$f":"IF($M280=\"\",\"\",IF(GoalEntryData!$C$10=\"<=\",IF($M280<=GoalEntryData!$D$10,1,0),IF(GoalEntryData!$C$10=\">=\",IF($M280>=GoalEntryData!$D$10,1,0),\"\")))","v":""},""]
[null,null,null,{"$f":"IF($B281=\"\",\"\",IF(GoalEntryData!$C$6=\"<=\",IF($B281<=GoalEntryData!$D$6,1,0),IF(GoalEntryData!$C$6=\">=\",IF($B281>=GoalEntryData!$D$6,1,0),\"\")))","v":""},"",{"$f":"IF($B281=\"\",\"\",IF(GoalEntryData!$C$7=\"<=\",IF($B281<=GoalEntryData!$D$7,1,0),IF(GoalEntryData!$C$7=\">=\",IF($B281>=GoalEntryData!$D$7,1,0),\"\")))","v":""},"",{"$f":"IF($B281=\"\",\"\",IF(GoalEntryData!$C$8=\"<=\",IF($B281<=GoalEntryData!$D$8,1,0),IF(GoalEntryData!$C$8=\">=\",IF($B281>=GoalEntryData!$D$8,1,0),\"\")))","v":""},"",{"$f":"IF($B281=\"\",\"\",IF(GoalEntryData!$C$6=\"<=\",IF($B281<=GoalEntryData!$D$6,1,0),IF(GoalEntryData!$C$6=\">=\",IF($B281>=GoalEntryData!$D$6,1,0),\"\")))","v":""},"",null,null,null,{"$f":"IF($M281=\"\",\"\",IF(GoalEntryData!$C$10=\"<=\",IF($M281<=GoalEntryData!$D$10,1,0),IF(GoalEntryData!$C$10=\">=\",IF($M281>=GoalEntryData!$D$10,1,0),\"\")))","v":""},"",{"$f":"IF($M281=\"\",\"\",IF(GoalEntryData!$C$11=\"<=\",IF($M281<=GoalEntryData!$D$11,1,0),IF(GoalEntryData!$C$11=\">=\",IF($M281>=GoalEntryData!$D$11,1,0),\"\")))","v":""},"",{"$f":"IF($M281=\"\",\"\",IF(GoalEntryData!$C$12=\"<=\",IF($M281<=GoalEntryData!$D$12,1,0),IF(GoalEntryData!$C$10=\">=\",IF($M281>=GoalEntryData!$D$12,1,0),\"\")))","v":""},"",{"$f":"IF($M281=\"\",\"\",IF(GoalEntryData!$C$10=\"<=\",IF($M281<=GoalEntryData!$D$10,1,0),IF(GoalEntryData!$C$10=\">=\",IF($M281>=GoalEntryData!$D$10,1,0),\"\")))","v":""},""]
[null,null,null,{"$f":"IF($B282=\"\",\"\",IF(GoalEntryData!$C$6=\"<=\",IF($B282<=GoalEntryData!$D$6,1,0),IF(GoalEntryData!$C$6=\">=\",IF($B282>=GoalEntryData!$D$6,1,0),\"\")))","v":""},"",{"$f":"IF($B282=\"\",\"\",IF(GoalEntryData!$C$7=\"<=\",IF($B282<=GoalEntryData!$D$7,1,0),IF(GoalEntryData!$C$7=\">=\",IF($B282>=GoalEntryData!$D$7,1,0),\"\")))","v":""},"",{"$f":"IF($B282=\"\",\"\",IF(GoalEntryData!$C$8=\"<=\",IF($B282<=GoalEntryData!$D$8,1,0),IF(GoalEntryData!$C$8=\">=\",IF($B282>=GoalEntryData!$D$8,1,0),\"\")))","v":""},"",{"$f":"IF($B282=\"\",\"\",IF(GoalEntryData!$C$6=\"<=\",IF($B282<=GoalEntryData!$D$6,1,0),IF(GoalEntryData!$C$6=\">=\",IF($B282>=GoalEntryData!$D$6,1,0),\"\")))","v":""},"",null,null,null,{"$f":"IF($M282=\"\",\"\",IF(GoalEntryData!$C$10=\"<=\",IF($M282<=GoalEntryData!$D$10,1,0),IF(GoalEntryData!$C$10=\">=\",IF($M282>=GoalEntryData!$D$10,1,0),\"\")))","v":""},"",{"$f":"IF($M282=\"\",\"\",IF(GoalEntryData!$C$11=\"<=\",IF($M282<=GoalEntryData!$D$11,1,0),IF(GoalEntryData!$C$11=\">=\",IF($M282>=GoalEntryData!$D$11,1,0),\"\")))","v":""},"",{"$f":"IF($M282=\"\",\"\",IF(GoalEntryData!$C$12=\"<=\",IF($M282<=GoalEntryData!$D$12,1,0),IF(GoalEntryData!$C$10=\">=\",IF($M282>=GoalEntryData!$D$12,1,0),\"\")))","v":""},"",{"$f":"IF($M282=\"\",\"\",IF(GoalEntryData!$C$10=\"<=\",IF($M282<=GoalEntryData!$D$10,1,0),IF(GoalEntryData!$C$10=\">=\",IF($M282>=GoalEntryData!$D$10,1,0),\"\")))","v":""},""]
[null,null,null,{"$f":"IF($B283=\"\",\"\",IF(GoalEntryData!$C$6=\"<=\",IF($B283<=GoalEntryData!$D$6,1,0),IF(GoalEntryData!$C$6=\">=\",IF($B283>=GoalEntryData!$D$6,1,0),\"\")))","v":""},"",{"$f":"IF($B283=\"\",\"\",IF(GoalEntryData!$C$7=\"<=\",IF($B283<=GoalEntryData!$D$7,1,0),IF(GoalEntryData!$C$7=\">=\",IF($B283>=GoalEntryData!$D$7,1,0),\"\")))","v":""},"",{"$f":"IF($B283=\"\",\"\",IF(GoalEntryData!$C$8=\"<=\",IF($B283<=GoalEntryData!$D$8,1,0),IF(GoalEntryData!$C$8=\">=\",IF($B283>=GoalEntryData!$D$8,1,0),\"\")))","v":""},"",{"$f":"IF($B283=\"\",\"\",IF(GoalEntryData!$C$6=\"<=\",IF($B283<=GoalEntryData!$D$6,1,0),IF(GoalEntryData!$C$6=\">=\",IF($B283>=GoalEntryData!$D$6,1,0),\"\")))","v":""},"",null,null,null,{"$f":"IF($M283=\"\",\"\",IF(GoalEntryData!$C$10=\"<=\",IF($M283<=GoalEntryData!$D$10,1,0),IF(GoalEntryData!$C$10=\">=\",IF($M283>=GoalEntryData!$D$10,1,0),\"\")))","v":""},"",{"$f":"IF($M283=\"\",\"\",IF(GoalEntryData!$C$11=\"<=\",IF($M283<=GoalEntryData!$D$11,1,0),IF(GoalEntryData!$C$11=\">=\",IF($M283>=GoalEntryData!$D$11,1,0),\"\")))","v":""},"",{"$f":"IF($M283=\"\",\"\",IF(GoalEntryData!$C$12=\"<=\",IF($M283<=GoalEntryData!$D$12,1,0),IF(GoalEntryData!$C$10=\">=\",IF($M283>=GoalEntryData!$D$12,1,0),\"\")))","v":""},"",{"$f":"IF($M283=\"\",\"\",IF(GoalEntryData!$C$10=\"<=\",IF($M283<=GoalEntryData!$D$10,1,0),IF(GoalEntryData!$C$10=\">=\",IF($M283>=GoalEntryData!$D$10,1,0),\"\")))","v":""},""]
[null,null,null,{"$f":"IF($B284=\"\",\"\",IF(GoalEntryData!$C$6=\"<=\",IF($B284<=GoalEntryData!$D$6,1,0),IF(GoalEntryData!$C$6=\">=\",IF($B284>=GoalEntryData!$D$6,1,0),\"\")))","v":""},"",{"$f":"IF($B284=\"\",\"\",IF(GoalEntryData!$C$7=\"<=\",IF($B284<=GoalEntryData!$D$7,1,0),IF(GoalEntryData!$C$7=\">=\",IF($B284>=GoalEntryData!$D$7,1,0),\"\")))","v":""},"",{"$f":"IF($B284=\"\",\"\",IF(GoalEntryData!$C$8=\"<=\",IF($B284<=GoalEntryData!$D$8,1,0),IF(GoalEntryData!$C$8=\">=\",IF($B284>=GoalEntryData!$D$8,1,0),\"\")))","v":""},"",{"$f":"IF($B284=\"\",\"\",IF(GoalEntryData!$C$6=\"<=\",IF($B284<=GoalEntryData!$D$6,1,0),IF(GoalEntryData!$C$6=\">=\",IF($B284>=GoalEntryData!$D$6,1,0),\"\")))","v":""},"",null,null,null,{"$f":"IF($M284=\"\",\"\",IF(GoalEntryData!$C$10=\"<=\",IF($M284<=GoalEntryData!$D$10,1,0),IF(GoalEntryData!$C$10=\">=\",IF($M284>=GoalEntryData!$D$10,1,0),\"\")))","v":""},"",{"$f":"IF($M284=\"\",\"\",IF(GoalEntryData!$C$11=\"<=\",IF($M284<=GoalEntryData!$D$11,1,0),IF(GoalEntryData!$C$11=\">=\",IF($M284>=GoalEntryData!$D$11,1,0),\"\")))","v":""},"",{"$f":"IF($M284=\"\",\"\",IF(GoalEntryData!$C$12=\"<=\",IF($M284<=GoalEntryData!$D$12,1,0),IF(GoalEntryData!$C$10=\">=\",IF($M284>=GoalEntryData!$D$12,1,0),\"\")))","v":""},"",{"$f":"IF($M284=\"\",\"\",IF(GoalEntryData!$C$10=\"<=\",IF($M284<=GoalEntryData!$D$10,1,0),IF(GoalEntryData!$C$10=\">=\",IF($M284>=GoalEntryData!$D$10,1,0),\"\")))","v":""},""]
[null,null,null,{"$f":"IF($B285=\"\",\"\",IF(GoalEntryData!$C$6=\"<=\",IF($B285<=GoalEntryData!$D$6,1,0),IF(GoalEntryData!$C$6=\">=\",IF($B285>=GoalEntryData!$D$6,1,0),\"\")))","v":""},"",{"$f":"IF($B285=\"\",\"\",IF(GoalEntryData!$C$7=\"<=\",IF($B285<=GoalEntryData!$D$7,1,0),IF(GoalEntryData!$C$7=\">=\",IF($B285>=GoalEntryData!$D$7,1,0),\"\")))","v":""},"",{"$f":"IF($B285=\"\",\"\",IF(GoalEntryData!$C$8=\"<=\",IF($B285<=GoalEntryData!$D$8,1,0),IF(GoalEntryData!$C$8=\">=\",IF($B285>=GoalEntryData!$D$8,1,0),\"\")))","v":""},"",{"$f":"IF($B285=\"\",\"\",IF(GoalEntryData!$C$6=\"<=\",IF($B285<=GoalEntryData!$D$6,1,0),IF(GoalEntryData!$C$6=\">=\",IF($B285>=GoalEntryData!$D$6,1,0),\"\")))","v":""},"",null,null,null,{"$f":"IF($M285=\"\",\"\",IF(GoalEntryData!$C$10=\"<=\",IF($M285<=GoalEntryData!$D$10,1,0),IF(GoalEntryData!$C$10=\">=\",IF($M285>=GoalEntryData!$D$10,1,0),\"\")))","v":""},"",{"$f":"IF($M285=\"\",\"\",IF(GoalEntryData!$C$11=\"<=\",IF($M285<=GoalEntryData!$D$11,1,0),IF(GoalEntryData!$C$11=\">=\",IF($M285>=GoalEntryData!$D$11,1,0),\"\")))","v":""},"",{"$f":"IF($M285=\"\",\"\",IF(GoalEntryData!$C$12=\"<=\",IF($M285<=GoalEntryData!$D$12,1,0),IF(GoalEntryData!$C$10=\">=\",IF($M285>=GoalEntryData!$D$12,1,0),\"\")))","v":""},"",{"$f":"IF($M285=\"\",\"\",IF(GoalEntryData!$C$10=\"<=\",IF($M285<=GoalEntryData!$D$10,1,0),IF(GoalEntryData!$C$10=\">=\",IF($M285>=GoalEntryData!$D$10,1,0),\"\")))","v":""},""]
[null,null,null,{"$f":"IF($B286=\"\",\"\",IF(GoalEntryData!$C$6=\"<=\",IF($B286<=GoalEntryData!$D$6,1,0),IF(GoalEntryData!$C$6=\">=\",IF($B286>=GoalEntryData!$D$6,1,0),\"\")))","v":""},"",{"$f":"IF($B286=\"\",\"\",IF(GoalEntryData!$C$7=\"<=\",IF($B286<=GoalEntryData!$D$7,1,0),IF(GoalEntryData!$C$7=\">=\",IF($B286>=GoalEntryData!$D$7,1,0),\"\")))","v":""},"",{"$f":"IF($B286=\"\",\"\",IF(GoalEntryData!$C$8=\"<=\",IF($B286<=GoalEntryData!$D$8,1,0),IF(GoalEntryData!$C$8=\">=\",IF($B286>=GoalEntryData!$D$8,1,0),\"\")))","v":""},"",{"$f":"IF($B286=\"\",\"\",IF(GoalEntryData!$C$6=\"<=\",IF($B286<=GoalEntryData!$D$6,1,0),IF(GoalEntryData!$C$6=\">=\",IF($B286>=GoalEntryData!$D$6,1,0),\"\")))","v":""},"",null,null,null,{"$f":"IF($M286=\"\",\"\",IF(GoalEntryData!$C$10=\"<=\",IF($M286<=GoalEntryData!$D$10,1,0),IF(GoalEntryData!$C$10=\">=\",IF($M286>=GoalEntryData!$D$10,1,0),\"\")))","v":""},"",{"$f":"IF($M286=\"\",\"\",IF(GoalEntryData!$C$11=\"<=\",IF($M286<=GoalEntryData!$D$11,1,0),IF(GoalEntryData!$C$11=\">=\",IF($M286>=GoalEntryData!$D$11,1,0),\"\")))","v":""},"",{"$f":"IF($M286=\"\",\"\",IF(GoalEntryData!$C$12=\"<=\",IF($M286<=GoalEntryData!$D$12,1,0),IF(GoalEntryData!$C$10=\">=\",IF($M286>=GoalEntryData!$D$12,1,0),\"\")))","v":""},"",{"$f":"IF($M286=\"\",\"\",IF(GoalEntryData!$C$10=\"<=\",IF($M286<=GoalEntryData!$D$10,1,0),IF(GoalEntryData!$C$10=\">=\",IF($M286>=GoalEntryData!$D$10,1,0),\"\")))","v":""},""]
[null,null,null,{"$f":"IF($B287=\"\",\"\",IF(GoalEntryData!$C$6=\"<=\",IF($B287<=GoalEntryData!$D$6,1,0),IF(GoalEntryData!$C$6=\">=\",IF($B287>=GoalEntryData!$D$6,1,0),\"\")))","v":""},"",{"$f":"IF($B287=\"\",\"\",IF(GoalEntryData!$C$7=\"<=\",IF($B287<=GoalEntryData!$D$7,1,0),IF(GoalEntryData!$C$7=\">=\",IF($B287>=GoalEntryData!$D$7,1,0),\"\")))","v":""},"",{"$f":"IF($B287=\"\",\"\",IF(GoalEntryData!$C$8=\"<=\",IF($B287<=GoalEntryData!$D$8,1,0),IF(GoalEntryData!$C$8=\">=\",IF($B287>=GoalEntryData!$D$8,1,0),\"\")))","v":""},"",{"$f":"IF($B287=\"\",\"\",IF(GoalEntryData!$C$6=\"<=\",IF($B287<=GoalEntryData!$D$6,1,0),IF(GoalEntryData!$C$6=\">=\",IF($B287>=GoalEntryData!$D$6,1,0),\"\")))","v":""},"",null,null,null,{"$f":"IF($M287=\"\",\"\",IF(GoalEntryData!$C$10=\"<=\",IF($M287<=GoalEntryData!$D$10,1,0),IF(GoalEntryData!$C$10=\">=\",IF($M287>=GoalEntryData!$D$10,1,0),\"\")))","v":""},"",{"$f":"IF($M287=\"\",\"\",IF(GoalEntryData!$C$11=\"<=\",IF($M287<=GoalEntryData!$D$11,1,0),IF(GoalEntryData!$C$11=\">=\",IF($M287>=GoalEntryData!$D$11,1,0),\"\")))","v":""},"",{"$f":"IF($M287=\"\",\"\",IF(GoalEntryData!$C$12=\"<=\",IF($M287<=GoalEntryData!$D$12,1,0),IF(GoalEntryData!$C$10=\">=\",IF($M287>=GoalEntryData!$D$12,1,0),\"\")))","v":""},"",{"$f":"IF($M287=\"\",\"\",IF(GoalEntryData!$C$10=\"<=\",IF($M287<=GoalEntryData!$D$10,1,0),IF(GoalEntryData!$C$10=\">=\",IF($M287>=GoalEntryData!$D$10,1,0),\"\")))","v":""},""]
[null,null,null,{"$f":"IF($B288=\"\",\"\",IF(GoalEntryData!$C$6=\"<=\",IF($B288<=GoalEntryData!$D$6,1,0),IF(GoalEntryData!$C$6=\">=\",IF($B288>=GoalEntryData!$D$6,1,0),\"\")))","v":""},"",{"$f":"IF($B288=\"\",\"\",IF(GoalEntryData!$C$7=\"<=\",IF($B288<=GoalEntryData!$D$7,1,0),IF(GoalEntryData!$C$7=\">=\",IF($B288>=GoalEntryData!$D$7,1,0),\"\")))","v":""},"",{"$f":"IF($B288=\"\",\"\",IF(GoalEntryData!$C$8=\"<=\",IF($B288<=GoalEntryData!$D$8,1,0),IF(GoalEntryData!$C$8=\">=\",IF($B288>=GoalEntryData!$D$8,1,0),\"\")))","v":""},"",{"$f":"IF($B288=\"\",\"\",IF(GoalEntryData!$C$6=\"<=\",IF($B288<=GoalEntryData!$D$6,1,0),IF(GoalEntryData!$C$6=\">=\",IF($B288>=GoalEntryData!$D$6,1,0),\"\")))","v":""},"",null,null,null,{"$f":"IF($M288=\"\",\"\",IF(GoalEntryData!$C$10=\"<=\",IF($M288<=GoalEntryData!$D$10,1,0),IF(GoalEntryData!$C$10=\">=\",IF($M288>=GoalEntryData!$D$10,1,0),\"\")))","v":""},"",{"$f":"IF($M288=\"\",\"\",IF(GoalEntryData!$C$11=\"<=\",IF($M288<=GoalEntryData!$D$11,1,0),IF(GoalEntryData!$C$11=\">=\",IF($M288>=GoalEntryData!$D$11,1,0),\"\")))","v":""},"",{"$f":"IF($M288=\"\",\"\",IF(GoalEntryData!$C$12=\"<=\",IF($M288<=GoalEntryData!$D$12,1,0),IF(GoalEntryData!$C$10=\">=\",IF($M288>=GoalEntryData!$D$12,1,0),\"\")))","v":""},"",{"$f":"IF($M288=\"\",\"\",IF(GoalEntryData!$C$10=\"<=\",IF($M288<=GoalEntryData!$D$10,1,0),IF(GoalEntryData!$C$10=\">=\",IF($M288>=GoalEntryData!$D$10,1,0),\"\")))","v":""},""]
[null,null,null,{"$f":"IF($B289=\"\",\"\",IF(GoalEntryData!$C$6=\"<=\",IF($B289<=GoalEntryData!$D$6,1,0),IF(GoalEntryData!$C$6=\">=\",IF($B289>=GoalEntryData!$D$6,1,0),\"\")))","v":""},"",{"$f":"IF($B289=\"\",\"\",IF(GoalEntryData!$C$7=\"<=\",IF($B289<=GoalEntryData!$D$7,1,0),IF(GoalEntryData!$C$7=\">=\",IF($B289>=GoalEntryData!$D$7,1,0),\"\")))","v":""},"",{"$f":"IF($B289=\"\",\"\",IF(GoalEntryData!$C$8=\"<=\",IF($B289<=GoalEntryData!$D$8,1,0),IF(GoalEntryData!$C$8=\">=\",IF($B289>=GoalEntryData!$D$8,1,0),\"\")))","v":""},"",{"$f":"IF($B289=\"\",\"\",IF(GoalEntryData!$C$6=\"<=\",IF($B289<=GoalEntryData!$D$6,1,0),IF(GoalEntryData!$C$6=\">=\",IF($B289>=GoalEntryData!$D$6,1,0),\"\")))","v":""},"",null,null,null,{"$f":"IF($M289=\"\",\"\",IF(GoalEntryData!$C$10=\"<=\",IF($M289<=GoalEntryData!$D$10,1,0),IF(GoalEntryData!$C$10=\">=\",IF($M289>=GoalEntryData!$D$10,1,0),\"\")))","v":""},"",{"$f":"IF($M289=\"\",\"\",IF(GoalEntryData!$C$11=\"<=\",IF($M289<=GoalEntryData!$D$11,1,0),IF(GoalEntryData!$C$11=\">=\",IF($M289>=GoalEntryData!$D$11,1,0),\"\")))","v":""},"",{"$f":"IF($M289=\"\",\"\",IF(GoalEntryData!$C$12=\"<=\",IF($M289<=GoalEntryData!$D$12,1,0),IF(GoalEntryData!$C$10=\">=\",IF($M289>=GoalEntryData!$D$12,1,0),\"\")))","v":""},"",{"$f":"IF($M289=\"\",\"\",IF(GoalEntryData!$C$10=\"<=\",IF($M289<=GoalEntryData!$D$10,1,0),IF(GoalEntryData!$C$10=\">=\",IF($M289>=GoalEntryData!$D$10,1,0),\"\")))","v":""},""]
[null,null,null,{"$f":"IF($B290=\"\",\"\",IF(GoalEntryData!$C$6=\"<=\",IF($B290<=GoalEntryData!$D$6,1,0),IF(GoalEntryData!$C$6=\">=\",IF($B290>=GoalEntryData!$D$6,1,0),\"\")))","v":""},"",{"$f":"IF($B290=\"\",\"\",IF(GoalEntryData!$C$7=\"<=\",IF($B290<=GoalEntryData!$D$7,1,0),IF(GoalEntryData!$C$7=\">=\",IF($B290>=GoalEntryData!$D$7,1,0),\"\")))","v":""},"",{"$f":"IF($B290=\"\",\"\",IF(GoalEntryData!$C$8=\"<=\",IF($B290<=GoalEntryData!$D$8,1,0),IF(GoalEntryData!$C$8=\">=\",IF($B290>=GoalEntryData!$D$8,1,0),\"\")))","v":""},"",{"$f":"IF($B290=\"\",\"\",IF(GoalEntryData!$C$6=\"<=\",IF($B290<=GoalEntryData!$D$6,1,0),IF(GoalEntryData!$C$6=\">=\",IF($B290>=GoalEntryData!$D$6,1,0),\"\")))","v":""},"",null,null,null,{"$f":"IF($M290=\"\",\"\",IF(GoalEntryData!$C$10=\"<=\",IF($M290<=GoalEntryData!$D$10,1,0),IF(GoalEntryData!$C$10=\">=\",IF($M290>=GoalEntryData!$D$10,1,0),\"\")))","v":""},"",{"$f":"IF($M290=\"\",\"\",IF(GoalEntryData!$C$11=\"<=\",IF($M290<=GoalEntryData!$D$11,1,0),IF(GoalEntryData!$C$11=\">=\",IF($M290>=GoalEntryData!$D$11,1,0),\"\")))","v":""},"",{"$f":"IF($M290=\"\",\"\",IF(GoalEntryData!$C$12=\"<=\",IF($M290<=GoalEntryData!$D$12,1,0),IF(GoalEntryData!$C$10=\">=\",IF($M290>=GoalEntryData!$D$12,1,0),\"\")))","v":""},"",{"$f":"IF($M290=\"\",\"\",IF(GoalEntryData!$C$10=\"<=\",IF($M290<=GoalEntryData!$D$10,1,0),IF(GoalEntryData!$C$10=\">=\",IF($M290>=GoalEntryData!$D$10,1,0),\"\")))","v":""},""]
[null,null,null,{"$f":"IF($B291=\"\",\"\",IF(GoalEntryData!$C$6=\"<=\",IF($B291<=GoalEntryData!$D$6,1,0),IF(GoalEntryData!$C$6=\">=\",IF($B291>=GoalEntryData!$D$6,1,0),\"\")))","v":""},"",{"$f":"IF($B291=\"\",\"\",IF(GoalEntryData!$C$7=\"<=\",IF($B291<=GoalEntryData!$D$7,1,0),IF(GoalEntryData!$C$7=\">=\",IF($B291>=GoalEntryData!$D$7,1,0),\"\")))","v":""},"",{"$f":"IF($B291=\"\",\"\",IF(GoalEntryData!$C$8=\"<=\",IF($B291<=GoalEntryData!$D$8,1,0),IF(GoalEntryData!$C$8=\">=\",IF($B291>=GoalEntryData!$D$8,1,0),\"\")))","v":""},"",{"$f":"IF($B291=\"\",\"\",IF(GoalEntryData!$C$6=\"<=\",IF($B291<=GoalEntryData!$D$6,1,0),IF(GoalEntryData!$C$6=\">=\",IF($B291>=GoalEntryData!$D$6,1,0),\"\")))","v":""},"",null,null,null,{"$f":"IF($M291=\"\",\"\",IF(GoalEntryData!$C$10=\"<=\",IF($M291<=GoalEntryData!$D$10,1,0),IF(GoalEntryData!$C$10=\">=\",IF($M291>=GoalEntryData!$D$10,1,0),\"\")))","v":""},"",{"$f":"IF($M291=\"\",\"\",IF(GoalEntryData!$C$11=\"<=\",IF($M291<=GoalEntryData!$D$11,1,0),IF(GoalEntryData!$C$11=\">=\",IF($M291>=GoalEntryData!$D$11,1,0),\"\")))","v":""},"",{"$f":"IF($M291=\"\",\"\",IF(GoalEntryData!$C$12=\"<=\",IF($M291<=GoalEntryData!$D$12,1,0),IF(GoalEntryData!$C$10=\">=\",IF($M291>=GoalEntryData!$D$12,1,0),\"\")))","v":""},"",{"$f":"IF($M291=\"\",\"\",IF(GoalEntryData!$C$10=\"<=\",IF($M291<=GoalEntryData!$D$10,1,0),IF(GoalEntryData!$C$10=\">=\",IF($M291>=GoalEntryData!$D$10,1,0),\"\")))","v":""},""]
[null,null,null,{"$f":"IF($B292=\"\",\"\",IF(GoalEntryData!$C$6=\"<=\",IF($B292<=GoalEntryData!$D$6,1,0),IF(GoalEntryData!$C$6=\">=\",IF($B292>=GoalEntryData!$D$6,1,0),\"\")))","v":""},"",{"$f":"IF($B292=\"\",\"\",IF(GoalEntryData!$C$7=\"<=\",IF($B292<=GoalEntryData!$D$7,1,0),IF(GoalEntryData!$C$7=\">=\",IF($B292>=GoalEntryData!$D$7,1,0),\"\")))","v":""},"",{"$f":"IF($B292=\"\",\"\",IF(GoalEntryData!$C$8=\"<=\",IF($B292<=GoalEntryData!$D$8,1,0),IF(GoalEntryData!$C$8=\">=\",IF($B292>=GoalEntryData!$D$8,1,0),\"\")))","v":""},"",{"$f":"IF($B292=\"\",\"\",IF(GoalEntryData!$C$6=\"<=\",IF($B292<=GoalEntryData!$D$6,1,0),IF(GoalEntryData!$C$6=\">=\",IF($B292>=GoalEntryData!$D$6,1,0),\"\")))","v":""},"",null,null,null,{"$f":"IF($M292=\"\",\"\",IF(GoalEntryData!$C$10=\"<=\",IF($M292<=GoalEntryData!$D$10,1,0),IF(GoalEntryData!$C$10=\">=\",IF($M292>=GoalEntryData!$D$10,1,0),\"\")))","v":""},"",{"$f":"IF($M292=\"\",\"\",IF(GoalEntryData!$C$11=\"<=\",IF($M292<=GoalEntryData!$D$11,1,0),IF(GoalEntryData!$C$11=\">=\",IF($M292>=GoalEntryData!$D$11,1,0),\"\")))","v":""},"",{"$f":"IF($M292=\"\",\"\",IF(GoalEntryData!$C$12=\"<=\",IF($M292<=GoalEntryData!$D$12,1,0),IF(GoalEntryData!$C$10=\">=\",IF($M292>=GoalEntryData!$D$12,1,0),\"\")))","v":""},"",{"$f":"IF($M292=\"\",\"\",IF(GoalEntryData!$C$10=\"<=\",IF($M292<=GoalEntryData!$D$10,1,0),IF(GoalEntryData!$C$10=\">=\",IF($M292>=GoalEntryData!$D$10,1,0),\"\")))","v":""},""]
[null,null,null,{"$f":"IF($B293=\"\",\"\",IF(GoalEntryData!$C$6=\"<=\",IF($B293<=GoalEntryData!$D$6,1,0),IF(GoalEntryData!$C$6=\">=\",IF($B293>=GoalEntryData!$D$6,1,0),\"\")))","v":""},"",{"$f":"IF($B293=\"\",\"\",IF(GoalEntryData!$C$7=\"<=\",IF($B293<=GoalEntryData!$D$7,1,0),IF(GoalEntryData!$C$7=\">=\",IF($B293>=GoalEntryData!$D$7,1,0),\"\")))","v":""},"",{"$f":"IF($B293=\"\",\"\",IF(GoalEntryData!$C$8=\"<=\",IF($B293<=GoalEntryData!$D$8,1,0),IF(GoalEntryData!$C$8=\">=\",IF($B293>=GoalEntryData!$D$8,1,0),\"\")))","v":""},"",{"$f":"IF($B293=\"\",\"\",IF(GoalEntryData!$C$6=\"<=\",IF($B293<=GoalEntryData!$D$6,1,0),IF(GoalEntryData!$C$6=\">=\",IF($B293>=GoalEntryData!$D$6,1,0),\"\")))","v":""},"",null,null,null,{"$f":"IF($M293=\"\",\"\",IF(GoalEntryData!$C$10=\"<=\",IF($M293<=GoalEntryData!$D$10,1,0),IF(GoalEntryData!$C$10=\">=\",IF($M293>=GoalEntryData!$D$10,1,0),\"\")))","v":""},"",{"$f":"IF($M293=\"\",\"\",IF(GoalEntryData!$C$11=\"<=\",IF($M293<=GoalEntryData!$D$11,1,0),IF(GoalEntryData!$C$11=\">=\",IF($M293>=GoalEntryData!$D$11,1,0),\"\")))","v":""},"",{"$f":"IF($M293=\"\",\"\",IF(GoalEntryData!$C$12=\"<=\",IF($M293<=GoalEntryData!$D$12,1,0),IF(GoalEntryData!$C$10=\">=\",IF($M293>=GoalEntryData!$D$12,1,0),\"\")))","v":""},"",{"$f":"IF($M293=\"\",\"\",IF(GoalEntryData!$C$10=\"<=\",IF($M293<=GoalEntryData!$D$10,1,0),IF(GoalEntryData!$C$10=\">=\",IF($M293>=GoalEntryData!$D$10,1,0),\"\")))","v":""},""]
[null,null,null,{"$f":"IF($B294=\"\",\"\",IF(GoalEntryData!$C$6=\"<=\",IF($B294<=GoalEntryData!$D$6,1,0),IF(GoalEntryData!$C$6=\">=\",IF($B294>=GoalEntryData!$D$6,1,0),\"\")))","v":""},"",{"$f":"IF($B294=\"\",\"\",IF(GoalEntryData!$C$7=\"<=\",IF($B294<=GoalEntryData!$D$7,1,0),IF(GoalEntryData!$C$7=\">=\",IF($B294>=GoalEntryData!$D$7,1,0),\"\")))","v":""},"",{"$f":"IF($B294=\"\",\"\",IF(GoalEntryData!$C$8=\"<=\",IF($B294<=GoalEntryData!$D$8,1,0),IF(GoalEntryData!$C$8=\">=\",IF($B294>=GoalEntryData!$D$8,1,0),\"\")))","v":""},"",{"$f":"IF($B294=\"\",\"\",IF(GoalEntryData!$C$6=\"<=\",IF($B294<=GoalEntryData!$D$6,1,0),IF(GoalEntryData!$C$6=\">=\",IF($B294>=GoalEntryData!$D$6,1,0),\"\")))","v":""},"",null,null,null,{"$f":"IF($M294=\"\",\"\",IF(GoalEntryData!$C$10=\"<=\",IF($M294<=GoalEntryData!$D$10,1,0),IF(GoalEntryData!$C$10=\">=\",IF($M294>=GoalEntryData!$D$10,1,0),\"\")))","v":""},"",{"$f":"IF($M294=\"\",\"\",IF(GoalEntryData!$C$11=\"<=\",IF($M294<=GoalEntryData!$D$11,1,0),IF(GoalEntryData!$C$11=\">=\",IF($M294>=GoalEntryData!$D$11,1,0),\"\")))","v":""},"",{"$f":"IF($M294=\"\",\"\",IF(GoalEntryData!$C$12=\"<=\",IF($M294<=GoalEntryData!$D$12,1,0),IF(GoalEntryData!$C$10=\">=\",IF($M294>=GoalEntryData!$D$12,1,0),\"\")))","v":""},"",{"$f":"IF($M294=\"\",\"\",IF(GoalEntryData!$C$10=\"<=\",IF($M294<=GoalEntryData!$D$10,1,0),IF(GoalEntryData!$C$10=\">=\",IF($M294>=GoalEntryData!$D$10,1,0),\"\")))","v":""},""]
[null,null,null,{"$f":"IF($B295=\"\",\"\",IF(GoalEntryData!$C$6=\"<=\",IF($B295<=GoalEntryData!$D$6,1,0),IF(GoalEntryData!$C$6=\">=\",IF($B295>=GoalEntryData!$D$6,1,0),\"\")))","v":""},"",{"$f":"IF($B295=\"\",\"\",IF(GoalEntryData!$C$7=\"<=\",IF($B295<=GoalEntryData!$D$7,1,0),IF(GoalEntryData!$C$7=\">=\",IF($B295>=GoalEntryData!$D$7,1,0),\"\")))","v":""},"",{"$f":"IF($B295=\"\",\"\",IF(GoalEntryData!$C$8=\"<=\",IF($B295<=GoalEntryData!$D$8,1,0),IF(GoalEntryData!$C$8=\">=\",IF($B295>=GoalEntryData!$D$8,1,0),\"\")))","v":""},"",{"$f":"IF($B295=\"\",\"\",IF(GoalEntryData!$C$6=\"<=\",IF($B295<=GoalEntryData!$D$6,1,0),IF(GoalEntryData!$C$6=\">=\",IF($B295>=GoalEntryData!$D$6,1,0),\"\")))","v":""},"",null,null,null,{"$f":"IF($M295=\"\",\"\",IF(GoalEntryData!$C$10=\"<=\",IF($M295<=GoalEntryData!$D$10,1,0),IF(GoalEntryData!$C$10=\">=\",IF($M295>=GoalEntryData!$D$10,1,0),\"\")))","v":""},"",{"$f":"IF($M295=\"\",\"\",IF(GoalEntryData!$C$11=\"<=\",IF($M295<=GoalEntryData!$D$11,1,0),IF(GoalEntryData!$C$11=\">=\",IF($M295>=GoalEntryData!$D$11,1,0),\"\")))","v":""},"",{"$f":"IF($M295=\"\",\"\",IF(GoalEntryData!$C$12=\"<=\",IF($M295<=GoalEntryData!$D$12,1,0),IF(GoalEntryData!$C$10=\">=\",IF($M295>=GoalEntryData!$D$12,1,0),\"\")))","v":""},"",{"$f":"IF($M295=\"\",\"\",IF(GoalEntryData!$C$10=\"<=\",IF($M295<=GoalEntryData!$D$10,1,0),IF(GoalEntryData!$C$10=\">=\",IF($M295>=GoalEntryData!$D$10,1,0),\"\")))","v":""},""]
[null,null,null,{"$f":"IF($B296=\"\",\"\",IF(GoalEntryData!$C$6=\"<=\",IF($B296<=GoalEntryData!$D$6,1,0),IF(GoalEntryData!$C$6=\">=\",IF($B296>=GoalEntryData!$D$6,1,0),\"\")))","v":""},"",{"$f":"IF($B296=\"\",\"\",IF(GoalEntryData!$C$7=\"<=\",IF($B296<=GoalEntryData!$D$7,1,0),IF(GoalEntryData!$C$7=\">=\",IF($B296>=GoalEntryData!$D$7,1,0),\"\")))","v":""},"",{"$f":"IF($B296=\"\",\"\",IF(GoalEntryData!$C$8=\"<=\",IF($B296<=GoalEntryData!$D$8,1,0),IF(GoalEntryData!$C$8=\">=\",IF($B296>=GoalEntryData!$D$8,1,0),\"\")))","v":""},"",{"$f":"IF($B296=\"\",\"\",IF(GoalEntryData!$C$6=\"<=\",IF($B296<=GoalEntryData!$D$6,1,0),IF(GoalEntryData!$C$6=\">=\",IF($B296>=GoalEntryData!$D$6,1,0),\"\")))","v":""},"",null,null,null,{"$f":"IF($M296=\"\",\"\",IF(GoalEntryData!$C$10=\"<=\",IF($M296<=GoalEntryData!$D$10,1,0),IF(GoalEntryData!$C$10=\">=\",IF($M296>=GoalEntryData!$D$10,1,0),\"\")))","v":""},"",{"$f":"IF($M296=\"\",\"\",IF(GoalEntryData!$C$11=\"<=\",IF($M296<=GoalEntryData!$D$11,1,0),IF(GoalEntryData!$C$11=\">=\",IF($M296>=GoalEntryData!$D$11,1,0),\"\")))","v":""},"",{"$f":"IF($M296=\"\",\"\",IF(GoalEntryData!$C$12=\"<=\",IF($M296<=GoalEntryData!$D$12,1,0),IF(GoalEntryData!$C$10=\">=\",IF($M296>=GoalEntryData!$D$12,1,0),\"\")))","v":""},"",{"$f":"IF($M296=\"\",\"\",IF(GoalEntryData!$C$10=\"<=\",IF($M296<=GoalEntryData!$D$10,1,0),IF(GoalEntryData!$C$10=\">=\",IF($M296>=GoalEntryData!$D$10,1,0),\"\")))","v":""},""]
[null,null,null,{"$f":"IF($B297=\"\",\"\",IF(GoalEntryData!$C$6=\"<=\",IF($B297<=GoalEntryData!$D$6,1,0),IF(GoalEntryData!$C$6=\">=\",IF($B297>=GoalEntryData!$D$6,1,0),\"\")))","v":""},"",{"$f":"IF($B297=\"\",\"\",IF(GoalEntryData!$C$7=\"<=\",IF($B297<=GoalEntryData!$D$7,1,0),IF(GoalEntryData!$C$7=\">=\",IF($B297>=GoalEntryData!$D$7,1,0),\"\")))","v":""},"",{"$f":"IF($B297=\"\",\"\",IF(GoalEntryData!$C$8=\"<=\",IF($B297<=GoalEntryData!$D$8,1,0),IF(GoalEntryData!$C$8=\">=\",IF($B297>=GoalEntryData!$D$8,1,0),\"\")))","v":""},"",{"$f":"IF($B297=\"\",\"\",IF(GoalEntryData!$C$6=\"<=\",IF($B297<=GoalEntryData!$D$6,1,0),IF(GoalEntryData!$C$6=\">=\",IF($B297>=GoalEntryData!$D$6,1,0),\"\")))","v":""},"",null,null,null,{"$f":"IF($M297=\"\",\"\",IF(GoalEntryData!$C$10=\"<=\",IF($M297<=GoalEntryData!$D$10,1,0),IF(GoalEntryData!$C$10=\">=\",IF($M297>=GoalEntryData!$D$10,1,0),\"\")))","v":""},"",{"$f":"IF($M297=\"\",\"\",IF(GoalEntryData!$C$11=\"<=\",IF($M297<=GoalEntryData!$D$11,1,0),IF(GoalEntryData!$C$11=\">=\",IF($M297>=GoalEntryData!$D$11,1,0),\"\")))","v":""},"",{"$f":"IF($M297=\"\",\"\",IF(GoalEntryData!$C$12=\"<=\",IF($M297<=GoalEntryData!$D$12,1,0),IF(GoalEntryData!$C$10=\">=\",IF($M297>=GoalEntryData!$D$12,1,0),\"\")))","v":""},"",{"$f":"IF($M297=\"\",\"\",IF(GoalEntryData!$C$10=\"<=\",IF($M297<=GoalEntryData!$D$10,1,0),IF(GoalEntryData!$C$10=\">=\",IF($M297>=GoalEntryData!$D$10,1,0),\"\")))","v":""},""]
[null,null,null,{"$f":"IF($B298=\"\",\"\",IF(GoalEntryData!$C$6=\"<=\",IF($B298<=GoalEntryData!$D$6,1,0),IF(GoalEntryData!$C$6=\">=\",IF($B298>=GoalEntryData!$D$6,1,0),\"\")))","v":""},"",{"$f":"IF($B298=\"\",\"\",IF(GoalEntryData!$C$7=\"<=\",IF($B298<=GoalEntryData!$D$7,1,0),IF(GoalEntryData!$C$7=\">=\",IF($B298>=GoalEntryData!$D$7,1,0),\"\")))","v":""},"",{"$f":"IF($B298=\"\",\"\",IF(GoalEntryData!$C$8=\"<=\",IF($B298<=GoalEntryData!$D$8,1,0),IF(GoalEntryData!$C$8=\">=\",IF($B298>=GoalEntryData!$D$8,1,0),\"\")))","v":""},"",{"$f":"IF($B298=\"\",\"\",IF(GoalEntryData!$C$6=\"<=\",IF($B298<=GoalEntryData!$D$6,1,0),IF(GoalEntryData!$C$6=\">=\",IF($B298>=GoalEntryData!$D$6,1,0),\"\")))","v":""},"",null,null,null,{"$f":"IF($M298=\"\",\"\",IF(GoalEntryData!$C$10=\"<=\",IF($M298<=GoalEntryData!$D$10,1,0),IF(GoalEntryData!$C$10=\">=\",IF($M298>=GoalEntryData!$D$10,1,0),\"\")))","v":""},"",{"$f":"IF($M298=\"\",\"\",IF(GoalEntryData!$C$11=\"<=\",IF($M298<=GoalEntryData!$D$11,1,0),IF(GoalEntryData!$C$11=\">=\",IF($M298>=GoalEntryData!$D$11,1,0),\"\")))","v":""},"",{"$f":"IF($M298=\"\",\"\",IF(GoalEntryData!$C$12=\"<=\",IF($M298<=GoalEntryData!$D$12,1,0),IF(GoalEntryData!$C$10=\">=\",IF($M298>=GoalEntryData!$D$12,1,0),\"\")))","v":""},"",{"$f":"IF($M298=\"\",\"\",IF(GoalEntryData!$C$10=\"<=\",IF($M298<=GoalEntryData!$D$10,1,0),IF(GoalEntryData!$C$10=\">=\",IF($M298>=GoalEntryData!$D$10,1,0),\"\")))","v":""},""]
[null,null,null,{"$f":"IF($B299=\"\",\"\",IF(GoalEntryData!$C$6=\"<=\",IF($B299<=GoalEntryData!$D$6,1,0),IF(GoalEntryData!$C$6=\">=\",IF($B299>=GoalEntryData!$D$6,1,0),\"\")))","v":""},"",{"$f":"IF($B299=\"\",\"\",IF(GoalEntryData!$C$7=\"<=\",IF($B299<=GoalEntryData!$D$7,1,0),IF(GoalEntryData!$C$7=\">=\",IF($B299>=GoalEntryData!$D$7,1,0),\"\")))","v":""},"",{"$f":"IF($B299=\"\",\"\",IF(GoalEntryData!$C$8=\"<=\",IF($B299<=GoalEntryData!$D$8,1,0),IF(GoalEntryData!$C$8=\">=\",IF($B299>=GoalEntryData!$D$8,1,0),\"\")))","v":""},"",{"$f":"IF($B299=\"\",\"\",IF(GoalEntryData!$C$6=\"<=\",IF($B299<=GoalEntryData!$D$6,1,0),IF(GoalEntryData!$C$6=\">=\",IF($B299>=GoalEntryData!$D$6,1,0),\"\")))","v":""},"",null,null,null,{"$f":"IF($M299=\"\",\"\",IF(GoalEntryData!$C$10=\"<=\",IF($M299<=GoalEntryData!$D$10,1,0),IF(GoalEntryData!$C$10=\">=\",IF($M299>=GoalEntryData!$D$10,1,0),\"\")))","v":""},"",{"$f":"IF($M299=\"\",\"\",IF(GoalEntryData!$C$11=\"<=\",IF($M299<=GoalEntryData!$D$11,1,0),IF(GoalEntryData!$C$11=\">=\",IF($M299>=GoalEntryData!$D$11,1,0),\"\")))","v":""},"",{"$f":"IF($M299=\"\",\"\",IF(GoalEntryData!$C$12=\"<=\",IF($M299<=GoalEntryData!$D$12,1,0),IF(GoalEntryData!$C$10=\">=\",IF($M299>=GoalEntryData!$D$12,1,0),\"\")))","v":""},"",{"$f":"IF($M299=\"\",\"\",IF(GoalEntryData!$C$10=\"<=\",IF($M299<=GoalEntryData!$D$10,1,0),IF(GoalEntryData!$C$10=\">=\",IF($M299>=GoalEntryData!$D$10,1,0),\"\")))","v":""},""]
[null,null,null,{"$f":"IF($B300=\"\",\"\",IF(GoalEntryData!$C$6=\"<=\",IF($B300<=GoalEntryData!$D$6,1,0),IF(GoalEntryData!$C$6=\">=\",IF($B300>=GoalEntryData!$D$6,1,0),\"\")))","v":""},"",{"$f":"IF($B300=\"\",\"\",IF(GoalEntryData!$C$7=\"<=\",IF($B300<=GoalEntryData!$D$7,1,0),IF(GoalEntryData!$C$7=\">=\",IF($B300>=GoalEntryData!$D$7,1,0),\"\")))","v":""},"",{"$f":"IF($B300=\"\",\"\",IF(GoalEntryData!$C$8=\"<=\",IF($B300<=GoalEntryData!$D$8,1,0),IF(GoalEntryData!$C$8=\">=\",IF($B300>=GoalEntryData!$D$8,1,0),\"\")))","v":""},"",{"$f":"IF($B300=\"\",\"\",IF(GoalEntryData!$C$6=\"<=\",IF($B300<=GoalEntryData!$D$6,1,0),IF(GoalEntryData!$C$6=\">=\",IF($B300>=GoalEntryData!$D$6,1,0),\"\")))","v":""},"",null,null,null,{"$f":"IF($M300=\"\",\"\",IF(GoalEntryData!$C$10=\"<=\",IF($M300<=GoalEntryData!$D$10,1,0),IF(GoalEntryData!$C$10=\">=\",IF($M300>=GoalEntryData!$D$10,1,0),\"\")))","v":""},"",{"$f":"IF($M300=\"\",\"\",IF(GoalEntryData!$C$11=\"<=\",IF($M300<=GoalEntryData!$D$11,1,0),IF(GoalEntryData!$C$11=\">=\",IF($M300>=GoalEntryData!$D$11,1,0),\"\")))","v":""},"",{"$f":"IF($M300=\"\",\"\",IF(GoalEntryData!$C$12=\"<=\",IF($M300<=GoalEntryData!$D$12,1,0),IF(GoalEntryData!$C$10=\">=\",IF($M300>=GoalEntryData!$D$12,1,0),\"\")))","v":""},"",{"$f":"IF($M300=\"\",\"\",IF(GoalEntryData!$C$10=\"<=\",IF($M300<=GoalEntryData!$D$10,1,0),IF(GoalEntryData!$C$10=\">=\",IF($M300>=GoalEntryData!$D$10,1,0),\"\")))","v":""},""]
[null,null,null,{"$f":"IF($B301=\"\",\"\",IF(GoalEntryData!$C$6=\"<=\",IF($B301<=GoalEntryData!$D$6,1,0),IF(GoalEntryData!$C$6=\">=\",IF($B301>=GoalEntryData!$D$6,1,0),\"\")))","v":""},"",{"$f":"IF($B301=\"\",\"\",IF(GoalEntryData!$C$7=\"<=\",IF($B301<=GoalEntryData!$D$7,1,0),IF(GoalEntryData!$C$7=\">=\",IF($B301>=GoalEntryData!$D$7,1,0),\"\")))","v":""},"",{"$f":"IF($B301=\"\",\"\",IF(GoalEntryData!$C$8=\"<=\",IF($B301<=GoalEntryData!$D$8,1,0),IF(GoalEntryData!$C$8=\">=\",IF($B301>=GoalEntryData!$D$8,1,0),\"\")))","v":""},"",{"$f":"IF($B301=\"\",\"\",IF(GoalEntryData!$C$6=\"<=\",IF($B301<=GoalEntryData!$D$6,1,0),IF(GoalEntryData!$C$6=\">=\",IF($B301>=GoalEntryData!$D$6,1,0),\"\")))","v":""},"",null,null,null,{"$f":"IF($M301=\"\",\"\",IF(GoalEntryData!$C$10=\"<=\",IF($M301<=GoalEntryData!$D$10,1,0),IF(GoalEntryData!$C$10=\">=\",IF($M301>=GoalEntryData!$D$10,1,0),\"\")))","v":""},"",{"$f":"IF($M301=\"\",\"\",IF(GoalEntryData!$C$11=\"<=\",IF($M301<=GoalEntryData!$D$11,1,0),IF(GoalEntryData!$C$11=\">=\",IF($M301>=GoalEntryData!$D$11,1,0),\"\")))","v":""},"",{"$f":"IF($M301=\"\",\"\",IF(GoalEntryData!$C$12=\"<=\",IF($M301<=GoalEntryData!$D$12,1,0),IF(GoalEntryData!$C$10=\">=\",IF($M301>=GoalEntryData!$D$12,1,0),\"\")))","v":""},"",{"$f":"IF($M301=\"\",\"\",IF(GoalEntryData!$C$10=\"<=\",IF($M301<=GoalEntryData!$D$10,1,0),IF(GoalEntryData!$C$10=\">=\",IF($M301>=GoalEntryData!$D$10,1,0),\"\")))","v":""},""]
[null,null,null,{"$f":"IF($B302=\"\",\"\",IF(GoalEntryData!$C$6=\"<=\",IF($B302<=GoalEntryData!$D$6,1,0),IF(GoalEntryData!$C$6=\">=\",IF($B302>=GoalEntryData!$D$6,1,0),\"\")))","v":""},"",{"$f":"IF($B302=\"\",\"\",IF(GoalEntryData!$C$7=\"<=\",IF($B302<=GoalEntryData!$D$7,1,0),IF(GoalEntryData!$C$7=\">=\",IF($B302>=GoalEntryData!$D$7,1,0),\"\")))","v":""},"",{"$f":"IF($B302=\"\",\"\",IF(GoalEntryData!$C$8=\"<=\",IF($B302<=GoalEntryData!$D$8,1,0),IF(GoalEntryData!$C$8=\">=\",IF($B302>=GoalEntryData!$D$8,1,0),\"\")))","v":""},"",{"$f":"IF($B302=\"\",\"\",IF(GoalEntryData!$C$6=\"<=\",IF($B302<=GoalEntryData!$D$6,1,0),IF(GoalEntryData!$C$6=\">=\",IF($B302>=GoalEntryData!$D$6,1,0),\"\")))","v":""},"",null,null,null,{"$f":"IF($M302=\"\",\"\",IF(GoalEntryData!$C$10=\"<=\",IF($M302<=GoalEntryData!$D$10,1,0),IF(GoalEntryData!$C$10=\">=\",IF($M302>=GoalEntryData!$D$10,1,0),\"\")))","v":""},"",{"$f":"IF($M302=\"\",\"\",IF(GoalEntryData!$C$11=\"<=\",IF($M302<=GoalEntryData!$D$11,1,0),IF(GoalEntryData!$C$11=\">=\",IF($M302>=GoalEntryData!$D$11,1,0),\"\")))","v":""},"",{"$f":"IF($M302=\"\",\"\",IF(GoalEntryData!$C$12=\"<=\",IF($M302<=GoalEntryData!$D$12,1,0),IF(GoalEntryData!$C$10=\">=\",IF($M302>=GoalEntryData!$D$12,1,0),\"\")))","v":""},"",{"$f":"IF($M302=\"\",\"\",IF(GoalEntryData!$C$10=\"<=\",IF($M302<=GoalEntryData!$D$10,1,0),IF(GoalEntryData!$C$10=\">=\",IF($M302>=GoalEntryData!$D$10,1,0),\"\")))","v":""},""]
[null,null,null,{"$f":"IF($B303=\"\",\"\",IF(GoalEntryData!$C$6=\"<=\",IF($B303<=GoalEntryData!$D$6,1,0),IF(GoalEntryData!$C$6=\">=\",IF($B303>=GoalEntryData!$D$6,1,0),\"\")))","v":""},"",{"$f":"IF($B303=\"\",\"\",IF(GoalEntryData!$C$7=\"<=\",IF($B303<=GoalEntryData!$D$7,1,0),IF(GoalEntryData!$C$7=\">=\",IF($B303>=GoalEntryData!$D$7,1,0),\"\")))","v":""},"",{"$f":"IF($B303=\"\",\"\",IF(GoalEntryData!$C$8=\"<=\",IF($B303<=GoalEntryData!$D$8,1,0),IF(GoalEntryData!$C$8=\">=\",IF($B303>=GoalEntryData!$D$8,1,0),\"\")))","v":""},"",{"$f":"IF($B303=\"\",\"\",IF(GoalEntryData!$C$6=\"<=\",IF($B303<=GoalEntryData!$D$6,1,0),IF(GoalEntryData!$C$6=\">=\",IF($B303>=GoalEntryData!$D$6,1,0),\"\")))","v":""},"",null,null,null,{"$f":"IF($M303=\"\",\"\",IF(GoalEntryData!$C$10=\"<=\",IF($M303<=GoalEntryData!$D$10,1,0),IF(GoalEntryData!$C$10=\">=\",IF($M303>=GoalEntryData!$D$10,1,0),\"\")))","v":""},"",{"$f":"IF($M303=\"\",\"\",IF(GoalEntryData!$C$11=\"<=\",IF($M303<=GoalEntryData!$D$11,1,0),IF(GoalEntryData!$C$11=\">=\",IF($M303>=GoalEntryData!$D$11,1,0),\"\")))","v":""},"",{"$f":"IF($M303=\"\",\"\",IF(GoalEntryData!$C$12=\"<=\",IF($M303<=GoalEntryData!$D$12,1,0),IF(GoalEntryData!$C$10=\">=\",IF($M303>=GoalEntryData!$D$12,1,0),\"\")))","v":""},"",{"$f":"IF($M303=\"\",\"\",IF(GoalEntryData!$C$10=\"<=\",IF($M303<=GoalEntryData!$D$10,1,0),IF(GoalEntryData!$C$10=\">=\",IF($M303>=GoalEntryData!$D$10,1,0),\"\")))","v":""},""]
[null,null,null,{"$f":"IF($B304=\"\",\"\",IF(GoalEntryData!$C$6=\"<=\",IF($B304<=GoalEntryData!$D$6,1,0),IF(GoalEntryData!$C$6=\">=\",IF($B304>=GoalEntryData!$D$6,1,0),\"\")))","v":""},"",{"$f":"IF($B304=\"\",\"\",IF(GoalEntryData!$C$7=\"<=\",IF($B304<=GoalEntryData!$D$7,1,0),IF(GoalEntryData!$C$7=\">=\",IF($B304>=GoalEntryData!$D$7,1,0),\"\")))","v":""},"",{"$f":"IF($B304=\"\",\"\",IF(GoalEntryData!$C$8=\"<=\",IF($B304<=GoalEntryData!$D$8,1,0),IF(GoalEntryData!$C$8=\">=\",IF($B304>=GoalEntryData!$D$8,1,0),\"\")))","v":""},"",{"$f":"IF($B304=\"\",\"\",IF(GoalEntryData!$C$6=\"<=\",IF($B304<=GoalEntryData!$D$6,1,0),IF(GoalEntryData!$C$6=\">=\",IF($B304>=GoalEntryData!$D$6,1,0),\"\")))","v":""},"",null,null,null,{"$f":"IF($M304=\"\",\"\",IF(GoalEntryData!$C$10=\"<=\",IF($M304<=GoalEntryData!$D$10,1,0),IF(GoalEntryData!$C$10=\">=\",IF($M304>=GoalEntryData!$D$10,1,0),\"\")))","v":""},"",{"$f":"IF($M304=\"\",\"\",IF(GoalEntryData!$C$11=\"<=\",IF($M304<=GoalEntryData!$D$11,1,0),IF(GoalEntryData!$C$11=\">=\",IF($M304>=GoalEntryData!$D$11,1,0),\"\")))","v":""},"",{"$f":"IF($M304=\"\",\"\",IF(GoalEntryData!$C$12=\"<=\",IF($M304<=GoalEntryData!$D$12,1,0),IF(GoalEntryData!$C$10=\">=\",IF($M304>=GoalEntryData!$D$12,1,0),\"\")))","v":""},"",{"$f":"IF($M304=\"\",\"\",IF(GoalEntryData!$C$10=\"<=\",IF($M304<=GoalEntryData!$D$10,1,0),IF(GoalEntryData!$C$10=\">=\",IF($M304>=GoalEntryData!$D$10,1,0),\"\")))","v":""},""]
[null,null,null,{"$f":"IF($B305=\"\",\"\",IF(GoalEntryData!$C$6=\"<=\",IF($B305<=GoalEntryData!$D$6,1,0),IF(GoalEntryData!$C$6=\">=\",IF($B305>=GoalEntryData!$D$6,1,0),\"\")))","v":""},"",{"$f":"IF($B305=\"\",\"\",IF(GoalEntryData!$C$7=\"<=\",IF($B305<=GoalEntryData!$D$7,1,0),IF(GoalEntryData!$C$7=\">=\",IF($B305>=GoalEntryData!$D$7,1,0),\"\")))","v":""},"",{"$f":"IF($B305=\"\",\"\",IF(GoalEntryData!$C$8=\"<=\",IF($B305<=GoalEntryData!$D$8,1,0),IF(GoalEntryData!$C$8=\">=\",IF($B305>=GoalEntryData!$D$8,1,0),\"\")))","v":""},"",{"$f":"IF($B305=\"\",\"\",IF(GoalEntryData!$C$6=\"<=\",IF($B305<=GoalEntryData!$D$6,1,0),IF(GoalEntryData!$C$6=\">=\",IF($B305>=GoalEntryData!$D$6,1,0),\"\")))","v":""},"",null,null,null,{"$f":"IF($M305=\"\",\"\",IF(GoalEntryData!$C$10=\"<=\",IF($M305<=GoalEntryData!$D$10,1,0),IF(GoalEntryData!$C$10=\">=\",IF($M305>=GoalEntryData!$D$10,1,0),\"\")))","v":""},"",{"$f":"IF($M305=\"\",\"\",IF(GoalEntryData!$C$11=\"<=\",IF($M305<=GoalEntryData!$D$11,1,0),IF(GoalEntryData!$C$11=\">=\",IF($M305>=GoalEntryData!$D$11,1,0),\"\")))","v":""},"",{"$f":"IF($M305=\"\",\"\",IF(GoalEntryData!$C$12=\"<=\",IF($M305<=GoalEntryData!$D$12,1,0),IF(GoalEntryData!$C$10=\">=\",IF($M305>=GoalEntryData!$D$12,1,0),\"\")))","v":""},"",{"$f":"IF($M305=\"\",\"\",IF(GoalEntryData!$C$10=\"<=\",IF($M305<=GoalEntryData!$D$10,1,0),IF(GoalEntryData!$C$10=\">=\",IF($M305>=GoalEntryData!$D$10,1,0),\"\")))","v":""},""]
[null,null,null,{"$f":"IF($B306=\"\",\"\",IF(GoalEntryData!$C$6=\"<=\",IF($B306<=GoalEntryData!$D$6,1,0),IF(GoalEntryData!$C$6=\">=\",IF($B306>=GoalEntryData!$D$6,1,0),\"\")))","v":""},"",{"$f":"IF($B306=\"\",\"\",IF(GoalEntryData!$C$7=\"<=\",IF($B306<=GoalEntryData!$D$7,1,0),IF(GoalEntryData!$C$7=\">=\",IF($B306>=GoalEntryData!$D$7,1,0),\"\")))","v":""},"",{"$f":"IF($B306=\"\",\"\",IF(GoalEntryData!$C$8=\"<=\",IF($B306<=GoalEntryData!$D$8,1,0),IF(GoalEntryData!$C$8=\">=\",IF($B306>=GoalEntryData!$D$8,1,0),\"\")))","v":""},"",{"$f":"IF($B306=\"\",\"\",IF(GoalEntryData!$C$6=\"<=\",IF($B306<=GoalEntryData!$D$6,1,0),IF(GoalEntryData!$C$6=\">=\",IF($B306>=GoalEntryData!$D$6,1,0),\"\")))","v":""},"",null,null,null,{"$f":"IF($M306=\"\",\"\",IF(GoalEntryData!$C$10=\"<=\",IF($M306<=GoalEntryData!$D$10,1,0),IF(GoalEntryData!$C$10=\">=\",IF($M306>=GoalEntryData!$D$10,1,0),\"\")))","v":""},"",{"$f":"IF($M306=\"\",\"\",IF(GoalEntryData!$C$11=\"<=\",IF($M306<=GoalEntryData!$D$11,1,0),IF(GoalEntryData!$C$11=\">=\",IF($M306>=GoalEntryData!$D$11,1,0),\"\")))","v":""},"",{"$f":"IF($M306=\"\",\"\",IF(GoalEntryData!$C$12=\"<=\",IF($M306<=GoalEntryData!$D$12,1,0),IF(GoalEntryData!$C$10=\">=\",IF($M306>=GoalEntryData!$D$12,1,0),\"\")))","v":""},"",{"$f":"IF($M306=\"\",\"\",IF(GoalEntryData!$C$10=\"<=\",IF($M306<=GoalEntryData!$D$10,1,0),IF(GoalEntryData!$C$10=\">=\",IF($M306>=GoalEntryData!$D$10,1,0),\"\")))","v":""},""]
[null,null,null,{"$f":"IF($B307=\"\",\"\",IF(GoalEntryData!$C$6=\"<=\",IF($B307<=GoalEntryData!$D$6,1,0),IF(GoalEntryData!$C$6=\">=\",IF($B307>=GoalEntryData!$D$6,1,0),\"\")))","v":""},"",{"$f":"IF($B307=\"\",\"\",IF(GoalEntryData!$C$7=\"<=\",IF($B307<=GoalEntryData!$D$7,1,0),IF(GoalEntryData!$C$7=\">=\",IF($B307>=GoalEntryData!$D$7,1,0),\"\")))","v":""},"",{"$f":"IF($B307=\"\",\"\",IF(GoalEntryData!$C$8=\"<=\",IF($B307<=GoalEntryData!$D$8,1,0),IF(GoalEntryData!$C$8=\">=\",IF($B307>=GoalEntryData!$D$8,1,0),\"\")))","v":""},"",{"$f":"IF($B307=\"\",\"\",IF(GoalEntryData!$C$6=\"<=\",IF($B307<=GoalEntryData!$D$6,1,0),IF(GoalEntryData!$C$6=\">=\",IF($B307>=GoalEntryData!$D$6,1,0),\"\")))","v":""},"",null,null,null,{"$f":"IF($M307=\"\",\"\",IF(GoalEntryData!$C$10=\"<=\",IF($M307<=GoalEntryData!$D$10,1,0),IF(GoalEntryData!$C$10=\">=\",IF($M307>=GoalEntryData!$D$10,1,0),\"\")))","v":""},"",{"$f":"IF($M307=\"\",\"\",IF(GoalEntryData!$C$11=\"<=\",IF($M307<=GoalEntryData!$D$11,1,0),IF(GoalEntryData!$C$11=\">=\",IF($M307>=GoalEntryData!$D$11,1,0),\"\")))","v":""},"",{"$f":"IF($M307=\"\",\"\",IF(GoalEntryData!$C$12=\"<=\",IF($M307<=GoalEntryData!$D$12,1,0),IF(GoalEntryData!$C$10=\">=\",IF($M307>=GoalEntryData!$D$12,1,0),\"\")))","v":""},"",{"$f":"IF($M307=\"\",\"\",IF(GoalEntryData!$C$10=\"<=\",IF($M307<=GoalEntryData!$D$10,1,0),IF(GoalEntryData!$C$10=\">=\",IF($M307>=GoalEntryData!$D$10,1,0),\"\")))","v":""},""]
[null,null,null,{"$f":"IF($B308=\"\",\"\",IF(GoalEntryData!$C$6=\"<=\",IF($B308<=GoalEntryData!$D$6,1,0),IF(GoalEntryData!$C$6=\">=\",IF($B308>=GoalEntryData!$D$6,1,0),\"\")))","v":""},"",{"$f":"IF($B308=\"\",\"\",IF(GoalEntryData!$C$7=\"<=\",IF($B308<=GoalEntryData!$D$7,1,0),IF(GoalEntryData!$C$7=\">=\",IF($B308>=GoalEntryData!$D$7,1,0),\"\")))","v":""},"",{"$f":"IF($B308=\"\",\"\",IF(GoalEntryData!$C$8=\"<=\",IF($B308<=GoalEntryData!$D$8,1,0),IF(GoalEntryData!$C$8=\">=\",IF($B308>=GoalEntryData!$D$8,1,0),\"\")))","v":""},"",{"$f":"IF($B308=\"\",\"\",IF(GoalEntryData!$C$6=\"<=\",IF($B308<=GoalEntryData!$D$6,1,0),IF(GoalEntryData!$C$6=\">=\",IF($B308>=GoalEntryData!$D$6,1,0),\"\")))","v":""},"",null,null,null,{"$f":"IF($M308=\"\",\"\",IF(GoalEntryData!$C$10=\"<=\",IF($M308<=GoalEntryData!$D$10,1,0),IF(GoalEntryData!$C$10=\">=\",IF($M308>=GoalEntryData!$D$10,1,0),\"\")))","v":""},"",{"$f":"IF($M308=\"\",\"\",IF(GoalEntryData!$C$11=\"<=\",IF($M308<=GoalEntryData!$D$11,1,0),IF(GoalEntryData!$C$11=\">=\",IF($M308>=GoalEntryData!$D$11,1,0),\"\")))","v":""},"",{"$f":"IF($M308=\"\",\"\",IF(GoalEntryData!$C$12=\"<=\",IF($M308<=GoalEntryData!$D$12,1,0),IF(GoalEntryData!$C$10=\">=\",IF($M308>=GoalEntryData!$D$12,1,0),\"\")))","v":""},"",{"$f":"IF($M308=\"\",\"\",IF(GoalEntryData!$C$10=\"<=\",IF($M308<=GoalEntryData!$D$10,1,0),IF(GoalEntryData!$C$10=\">=\",IF($M308>=GoalEntryData!$D$10,1,0),\"\")))","v":""},""]
[null,null,null,{"$f":"IF($B309=\"\",\"\",IF(GoalEntryData!$C$6=\"<=\",IF($B309<=GoalEntryData!$D$6,1,0),IF(GoalEntryData!$C$6=\">=\",IF($B309>=GoalEntryData!$D$6,1,0),\"\")))","v":""},"",{"$f":"IF($B309=\"\",\"\",IF(GoalEntryData!$C$7=\"<=\",IF($B309<=GoalEntryData!$D$7,1,0),IF(GoalEntryData!$C$7=\">=\",IF($B309>=GoalEntryData!$D$7,1,0),\"\")))","v":""},"",{"$f":"IF($B309=\"\",\"\",IF(GoalEntryData!$C$8=\"<=\",IF($B309<=GoalEntryData!$D$8,1,0),IF(GoalEntryData!$C$8=\">=\",IF($B309>=GoalEntryData!$D$8,1,0),\"\")))","v":""},"",{"$f":"IF($B309=\"\",\"\",IF(GoalEntryData!$C$6=\"<=\",IF($B309<=GoalEntryData!$D$6,1,0),IF(GoalEntryData!$C$6=\">=\",IF($B309>=GoalEntryData!$D$6,1,0),\"\")))","v":""},"",null,null,null,{"$f":"IF($M309=\"\",\"\",IF(GoalEntryData!$C$10=\"<=\",IF($M309<=GoalEntryData!$D$10,1,0),IF(GoalEntryData!$C$10=\">=\",IF($M309>=GoalEntryData!$D$10,1,0),\"\")))","v":""},"",{"$f":"IF($M309=\"\",\"\",IF(GoalEntryData!$C$11=\"<=\",IF($M309<=GoalEntryData!$D$11,1,0),IF(GoalEntryData!$C$11=\">=\",IF($M309>=GoalEntryData!$D$11,1,0),\"\")))","v":""},"",{"$f":"IF($M309=\"\",\"\",IF(GoalEntryData!$C$12=\"<=\",IF($M309<=GoalEntryData!$D$12,1,0),IF(GoalEntryData!$C$10=\">=\",IF($M309>=GoalEntryData!$D$12,1,0),\"\")))","v":""},"",{"$f":"IF($M309=\"\",\"\",IF(GoalEntryData!$C$10=\"<=\",IF($M309<=GoalEntryData!$D$10,1,0),IF(GoalEntryData!$C$10=\">=\",IF($M309>=GoalEntryData!$D$10,1,0),\"\")))","v":""},""]
[null,null,null,{"$f":"IF($B310=\"\",\"\",IF(GoalEntryData!$C$6=\"<=\",IF($B310<=GoalEntryData!$D$6,1,0),IF(GoalEntryData!$C$6=\">=\",IF($B310>=GoalEntryData!$D$6,1,0),\"\")))","v":""},"",{"$f":"IF($B310=\"\",\"\",IF(GoalEntryData!$C$7=\"<=\",IF($B310<=GoalEntryData!$D$7,1,0),IF(GoalEntryData!$C$7=\">=\",IF($B310>=GoalEntryData!$D$7,1,0),\"\")))","v":""},"",{"$f":"IF($B310=\"\",\"\",IF(GoalEntryData!$C$8=\"<=\",IF($B310<=GoalEntryData!$D$8,1,0),IF(GoalEntryData!$C$8=\">=\",IF($B310>=GoalEntryData!$D$8,1,0),\"\")))","v":""},"",{"$f":"IF($B310=\"\",\"\",IF(GoalEntryData!$C$6=\"<=\",IF($B310<=GoalEntryData!$D$6,1,0),IF(GoalEntryData!$C$6=\">=\",IF($B310>=GoalEntryData!$D$6,1,0),\"\")))","v":""},"",null,null,null,{"$f":"IF($M310=\"\",\"\",IF(GoalEntryData!$C$10=\"<=\",IF($M310<=GoalEntryData!$D$10,1,0),IF(GoalEntryData!$C$10=\">=\",IF($M310>=GoalEntryData!$D$10,1,0),\"\")))","v":""},"",{"$f":"IF($M310=\"\",\"\",IF(GoalEntryData!$C$11=\"<=\",IF($M310<=GoalEntryData!$D$11,1,0),IF(GoalEntryData!$C$11=\">=\",IF($M310>=GoalEntryData!$D$11,1,0),\"\")))","v":""},"",{"$f":"IF($M310=\"\",\"\",IF(GoalEntryData!$C$12=\"<=\",IF($M310<=GoalEntryData!$D$12,1,0),IF(GoalEntryData!$C$10=\">=\",IF($M310>=GoalEntryData!$D$12,1,0),\"\")))","v":""},"",{"$f":"IF($M310=\"\",\"\",IF(GoalEntryData!$C$10=\"<=\",IF($M310<=GoalEntryData!$D$10,1,0),IF(GoalEntryData!$C$10=\">=\",IF($M310>=GoalEntryData!$D$10,1,0),\"\")))","v":""},""]
[null,null,null,{"$f":"IF($B311=\"\",\"\",IF(GoalEntryData!$C$6=\"<=\",IF($B311<=GoalEntryData!$D$6,1,0),IF(GoalEntryData!$C$6=\">=\",IF($B311>=GoalEntryData!$D$6,1,0),\"\")))","v":""},"",{"$f":"IF($B311=\"\",\"\",IF(GoalEntryData!$C$7=\"<=\",IF($B311<=GoalEntryData!$D$7,1,0),IF(GoalEntryData!$C$7=\">=\",IF($B311>=GoalEntryData!$D$7,1,0),\"\")))","v":""},"",{"$f":"IF($B311=\"\",\"\",IF(GoalEntryData!$C$8=\"<=\",IF($B311<=GoalEntryData!$D$8,1,0),IF(GoalEntryData!$C$8=\">=\",IF($B311>=GoalEntryData!$D$8,1,0),\"\")))","v":""},"",{"$f":"IF($B311=\"\",\"\",IF(GoalEntryData!$C$6=\"<=\",IF($B311<=GoalEntryData!$D$6,1,0),IF(GoalEntryData!$C$6=\">=\",IF($B311>=GoalEntryData!$D$6,1,0),\"\")))","v":""},"",null,null,null,{"$f":"IF($M311=\"\",\"\",IF(GoalEntryData!$C$10=\"<=\",IF($M311<=GoalEntryData!$D$10,1,0),IF(GoalEntryData!$C$10=\">=\",IF($M311>=GoalEntryData!$D$10,1,0),\"\")))","v":""},"",{"$f":"IF($M311=\"\",\"\",IF(GoalEntryData!$C$11=\"<=\",IF($M311<=GoalEntryData!$D$11,1,0),IF(GoalEntryData!$C$11=\">=\",IF($M311>=GoalEntryData!$D$11,1,0),\"\")))","v":""},"",{"$f":"IF($M311=\"\",\"\",IF(GoalEntryData!$C$12=\"<=\",IF($M311<=GoalEntryData!$D$12,1,0),IF(GoalEntryData!$C$10=\">=\",IF($M311>=GoalEntryData!$D$12,1,0),\"\")))","v":""},"",{"$f":"IF($M311=\"\",\"\",IF(GoalEntryData!$C$10=\"<=\",IF($M311<=GoalEntryData!$D$10,1,0),IF(GoalEntryData!$C$10=\">=\",IF($M311>=GoalEntryData!$D$10,1,0),\"\")))","v":""},""]
[null,null,null,{"$f":"IF($B312=\"\",\"\",IF(GoalEntryData!$C$6=\"<=\",IF($B312<=GoalEntryData!$D$6,1,0),IF(GoalEntryData!$C$6=\">=\",IF($B312>=GoalEntryData!$D$6,1,0),\"\")))","v":""},"",{"$f":"IF($B312=\"\",\"\",IF(GoalEntryData!$C$7=\"<=\",IF($B312<=GoalEntryData!$D$7,1,0),IF(GoalEntryData!$C$7=\">=\",IF($B312>=GoalEntryData!$D$7,1,0),\"\")))","v":""},"",{"$f":"IF($B312=\"\",\"\",IF(GoalEntryData!$C$8=\"<=\",IF($B312<=GoalEntryData!$D$8,1,0),IF(GoalEntryData!$C$8=\">=\",IF($B312>=GoalEntryData!$D$8,1,0),\"\")))","v":""},"",{"$f":"IF($B312=\"\",\"\",IF(GoalEntryData!$C$6=\"<=\",IF($B312<=GoalEntryData!$D$6,1,0),IF(GoalEntryData!$C$6=\">=\",IF($B312>=GoalEntryData!$D$6,1,0),\"\")))","v":""},"",null,null,null,{"$f":"IF($M312=\"\",\"\",IF(GoalEntryData!$C$10=\"<=\",IF($M312<=GoalEntryData!$D$10,1,0),IF(GoalEntryData!$C$10=\">=\",IF($M312>=GoalEntryData!$D$10,1,0),\"\")))","v":""},"",{"$f":"IF($M312=\"\",\"\",IF(GoalEntryData!$C$11=\"<=\",IF($M312<=GoalEntryData!$D$11,1,0),IF(GoalEntryData!$C$11=\">=\",IF($M312>=GoalEntryData!$D$11,1,0),\"\")))","v":""},"",{"$f":"IF($M312=\"\",\"\",IF(GoalEntryData!$C$12=\"<=\",IF($M312<=GoalEntryData!$D$12,1,0),IF(GoalEntryData!$C$10=\">=\",IF($M312>=GoalEntryData!$D$12,1,0),\"\")))","v":""},"",{"$f":"IF($M312=\"\",\"\",IF(GoalEntryData!$C$10=\"<=\",IF($M312<=GoalEntryData!$D$10,1,0),IF(GoalEntryData!$C$10=\">=\",IF($M312>=GoalEntryData!$D$10,1,0),\"\")))","v":""},""]
[null,null,null,{"$f":"IF($B313=\"\",\"\",IF(GoalEntryData!$C$6=\"<=\",IF($B313<=GoalEntryData!$D$6,1,0),IF(GoalEntryData!$C$6=\">=\",IF($B313>=GoalEntryData!$D$6,1,0),\"\")))","v":""},"",{"$f":"IF($B313=\"\",\"\",IF(GoalEntryData!$C$7=\"<=\",IF($B313<=GoalEntryData!$D$7,1,0),IF(GoalEntryData!$C$7=\">=\",IF($B313>=GoalEntryData!$D$7,1,0),\"\")))","v":""},"",{"$f":"IF($B313=\"\",\"\",IF(GoalEntryData!$C$8=\"<=\",IF($B313<=GoalEntryData!$D$8,1,0),IF(GoalEntryData!$C$8=\">=\",IF($B313>=GoalEntryData!$D$8,1,0),\"\")))","v":""},"",{"$f":"IF($B313=\"\",\"\",IF(GoalEntryData!$C$6=\"<=\",IF($B313<=GoalEntryData!$D$6,1,0),IF(GoalEntryData!$C$6=\">=\",IF($B313>=GoalEntryData!$D$6,1,0),\"\")))","v":""},"",null,null,null,{"$f":"IF($M313=\"\",\"\",IF(GoalEntryData!$C$10=\"<=\",IF($M313<=GoalEntryData!$D$10,1,0),IF(GoalEntryData!$C$10=\">=\",IF($M313>=GoalEntryData!$D$10,1,0),\"\")))","v":""},"",{"$f":"IF($M313=\"\",\"\",IF(GoalEntryData!$C$11=\"<=\",IF($M313<=GoalEntryData!$D$11,1,0),IF(GoalEntryData!$C$11=\">=\",IF($M313>=GoalEntryData!$D$11,1,0),\"\")))","v":""},"",{"$f":"IF($M313=\"\",\"\",IF(GoalEntryData!$C$12=\"<=\",IF($M313<=GoalEntryData!$D$12,1,0),IF(GoalEntryData!$C$10=\">=\",IF($M313>=GoalEntryData!$D$12,1,0),\"\")))","v":""},"",{"$f":"IF($M313=\"\",\"\",IF(GoalEntryData!$C$10=\"<=\",IF($M313<=GoalEntryData!$D$10,1,0),IF(GoalEntryData!$C$10=\">=\",IF($M313>=GoalEntryData!$D$10,1,0),\"\")))","v":""},""]
[null,null,null,{"$f":"IF($B314=\"\",\"\",IF(GoalEntryData!$C$6=\"<=\",IF($B314<=GoalEntryData!$D$6,1,0),IF(GoalEntryData!$C$6=\">=\",IF($B314>=GoalEntryData!$D$6,1,0),\"\")))","v":""},"",{"$f":"IF($B314=\"\",\"\",IF(GoalEntryData!$C$7=\"<=\",IF($B314<=GoalEntryData!$D$7,1,0),IF(GoalEntryData!$C$7=\">=\",IF($B314>=GoalEntryData!$D$7,1,0),\"\")))","v":""},"",{"$f":"IF($B314=\"\",\"\",IF(GoalEntryData!$C$8=\"<=\",IF($B314<=GoalEntryData!$D$8,1,0),IF(GoalEntryData!$C$8=\">=\",IF($B314>=GoalEntryData!$D$8,1,0),\"\")))","v":""},"",{"$f":"IF($B314=\"\",\"\",IF(GoalEntryData!$C$6=\"<=\",IF($B314<=GoalEntryData!$D$6,1,0),IF(GoalEntryData!$C$6=\">=\",IF($B314>=GoalEntryData!$D$6,1,0),\"\")))","v":""},"",null,null,null,{"$f":"IF($M314=\"\",\"\",IF(GoalEntryData!$C$10=\"<=\",IF($M314<=GoalEntryData!$D$10,1,0),IF(GoalEntryData!$C$10=\">=\",IF($M314>=GoalEntryData!$D$10,1,0),\"\")))","v":""},"",{"$f":"IF($M314=\"\",\"\",IF(GoalEntryData!$C$11=\"<=\",IF($M314<=GoalEntryData!$D$11,1,0),IF(GoalEntryData!$C$11=\">=\",IF($M314>=GoalEntryData!$D$11,1,0),\"\")))","v":""},"",{"$f":"IF($M314=\"\",\"\",IF(GoalEntryData!$C$12=\"<=\",IF($M314<=GoalEntryData!$D$12,1,0),IF(GoalEntryData!$C$10=\">=\",IF($M314>=GoalEntryData!$D$12,1,0),\"\")))","v":""},"",{"$f":"IF($M314=\"\",\"\",IF(GoalEntryData!$C$10=\"<=\",IF($M314<=GoalEntryData!$D$10,1,0),IF(GoalEntryData!$C$10=\">=\",IF($M314>=GoalEntryData!$D$10,1,0),\"\")))","v":""},""]
[null,null,null,{"$f":"IF($B315=\"\",\"\",IF(GoalEntryData!$C$6=\"<=\",IF($B315<=GoalEntryData!$D$6,1,0),IF(GoalEntryData!$C$6=\">=\",IF($B315>=GoalEntryData!$D$6,1,0),\"\")))","v":""},"",{"$f":"IF($B315=\"\",\"\",IF(GoalEntryData!$C$7=\"<=\",IF($B315<=GoalEntryData!$D$7,1,0),IF(GoalEntryData!$C$7=\">=\",IF($B315>=GoalEntryData!$D$7,1,0),\"\")))","v":""},"",{"$f":"IF($B315=\"\",\"\",IF(GoalEntryData!$C$8=\"<=\",IF($B315<=GoalEntryData!$D$8,1,0),IF(GoalEntryData!$C$8=\">=\",IF($B315>=GoalEntryData!$D$8,1,0),\"\")))","v":""},"",{"$f":"IF($B315=\"\",\"\",IF(GoalEntryData!$C$6=\"<=\",IF($B315<=GoalEntryData!$D$6,1,0),IF(GoalEntryData!$C$6=\">=\",IF($B315>=GoalEntryData!$D$6,1,0),\"\")))","v":""},"",null,null,null,{"$f":"IF($M315=\"\",\"\",IF(GoalEntryData!$C$10=\"<=\",IF($M315<=GoalEntryData!$D$10,1,0),IF(GoalEntryData!$C$10=\">=\",IF($M315>=GoalEntryData!$D$10,1,0),\"\")))","v":""},{"$f":"IF(AND(P314>=1,O315=1),P314+1,O315)","v":""},{"$f":"IF($M315=\"\",\"\",IF(GoalEntryData!$C$11=\"<=\",IF($M315<=GoalEntryData!$D$11,1,0),IF(GoalEntryData!$C$11=\">=\",IF($M315>=GoalEntryData!$D$11,1,0),\"\")))","v":""},{"$f":"IF(AND(R314>=1,Q315=1),R314+1,Q315)","v":""},{"$f":"IF($M315=\"\",\"\",IF(GoalEntryData!$C$12=\"<=\",IF($M315<=GoalEntryData!$D$12,1,0),IF(GoalEntryData!$C$10=\">=\",IF($M315>=GoalEntryData!$D$12,1,0),\"\")))","v":""},{"$f":"IF(AND(T314>=1,S315=1),T314+1,S315)","v":""},{"$f":"IF($M315=\"\",\"\",IF(GoalEntryData!$C$10=\"<=\",IF($M315<=GoalEntryData!$D$10,1,0),IF(GoalEntryData!$C$10=\">=\",IF($M315>=GoalEntryData!$D$10,1,0),\"\")))","v":""},{"$f":"IF(AND(V314>=1,U315=1),V314+1,U315)","v":""}]
[null,null,null,{"$f":"IF($B316=\"\",\"\",IF(GoalEntryData!$C$6=\"<=\",IF($B316<=GoalEntryData!$D$6,1,0),IF(GoalEntryData!$C$6=\">=\",IF($B316>=GoalEntryData!$D$6,1,0),\"\")))","v":""},"",{"$f":"IF($B316=\"\",\"\",IF(GoalEntryData!$C$7=\"<=\",IF($B316<=GoalEntryData!$D$7,1,0),IF(GoalEntryData!$C$7=\">=\",IF($B316>=GoalEntryData!$D$7,1,0),\"\")))","v":""},"",{"$f":"IF($B316=\"\",\"\",IF(GoalEntryData!$C$8=\"<=\",IF($B316<=GoalEntryData!$D$8,1,0),IF(GoalEntryData!$C$8=\">=\",IF($B316>=GoalEntryData!$D$8,1,0),\"\")))","v":""},"",{"$f":"IF($B316=\"\",\"\",IF(GoalEntryData!$C$6=\"<=\",IF($B316<=GoalEntryData!$D$6,1,0),IF(GoalEntryData!$C$6=\">=\",IF($B316>=GoalEntryData!$D$6,1,0),\"\")))","v":""},"",null,null,null,{"$f":"IF($M316=\"\",\"\",IF(GoalEntryData!$C$10=\"<=\",IF($M316<=GoalEntryData!$D$10,1,0),IF(GoalEntryData!$C$10=\">=\",IF($M316>=GoalEntryData!$D$10,1,0),\"\")))","v":""},{"$f":"IF(AND(P315>=1,O316=1),P315+1,O316)","v":""},{"$f":"IF($M316=\"\",\"\",IF(GoalEntryData!$C$11=\"<=\",IF($M316<=GoalEntryData!$D$11,1,0),IF(GoalEntryData!$C$11=\">=\",IF($M316>=GoalEntryData!$D$11,1,0),\"\")))","v":""},{"$f":"IF(AND(R315>=1,Q316=1),R315+1,Q316)","v":""},{"$f":"IF($M316=\"\",\"\",IF(GoalEntryData!$C$12=\"<=\",IF($M316<=GoalEntryData!$D$12,1,0),IF(GoalEntryData!$C$10=\">=\",IF($M316>=GoalEntryData!$D$12,1,0),\"\")))","v":""},{"$f":"IF(AND(T315>=1,S316=1),T315+1,S316)","v":""},{"$f":"IF($M316=\"\",\"\",IF(GoalEntryData!$C$10=\"<=\",IF($M316<=GoalEntryData!$D$10,1,0),IF(GoalEntryData!$C$10=\">=\",IF($M316>=GoalEntryData!$D$10,1,0),\"\")))","v":""},{"$f":"IF(AND(V315>=1,U316=1),V315+1,U316)","v":""}]

{"sheet":"Lookup","index":3,"n_rows":19,"n_cols":3,"rows_kept":19,"cut":false,"hidden":true,"merged":[]}
["Holidays","Goal","Data Per"]
["2014-12-23",1,{"$f":"GoalEntryData!#REF!","v":{"$error":"#REF!"}}]
["2014-12-24",2,{"$f":"GoalEntryData!#REF!","v":{"$error":"#REF!"}}]
["2014-12-25"]
["2014-12-26"]
["2014-12-27"]
["2014-12-28"]
["2014-12-29"]
["2014-12-30"]
["2014-12-31"]
["2015-01-01"]
["2015-01-02"]
["2015-01-19"]
["2015-02-16"]
["2015-04-13"]
["2015-04-14"]
["2015-04-15"]
["2015-04-16"]
["2015-04-17"]

{"sheet":"Goal2Print","index":4,"n_rows":36,"n_cols":9,"rows_kept":36,"cut":false,"hidden":true,"merged":[[35,2,35,3],[35,5,35,6],[35,8,35,9],[37,2,37,7],[39,2,40,7],[33,2,33,3],[33,5,33,6],[33,8,33,9],[34,2,34,3],[34,5,34,6],[34,8,34,9],[31,2,31,3],[31,5,31,6],[31,8,31,9],[32,2,32,3],[32,5,32,6],[32,8,32,9],[29,2,29,3],[29,5,29,6],[29,8,29,9],[30,2,30,3],[30,5,30,6],[30,8,30,9],[27,2,27,3],[27,5,27,6],[27,8,27,9],[28,2,28,3],[28,5,28,6],[28,8,28,9],[1,3,1,8],[2,3,2,8],[3,3,4,8],[25,1,25,9],[26,2,26,3],[26,5,26,6],[26,8,26,9]]}
[]
[null,null,null,{"$f":"Goal2Graph!C2","v":""}]
[]
[null,null,null,{"$f":"Goal2Graph!B4","v":""}]
[]
[]
[]
[]
[]
[]
[]
[]
[]
[]
[]
[]
[]
[]
[]
[]
[]
[]
[]
[]
[]
[null,"Last 30 Behavior Incidents"]
[null,{"$f":"Goal2Graph!$B8","v":""},{"$f":"Goal2Graph!$C8","v":""},null,{"$f":"Goal2Graph!B18","v":""},{"$f":"Goal2Graph!C18","v":""},null,{"$f":"Goal2Graph!B28","v":""},{"$f":"Goal2Graph!C28","v":""}]
[null,{"$f":"Goal2Graph!$B9","v":""},{"$f":"Goal2Graph!$C9","v":""},null,{"$f":"Goal2Graph!B19","v":""},{"$f":"Goal2Graph!C19","v":""},null,{"$f":"Goal2Graph!B29","v":""},{"$f":"Goal2Graph!C29","v":""}]
[null,{"$f":"Goal2Graph!$B10","v":""},{"$f":"Goal2Graph!$C10","v":""},null,{"$f":"Goal2Graph!B20","v":""},{"$f":"Goal2Graph!C20","v":""},null,{"$f":"Goal2Graph!B30","v":""},{"$f":"Goal2Graph!C30","v":""}]
[null,{"$f":"Goal2Graph!$B11","v":""},{"$f":"Goal2Graph!$C11","v":""},null,{"$f":"Goal2Graph!B21","v":""},{"$f":"Goal2Graph!C21","v":""},null,{"$f":"Goal2Graph!B31","v":""},{"$f":"Goal2Graph!C31","v":""}]
[null,{"$f":"Goal2Graph!$B12","v":""},{"$f":"Goal2Graph!$C12","v":""},null,{"$f":"Goal2Graph!B22","v":""},{"$f":"Goal2Graph!C22","v":""},null,{"$f":"Goal2Graph!B32","v":""},{"$f":"Goal2Graph!C32","v":""}]
[null,{"$f":"Goal2Graph!$B13","v":""},{"$f":"Goal2Graph!$C13","v":""},null,{"$f":"Goal2Graph!B23","v":""},{"$f":"Goal2Graph!C23","v":""},null,{"$f":"Goal2Graph!B33","v":""},{"$f":"Goal2Graph!C33","v":""}]
[null,{"$f":"Goal2Graph!$B14","v":""},{"$f":"Goal2Graph!$C14","v":""},null,{"$f":"Goal2Graph!B24","v":""},{"$f":"Goal2Graph!C24","v":""},null,{"$f":"Goal2Graph!B34","v":""},{"$f":"Goal2Graph!C34","v":""}]
[null,{"$f":"Goal2Graph!$B15","v":""},{"$f":"Goal2Graph!$C15","v":""},null,{"$f":"Goal2Graph!B25","v":""},{"$f":"Goal2Graph!C25","v":""},null,{"$f":"Goal2Graph!B35","v":""},{"$f":"Goal2Graph!C35","v":""}]
[null,{"$f":"Goal2Graph!$B16","v":""},{"$f":"Goal2Graph!$C16","v":""},null,{"$f":"Goal2Graph!B26","v":""},{"$f":"Goal2Graph!C26","v":""},null,{"$f":"Goal2Graph!B36","v":""},{"$f":"Goal2Graph!C36","v":""}]
[null,{"$f":"Goal2Graph!$B17","v":""},{"$f":"Goal2Graph!$C17","v":""},null,{"$f":"Goal2Graph!B27","v":""},{"$f":"Goal2Graph!C27","v":""},null,{"$f":"Goal2Graph!B37","v":""},{"$f":"Goal2Graph!C37","v":""}]

{"sheet":"Goal1Graph","index":5,"n_rows":37,"n_cols":9,"rows_kept":37,"cut":false,"hidden":true,"merged":[[33,2,33,4],[34,2,34,4],[35,2,35,4],[36,2,36,4],[27,2,27,4],[28,2,28,4],[29,2,29,4],[30,2,30,4],[31,2,31,4],[32,2,32,4],[26,2,26,4],[15,2,15,4],[16,2,16,4],[17,2,17,4],[18,2,18,4],[19,2,19,4],[20,2,20,4],[21,2,21,4],[22,2,22,4],[23,2,23,4],[24,2,24,4],[25,2,25,4],[14,2,14,4],[3,1,3,8],[5,1,5,4],[6,1,6,4],[7,2,7,4],[8,2,8,4],[9,2,9,4],[10,2,10,4],[11,2,11,4],[12,2,12,4],[13,2,13,4]]}
[]
[null,null,{"$f":"IF(DataEntry!F8=\"\",\"\",\"Target Behavior: \"&DataEntry!F8)","v":""}]
[]
[null,{"$f":"IF(DataEntry!F10=\"\",\"\",\"Goal: \"&DataEntry!F10)","v":""}]
[]
[null,"Data Entry (Last 30 entries):"]
[1,null,null,null,null,{"$f":"GoalEntryData!$E$2","v":"day"},{"$f":"GoalEntryData!$D$2","v":"<Select one>"},"Goal","Aim Line"]
[1,{"$f":"IF(RawData!C2=0,\"\",LARGE(RawData!C:C,Goal1Graph!A8))","v":""},{"$f":"IF(B8=\"\",\"\",INDEX(RawData!B:B,MATCH(B8,RawData!C:C,0))&\" \"&GoalEntryData!$D$2)","v":""},null,null,{"$f":"B8","v":""},{"$f":"IF(B8=\"\",\"\",INDEX(RawData!B:B,MATCH(F8,RawData!C:C,0)))","v":""},{"$f":"IF(F8<>\"\",GoalEntryData!$C$2,\"\")","v":""},{"$f":"IF(F8=\"\",\"\",GoalEntryData!$W$2+((GoalEntryData!$C$2-GoalEntryData!$W$2)*(($F8-GoalEntryData!$Y$2)/(GoalEntryData!$G$2-GoalEntryData!$Y$2))))","v":""}]
[2,{"$f":"IF(RawData!C3=0,\"\",LARGE(RawData!C:C,Goal1Graph!A9))","v":""},{"$f":"IF(B9=\"\",\"\",INDEX(RawData!B:B,MATCH(B9,RawData!C:C,0))&\" \"&GoalEntryData!$D$2)","v":""},null,null,{"$f":"B9","v":""},{"$f":"IF(B9=\"\",\"\",INDEX(RawData!B:B,MATCH(F9,RawData!C:C,0)))","v":""},{"$f":"IF(F9<>\"\",GoalEntryData!$C$2,\"\")","v":""},{"$f":"IF(F9=\"\",\"\",GoalEntryData!$W$2+((GoalEntryData!$C$2-GoalEntryData!$W$2)*(($F9-GoalEntryData!$Y$2)/(GoalEntryData!$G$2-GoalEntryData!$Y$2))))","v":""}]
[3,{"$f":"IF(RawData!C4=0,\"\",LARGE(RawData!C:C,Goal1Graph!A10))","v":""},{"$f":"IF(B10=\"\",\"\",INDEX(RawData!B:B,MATCH(B10,RawData!C:C,0))&\" \"&GoalEntryData!$D$2)","v":""},null,null,{"$f":"B10","v":""},{"$f":"IF(B10=\"\",\"\",INDEX(RawData!B:B,MATCH(F10,RawData!C:C,0)))","v":""},{"$f":"IF(F10<>\"\",GoalEntryData!$C$2,\"\")","v":""},{"$f":"IF(F10=\"\",\"\",GoalEntryData!$W$2+((GoalEntryData!$C$2-GoalEntryData!$W$2)*(($F10-GoalEntryData!$Y$2)/(GoalEntryData!$G$2-GoalEntryData!$Y$2))))","v":""}]
[4,{"$f":"IF(RawData!C5=0,\"\",LARGE(RawData!C:C,Goal1Graph!A11))","v":""},{"$f":"IF(B11=\"\",\"\",INDEX(RawData!B:B,MATCH(B11,RawData!C:C,0))&\" \"&GoalEntryData!$D$2)","v":""},null,null,{"$f":"B11","v":""},{"$f":"IF(B11=\"\",\"\",INDEX(RawData!B:B,MATCH(F11,RawData!C:C,0)))","v":""},{"$f":"IF(F11<>\"\",GoalEntryData!$C$2,\"\")","v":""},{"$f":"IF(F11=\"\",\"\",GoalEntryData!$W$2+((GoalEntryData!$C$2-GoalEntryData!$W$2)*(($F11-GoalEntryData!$Y$2)/(GoalEntryData!$G$2-GoalEntryData!$Y$2))))","v":""}]
[5,{"$f":"IF(RawData!C6=0,\"\",LARGE(RawData!C:C,Goal1Graph!A12))","v":""},{"$f":"IF(B12=\"\",\"\",INDEX(RawData!B:B,MATCH(B12,RawData!C:C,0))&\" \"&GoalEntryData!$D$2)","v":""},null,null,"",{"$f":"IF(B12=\"\",\"\",INDEX(RawData!B:B,MATCH(F12,RawData!C:C,0)))","v":""},{"$f":"IF(F12<>\"\",GoalEntryData!$C$2,\"\")","v":""},{"$f":"IF(F12=\"\",\"\",GoalEntryData!$W$2+((GoalEntryData!$C$2-GoalEntryData!$W$2)*(($F12-GoalEntryData!$Y$2)/(GoalEntryData!$G$2-GoalEntryData!$Y$2))))","v":""}]
[6,{"$f":"IF(RawData!C7=0,\"\",LARGE(RawData!C:C,Goal1Graph!A13))","v":""},{"$f":"IF(B13=\"\",\"\",INDEX(RawData!B:B,MATCH(B13,RawData!C:C,0))&\" \"&GoalEntryData!$D$2)","v":""},null,null,"",{"$f":"IF(B13=\"\",\"\",INDEX(RawData!B:B,MATCH(F13,RawData!C:C,0)))","v":""},{"$f":"IF(F13<>\"\",GoalEntryData!$C$2,\"\")","v":""},{"$f":"IF(F13=\"\",\"\",GoalEntryData!$W$2+((GoalEntryData!$C$2-GoalEntryData!$W$2)*(($F13-GoalEntryData!$Y$2)/(GoalEntryData!$G$2-GoalEntryData!$Y$2))))","v":""}]
[7,{"$f":"IF(RawData!C8=0,\"\",LARGE(RawData!C:C,Goal1Graph!A14))","v":""},{"$f":"IF(B14=\"\",\"\",INDEX(RawData!B:B,MATCH(B14,RawData!C:C,0))&\" \"&GoalEntryData!$D$2)","v":""},null,null,"",{"$f":"IF(B14=\"\",\"\",INDEX(RawData!B:B,MATCH(F14,RawData!C:C,0)))","v":""},{"$f":"IF(F14<>\"\",GoalEntryData!$C$2,\"\")","v":""},{"$f":"IF(F14=\"\",\"\",GoalEntryData!$W$2+((GoalEntryData!$C$2-GoalEntryData!$W$2)*(($F14-GoalEntryData!$Y$2)/(GoalEntryData!$G$2-GoalEntryData!$Y$2))))","v":""}]
[8,{"$f":"IF(RawData!C9=0,\"\",LARGE(RawData!C:C,Goal1Graph!A15))","v":""},{"$f":"IF(B15=\"\",\"\",INDEX(RawData!B:B,MATCH(B15,RawData!C:C,0))&\" \"&GoalEntryData!$D$2)","v":""},null,null,"",{"$f":"IF(B15=\"\",\"\",INDEX(RawData!B:B,MATCH(F15,RawData!C:C,0)))","v":""},{"$f":"IF(F15<>\"\",GoalEntryData!$C$2,\"\")","v":""},{"$f":"IF(F15=\"\",\"\",GoalEntryData!$W$2+((GoalEntryData!$C$2-GoalEntryData!$W$2)*(($F15-GoalEntryData!$Y$2)/(GoalEntryData!$G$2-GoalEntryData!$Y$2))))","v":""}]
[9,{"$f":"IF(RawData!C10=0,\"\",LARGE(RawData!C:C,Goal1Graph!A16))","v":""},{"$f":"IF(B16=\"\",\"\",INDEX(RawData!B:B,MATCH(B16,RawData!C:C,0))&\" \"&GoalEntryData!$D$2)","v":""},null,null,"",{"$f":"IF(B16=\"\",\"\",INDEX(RawData!B:B,MATCH(F16,RawData!C:C,0)))","v":""},{"$f":"IF(F16<>\"\",GoalEntryData!$C$2,\"\")","v":""},{"$f":"IF(F16=\"\",\"\",GoalEntryData!$W$2+((GoalEntryData!$C$2-GoalEntryData!$W$2)*(($F16-GoalEntryData!$Y$2)/(GoalEntryData!$G$2-GoalEntryData!$Y$2))))","v":""}]
[10,{"$f":"IF(RawData!C11=0,\"\",LARGE(RawData!C:C,Goal1Graph!A17))","v":""},{"$f":"IF(B17=\"\",\"\",INDEX(RawData!B:B,MATCH(B17,RawData!C:C,0))&\" \"&GoalEntryData!$D$2)","v":""},null,null,"",{"$f":"IF(B17=\"\",\"\",INDEX(RawData!B:B,MATCH(F17,RawData!C:C,0)))","v":""},{"$f":"IF(F17<>\"\",GoalEntryData!$C$2,\"\")","v":""},{"$f":"IF(F17=\"\",\"\",GoalEntryData!$W$2+((GoalEntryData!$C$2-GoalEntryData!$W$2)*(($F17-GoalEntryData!$Y$2)/(GoalEntryData!$G$2-GoalEntryData!$Y$2))))","v":""}]
[11,{"$f":"IF(RawData!C12=0,\"\",LARGE(RawData!C:C,Goal1Graph!A18))","v":""},{"$f":"IF(B18=\"\",\"\",INDEX(RawData!B:B,MATCH(B18,RawData!C:C,0))&\" \"&GoalEntryData!$D$2)","v":""},null,null,"",{"$f":"IF(B18=\"\",\"\",INDEX(RawData!B:B,MATCH(F18,RawData!C:C,0)))","v":""},{"$f":"IF(F18<>\"\",GoalEntryData!$C$2,\"\")","v":""},{"$f":"IF(F18=\"\",\"\",GoalEntryData!$W$2+((GoalEntryData!$C$2-GoalEntryData!$W$2)*(($F18-GoalEntryData!$Y$2)/(GoalEntryData!$G$2-GoalEntryData!$Y$2))))","v":""}]
[12,{"$f":"IF(RawData!C13=0,\"\",LARGE(RawData!C:C,Goal1Graph!A19))","v":""},{"$f":"IF(B19=\"\",\"\",INDEX(RawData!B:B,MATCH(B19,RawData!C:C,0))&\" \"&GoalEntryData!$D$2)","v":""},null,null,"",{"$f":"IF(B19=\"\",\"\",INDEX(RawData!B:B,MATCH(F19,RawData!C:C,0)))","v":""},{"$f":"IF(F19<>\"\",GoalEntryData!$C$2,\"\")","v":""},{"$f":"IF(F19=\"\",\"\",GoalEntryData!$W$2+((GoalEntryData!$C$2-GoalEntryData!$W$2)*(($F19-GoalEntryData!$Y$2)/(GoalEntryData!$G$2-GoalEntryData!$Y$2))))","v":""}]
[13,{"$f":"IF(RawData!C14=0,\"\",LARGE(RawData!C:C,Goal1Graph!A20))","v":""},{"$f":"IF(B20=\"\",\"\",INDEX(RawData!B:B,MATCH(B20,RawData!C:C,0))&\" \"&GoalEntryData!$D$2)","v":""},null,null,"",{"$f":"IF(B20=\"\",\"\",INDEX(RawData!B:B,MATCH(F20,RawData!C:C,0)))","v":""},{"$f":"IF(F20<>\"\",GoalEntryData!$C$2,\"\")","v":""},{"$f":"IF(F20=\"\",\"\",GoalEntryData!$W$2+((GoalEntryData!$C$2-GoalEntryData!$W$2)*(($F20-GoalEntryData!$Y$2)/(GoalEntryData!$G$2-GoalEntryData!$Y$2))))","v":""}]
[14,{"$f":"IF(RawData!C15=0,\"\",LARGE(RawData!C:C,Goal1Graph!A21))","v":""},{"$f":"IF(B21=\"\",\"\",INDEX(RawData!B:B,MATCH(B21,RawData!C:C,0))&\" \"&GoalEntryData!$D$2)","v":""},null,null,"",{"$f":"IF(B21=\"\",\"\",INDEX(RawData!B:B,MATCH(F21,RawData!C:C,0)))","v":""},{"$f":"IF(F21<>\"\",GoalEntryData!$C$2,\"\")","v":""},{"$f":"IF(F21=\"\",\"\",GoalEntryData!$W$2+((GoalEntryData!$C$2-GoalEntryData!$W$2)*(($F21-GoalEntryData!$Y$2)/(GoalEntryData!$G$2-GoalEntryData!$Y$2))))","v":""}]
[15,{"$f":"IF(RawData!C16=0,\"\",LARGE(RawData!C:C,Goal1Graph!A22))","v":""},{"$f":"IF(B22=\"\",\"\",INDEX(RawData!B:B,MATCH(B22,RawData!C:C,0))&\" \"&GoalEntryData!$D$2)","v":""},null,null,"",{"$f":"IF(B22=\"\",\"\",INDEX(RawData!B:B,MATCH(F22,RawData!C:C,0)))","v":""},{"$f":"IF(F22<>\"\",GoalEntryData!$C$2,\"\")","v":""},{"$f":"IF(F22=\"\",\"\",GoalEntryData!$W$2+((GoalEntryData!$C$2-GoalEntryData!$W$2)*(($F22-GoalEntryData!$Y$2)/(GoalEntryData!$G$2-GoalEntryData!$Y$2))))","v":""}]
[16,{"$f":"IF(RawData!C17=0,\"\",LARGE(RawData!C:C,Goal1Graph!A23))","v":""},{"$f":"IF(B23=\"\",\"\",INDEX(RawData!B:B,MATCH(B23,RawData!C:C,0))&\" \"&GoalEntryData!$D$2)","v":""},null,null,"",{"$f":"IF(B23=\"\",\"\",INDEX(RawData!B:B,MATCH(F23,RawData!C:C,0)))","v":""},{"$f":"IF(F23<>\"\",GoalEntryData!$C$2,\"\")","v":""},{"$f":"IF(F23=\"\",\"\",GoalEntryData!$W$2+((GoalEntryData!$C$2-GoalEntryData!$W$2)*(($F23-GoalEntryData!$Y$2)/(GoalEntryData!$G$2-GoalEntryData!$Y$2))))","v":""}]
[17,{"$f":"IF(RawData!C18=0,\"\",LARGE(RawData!C:C,Goal1Graph!A24))","v":""},{"$f":"IF(B24=\"\",\"\",INDEX(RawData!B:B,MATCH(B24,RawData!C:C,0))&\" \"&GoalEntryData!$D$2)","v":""},null,null,"",{"$f":"IF(B24=\"\",\"\",INDEX(RawData!B:B,MATCH(F24,RawData!C:C,0)))","v":""},{"$f":"IF(F24<>\"\",GoalEntryData!$C$2,\"\")","v":""},{"$f":"IF(F24=\"\",\"\",GoalEntryData!$W$2+((GoalEntryData!$C$2-GoalEntryData!$W$2)*(($F24-GoalEntryData!$Y$2)/(GoalEntryData!$G$2-GoalEntryData!$Y$2))))","v":""}]
[18,{"$f":"IF(RawData!C19=0,\"\",LARGE(RawData!C:C,Goal1Graph!A25))","v":""},{"$f":"IF(B25=\"\",\"\",INDEX(RawData!B:B,MATCH(B25,RawData!C:C,0))&\" \"&GoalEntryData!$D$2)","v":""},null,null,"",{"$f":"IF(B25=\"\",\"\",INDEX(RawData!B:B,MATCH(F25,RawData!C:C,0)))","v":""},{"$f":"IF(F25<>\"\",GoalEntryData!$C$2,\"\")","v":""},{"$f":"IF(F25=\"\",\"\",GoalEntryData!$W$2+((GoalEntryData!$C$2-GoalEntryData!$W$2)*(($F25-GoalEntryData!$Y$2)/(GoalEntryData!$G$2-GoalEntryData!$Y$2))))","v":""}]
[19,{"$f":"IF(RawData!C20=0,\"\",LARGE(RawData!C:C,Goal1Graph!A26))","v":""},{"$f":"IF(B26=\"\",\"\",INDEX(RawData!B:B,MATCH(B26,RawData!C:C,0))&\" \"&GoalEntryData!$D$2)","v":""},null,null,"",{"$f":"IF(B26=\"\",\"\",INDEX(RawData!B:B,MATCH(F26,RawData!C:C,0)))","v":""},{"$f":"IF(F26<>\"\",GoalEntryData!$C$2,\"\")","v":""},{"$f":"IF(F26=\"\",\"\",GoalEntryData!$W$2+((GoalEntryData!$C$2-GoalEntryData!$W$2)*(($F26-GoalEntryData!$Y$2)/(GoalEntryData!$G$2-GoalEntryData!$Y$2))))","v":""}]
[20,{"$f":"IF(RawData!C21=0,\"\",LARGE(RawData!C:C,Goal1Graph!A27))","v":""},{"$f":"IF(B27=\"\",\"\",INDEX(RawData!B:B,MATCH(B27,RawData!C:C,0))&\" \"&GoalEntryData!$D$2)","v":""},null,null,"",{"$f":"IF(B27=\"\",\"\",INDEX(RawData!B:B,MATCH(F27,RawData!C:C,0)))","v":""},{"$f":"IF(F27<>\"\",GoalEntryData!$C$2,\"\")","v":""},{"$f":"IF(F27=\"\",\"\",GoalEntryData!$W$2+((GoalEntryData!$C$2-GoalEntryData!$W$2)*(($F27-GoalEntryData!$Y$2)/(GoalEntryData!$G$2-GoalEntryData!$Y$2))))","v":""}]
[21,{"$f":"IF(RawData!C22=0,\"\",LARGE(RawData!C:C,Goal1Graph!A28))","v":""},{"$f":"IF(B28=\"\",\"\",INDEX(RawData!B:B,MATCH(B28,RawData!C:C,0))&\" \"&GoalEntryData!$D$2)","v":""},null,null,"",{"$f":"IF(B28=\"\",\"\",INDEX(RawData!B:B,MATCH(F28,RawData!C:C,0)))","v":""},{"$f":"IF(F28<>\"\",GoalEntryData!$C$2,\"\")","v":""},{"$f":"IF(F28=\"\",\"\",GoalEntryData!$W$2+((GoalEntryData!$C$2-GoalEntryData!$W$2)*(($F28-GoalEntryData!$Y$2)/(GoalEntryData!$G$2-GoalEntryData!$Y$2))))","v":""}]
[22,{"$f":"IF(RawData!C23=0,\"\",LARGE(RawData!C:C,Goal1Graph!A29))","v":""},{"$f":"IF(B29=\"\",\"\",INDEX(RawData!B:B,MATCH(B29,RawData!C:C,0))&\" \"&GoalEntryData!$D$2)","v":""},null,null,"",{"$f":"IF(B29=\"\",\"\",INDEX(RawData!B:B,MATCH(F29,RawData!C:C,0)))","v":""},{"$f":"IF(F29<>\"\",GoalEntryData!$C$2,\"\")","v":""},{"$f":"IF(F29=\"\",\"\",GoalEntryData!$W$2+((GoalEntryData!$C$2-GoalEntryData!$W$2)*(($F29-GoalEntryData!$Y$2)/(GoalEntryData!$G$2-GoalEntryData!$Y$2))))","v":""}]
[23,{"$f":"IF(RawData!C24=0,\"\",LARGE(RawData!C:C,Goal1Graph!A30))","v":""},{"$f":"IF(B30=\"\",\"\",INDEX(RawData!B:B,MATCH(B30,RawData!C:C,0))&\" \"&GoalEntryData!$D$2)","v":""},null,null,"",{"$f":"IF(B30=\"\",\"\",INDEX(RawData!B:B,MATCH(F30,RawData!C:C,0)))","v":""},{"$f":"IF(F30<>\"\",GoalEntryData!$C$2,\"\")","v":""},{"$f":"IF(F30=\"\",\"\",GoalEntryData!$W$2+((GoalEntryData!$C$2-GoalEntryData!$W$2)*(($F30-GoalEntryData!$Y$2)/(GoalEntryData!$G$2-GoalEntryData!$Y$2))))","v":""}]
[24,{"$f":"IF(RawData!C25=0,\"\",LARGE(RawData!C:C,Goal1Graph!A31))","v":""},{"$f":"IF(B31=\"\",\"\",INDEX(RawData!B:B,MATCH(B31,RawData!C:C,0))&\" \"&GoalEntryData!$D$2)","v":""},null,null,"",{"$f":"IF(B31=\"\",\"\",INDEX(RawData!B:B,MATCH(F31,RawData!C:C,0)))","v":""},{"$f":"IF(F31<>\"\",GoalEntryData!$C$2,\"\")","v":""},{"$f":"IF(F31=\"\",\"\",GoalEntryData!$W$2+((GoalEntryData!$C$2-GoalEntryData!$W$2)*(($F31-GoalEntryData!$Y$2)/(GoalEntryData!$G$2-GoalEntryData!$Y$2))))","v":""}]
[25,{"$f":"IF(RawData!C26=0,\"\",LARGE(RawData!C:C,Goal1Graph!A32))","v":""},{"$f":"IF(B32=\"\",\"\",INDEX(RawData!B:B,MATCH(B32,RawData!C:C,0))&\" \"&GoalEntryData!$D$2)","v":""},null,null,"",{"$f":"IF(B32=\"\",\"\",INDEX(RawData!B:B,MATCH(F32,RawData!C:C,0)))","v":""},{"$f":"IF(F32<>\"\",GoalEntryData!$C$2,\"\")","v":""},{"$f":"IF(F32=\"\",\"\",GoalEntryData!$W$2+((GoalEntryData!$C$2-GoalEntryData!$W$2)*(($F32-GoalEntryData!$Y$2)/(GoalEntryData!$G$2-GoalEntryData!$Y$2))))","v":""}]
[26,{"$f":"IF(RawData!C27=0,\"\",LARGE(RawData!C:C,Goal1Graph!A33))","v":""},{"$f":"IF(B33=\"\",\"\",INDEX(RawData!B:B,MATCH(B33,RawData!C:C,0))&\" \"&GoalEntryData!$D$2)","v":""},null,null,"",{"$f":"IF(B33=\"\",\"\",INDEX(RawData!B:B,MATCH(F33,RawData!C:C,0)))","v":""},{"$f":"IF(F33<>\"\",GoalEntryData!$C$2,\"\")","v":""},{"$f":"IF(F33=\"\",\"\",GoalEntryData!$W$2+((GoalEntryData!$C$2-GoalEntryData!$W$2)*(($F33-GoalEntryData!$Y$2)/(GoalEntryData!$G$2-GoalEntryData!$Y$2))))","v":""}]
[27,{"$f":"IF(RawData!C28=0,\"\",LARGE(RawData!C:C,Goal1Graph!A34))","v":""},{"$f":"IF(B34=\"\",\"\",INDEX(RawData!B:B,MATCH(B34,RawData!C:C,0))&\" \"&GoalEntryData!$D$2)","v":""},null,null,"",{"$f":"IF(B34=\"\",\"\",INDEX(RawData!B:B,MATCH(F34,RawData!C:C,0)))","v":""},{"$f":"IF(F34<>\"\",GoalEntryData!$C$2,\"\")","v":""},{"$f":"IF(F34=\"\",\"\",GoalEntryData!$W$2+((GoalEntryData!$C$2-GoalEntryData!$W$2)*(($F34-GoalEntryData!$Y$2)/(GoalEntryData!$G$2-GoalEntryData!$Y$2))))","v":""}]
[28,{"$f":"IF(RawData!C29=0,\"\",LARGE(RawData!C:C,Goal1Graph!A35))","v":""},{"$f":"IF(B35=\"\",\"\",INDEX(RawData!B:B,MATCH(B35,RawData!C:C,0))&\" \"&GoalEntryData!$D$2)","v":""},null,null,"",{"$f":"IF(B35=\"\",\"\",INDEX(RawData!B:B,MATCH(F35,RawData!C:C,0)))","v":""},{"$f":"IF(F35<>\"\",GoalEntryData!$C$2,\"\")","v":""},{"$f":"IF(F35=\"\",\"\",GoalEntryData!$W$2+((GoalEntryData!$C$2-GoalEntryData!$W$2)*(($F35-GoalEntryData!$Y$2)/(GoalEntryData!$G$2-GoalEntryData!$Y$2))))","v":""}]
[29,{"$f":"IF(RawData!C30=0,\"\",LARGE(RawData!C:C,Goal1Graph!A36))","v":""},{"$f":"IF(B36=\"\",\"\",INDEX(RawData!B:B,MATCH(B36,RawData!C:C,0))&\" \"&GoalEntryData!$D$2)","v":""},null,null,"",{"$f":"IF(B36=\"\",\"\",INDEX(RawData!B:B,MATCH(F36,RawData!C:C,0)))","v":""},{"$f":"IF(F36<>\"\",GoalEntryData!$C$2,\"\")","v":""},{"$f":"IF(F36=\"\",\"\",GoalEntryData!$W$2+((GoalEntryData!$C$2-GoalEntryData!$W$2)*(($F36-GoalEntryData!$Y$2)/(GoalEntryData!$G$2-GoalEntryData!$Y$2))))","v":""}]
[30,{"$f":"IF(RawData!C31=0,\"\",LARGE(RawData!C:C,Goal1Graph!A37))","v":""},{"$f":"IF(B37=\"\",\"\",INDEX(RawData!B:B,MATCH(B37,RawData!C:C,0))&\" \"&GoalEntryData!$D$2)","v":""},null,null,"",{"$f":"IF(B37=\"\",\"\",INDEX(RawData!B:B,MATCH(F37,RawData!C:C,0)))","v":""},{"$f":"IF(F37<>\"\",GoalEntryData!$C$2,\"\")","v":""},{"$f":"IF(F37=\"\",\"\",GoalEntryData!$W$2+((GoalEntryData!$C$2-GoalEntryData!$W$2)*(($F37-GoalEntryData!$Y$2)/(GoalEntryData!$G$2-GoalEntryData!$Y$2))))","v":""}]

{"sheet":"Goal2Graph","index":6,"n_rows":37,"n_cols":9,"rows_kept":37,"cut":false,"hidden":true,"merged":[[1,2,1,8],[3,1,3,8],[20,2,20,4],[9,2,9,4],[10,2,10,4],[11,2,11,4],[12,2,12,4],[13,2,13,4],[14,2,14,4],[5,1,5,4],[7,2,7,4],[8,2,8,4],[6,1,6,4],[34,2,34,4],[35,2,35,4],[36,2,36,4],[27,2,27,4],[28,2,28,4],[29,2,29,4],[30,2,30,4],[31,2,31,4],[32,2,32,4],[33,2,33,4],[26,2,26,4],[15,2,15,4],[16,2,16,4],[17,2,17,4],[18,2,18,4],[19,2,19,4],[21,2,21,4],[22,2,22,4],[23,2,23,4],[24,2,24,4],[25,2,25,4]]}
[]
[null,null,{"$f":"IF(DataEntry!F14=\"\",\"\",\"Target Behavior: \"&DataEntry!F14)","v":""}]
[]
[null,{"$f":"IF(DataEntry!F14=\"\",\"\",\"Goal: \"&DataEntry!F16)","v":""}]
[]
[null,"Data Entry (Last 30 entries):"]
[1,null,null,null,null,{"$f":"GoalEntryData!$E$3","v":"day"},{"$f":"GoalEntryData!$D$3","v":"<Select one>"},"Goal","Aim Line"]
[1,{"$f":"IF(RawData!N2=0,\"\",LARGE(RawData!N:N,Goal2Graph!A8))","v":""},{"$f":"IF(B8=\"\",\"\",INDEX(RawData!M:M,MATCH(B8,RawData!N:N,0))&\" \"&GoalEntryData!$D$3)","v":""},null,null,{"$f":"B8","v":""},{"$f":"IF(B8=\"\",\"\",INDEX(RawData!M:M,MATCH(F8,RawData!N:N,0)))","v":""},{"$f":"IF(F8<>\"\",GoalEntryData!$C$3,\"\")","v":""},{"$f":"IF(F8=\"\",\"\",GoalEntryData!$W$3+((GoalEntryData!$C$3-GoalEntryData!$W$3)*(($F8-GoalEntryData!$Y$3)/(GoalEntryData!$G$3-GoalEntryData!$Y$3))))","v":""}]
[2,{"$f":"IF(RawData!N3=0,\"\",LARGE(RawData!N:N,Goal2Graph!A9))","v":""},{"$f":"IF(B9=\"\",\"\",INDEX(RawData!M:M,MATCH(B9,RawData!N:N,0))&\" \"&GoalEntryData!$D$3)","v":""},null,null,{"$f":"B9","v":""},{"$f":"IF(B9=\"\",\"\",INDEX(RawData!M:M,MATCH(F9,RawData!N:N,0)))","v":""},{"$f":"IF(F9<>\"\",GoalEntryData!$C$3,\"\")","v":""},{"$f":"IF(F9=\"\",\"\",GoalEntryData!$W$3+((GoalEntryData!$C$3-GoalEntryData!$W$3)*(($F9-GoalEntryData!$Y$3)/(GoalEntryData!$G$3-GoalEntryData!$Y$3))))","v":""}]
[3,{"$f":"IF(RawData!N4=0,\"\",LARGE(RawData!N:N,Goal2Graph!A10))","v":""},{"$f":"IF(B10=\"\",\"\",INDEX(RawData!M:M,MATCH(B10,RawData!N:N,0))&\" \"&GoalEntryData!$D$3)","v":""},null,null,{"$f":"B10","v":""},{"$f":"IF(B10=\"\",\"\",INDEX(RawData!M:M,MATCH(F10,RawData!N:N,0)))","v":""},{"$f":"IF(F10<>\"\",GoalEntryData!$C$3,\"\")","v":""},{"$f":"IF(F10=\"\",\"\",GoalEntryData!$W$3+((GoalEntryData!$C$3-GoalEntryData!$W$3)*(($F10-GoalEntryData!$Y$3)/(GoalEntryData!$G$3-GoalEntryData!$Y$3))))","v":""}]
[4,{"$f":"IF(RawData!N5=0,\"\",LARGE(RawData!N:N,Goal2Graph!A11))","v":""},{"$f":"IF(B11=\"\",\"\",INDEX(RawData!M:M,MATCH(B11,RawData!N:N,0))&\" \"&GoalEntryData!$D$3)","v":""},null,null,{"$f":"B11","v":""},{"$f":"IF(B11=\"\",\"\",INDEX(RawData!M:M,MATCH(F11,RawData!N:N,0)))","v":""},{"$f":"IF(F11<>\"\",GoalEntryData!$C$3,\"\")","v":""},{"$f":"IF(F11=\"\",\"\",GoalEntryData!$W$3+((GoalEntryData!$C$3-GoalEntryData!$W$3)*(($F11-GoalEntryData!$Y$3)/(GoalEntryData!$G$3-GoalEntryData!$Y$3))))","v":""}]
[5,{"$f":"IF(RawData!N6=0,\"\",LARGE(RawData!N:N,Goal2Graph!A12))","v":""},{"$f":"IF(B12=\"\",\"\",INDEX(RawData!M:M,MATCH(B12,RawData!N:N,0))&\" \"&GoalEntryData!$D$3)","v":""},null,null,"",{"$f":"IF(B12=\"\",\"\",INDEX(RawData!M:M,MATCH(F12,RawData!N:N,0)))","v":""},{"$f":"IF(F12<>\"\",GoalEntryData!$C$3,\"\")","v":""},{"$f":"IF(F12=\"\",\"\",GoalEntryData!$W$3+((GoalEntryData!$C$3-GoalEntryData!$W$3)*(($F12-GoalEntryData!$Y$3)/(GoalEntryData!$G$3-GoalEntryData!$Y$3))))","v":""}]
[6,{"$f":"IF(RawData!N7=0,\"\",LARGE(RawData!N:N,Goal2Graph!A13))","v":""},{"$f":"IF(B13=\"\",\"\",INDEX(RawData!M:M,MATCH(B13,RawData!N:N,0))&\" \"&GoalEntryData!$D$3)","v":""},null,null,"",{"$f":"IF(B13=\"\",\"\",INDEX(RawData!M:M,MATCH(F13,RawData!N:N,0)))","v":""},{"$f":"IF(F13<>\"\",GoalEntryData!$C$3,\"\")","v":""},{"$f":"IF(F13=\"\",\"\",GoalEntryData!$W$3+((GoalEntryData!$C$3-GoalEntryData!$W$3)*(($F13-GoalEntryData!$Y$3)/(GoalEntryData!$G$3-GoalEntryData!$Y$3))))","v":""}]
[7,{"$f":"IF(RawData!N8=0,\"\",LARGE(RawData!N:N,Goal2Graph!A14))","v":""},{"$f":"IF(B14=\"\",\"\",INDEX(RawData!M:M,MATCH(B14,RawData!N:N,0))&\" \"&GoalEntryData!$D$3)","v":""},null,null,"",{"$f":"IF(B14=\"\",\"\",INDEX(RawData!M:M,MATCH(F14,RawData!N:N,0)))","v":""},{"$f":"IF(F14<>\"\",GoalEntryData!$C$3,\"\")","v":""},{"$f":"IF(F14=\"\",\"\",GoalEntryData!$W$3+((GoalEntryData!$C$3-GoalEntryData!$W$3)*(($F14-GoalEntryData!$Y$3)/(GoalEntryData!$G$3-GoalEntryData!$Y$3))))","v":""}]
[8,{"$f":"IF(RawData!N9=0,\"\",LARGE(RawData!N:N,Goal2Graph!A15))","v":""},{"$f":"IF(B15=\"\",\"\",INDEX(RawData!M:M,MATCH(B15,RawData!N:N,0))&\" \"&GoalEntryData!$D$3)","v":""},null,null,"",{"$f":"IF(B15=\"\",\"\",INDEX(RawData!M:M,MATCH(F15,RawData!N:N,0)))","v":""},{"$f":"IF(F15<>\"\",GoalEntryData!$C$3,\"\")","v":""},{"$f":"IF(F15=\"\",\"\",GoalEntryData!$W$3+((GoalEntryData!$C$3-GoalEntryData!$W$3)*(($F15-GoalEntryData!$Y$3)/(GoalEntryData!$G$3-GoalEntryData!$Y$3))))","v":""}]
[9,{"$f":"IF(RawData!N10=0,\"\",LARGE(RawData!N:N,Goal2Graph!A16))","v":""},{"$f":"IF(B16=\"\",\"\",INDEX(RawData!M:M,MATCH(B16,RawData!N:N,0))&\" \"&GoalEntryData!$D$3)","v":""},null,null,"",{"$f":"IF(B16=\"\",\"\",INDEX(RawData!M:M,MATCH(F16,RawData!N:N,0)))","v":""},{"$f":"IF(F16<>\"\",GoalEntryData!$C$3,\"\")","v":""},{"$f":"IF(F16=\"\",\"\",GoalEntryData!$W$3+((GoalEntryData!$C$3-GoalEntryData!$W$3)*(($F16-GoalEntryData!$Y$3)/(GoalEntryData!$G$3-GoalEntryData!$Y$3))))","v":""}]
[10,{"$f":"IF(RawData!N11=0,\"\",LARGE(RawData!N:N,Goal2Graph!A17))","v":""},{"$f":"IF(B17=\"\",\"\",INDEX(RawData!M:M,MATCH(B17,RawData!N:N,0))&\" \"&GoalEntryData!$D$3)","v":""},null,null,"",{"$f":"IF(B17=\"\",\"\",INDEX(RawData!M:M,MATCH(F17,RawData!N:N,0)))","v":""},{"$f":"IF(F17<>\"\",GoalEntryData!$C$3,\"\")","v":""},{"$f":"IF(F17=\"\",\"\",GoalEntryData!$W$3+((GoalEntryData!$C$3-GoalEntryData!$W$3)*(($F17-GoalEntryData!$Y$3)/(GoalEntryData!$G$3-GoalEntryData!$Y$3))))","v":""}]
[11,{"$f":"IF(RawData!N12=0,\"\",LARGE(RawData!N:N,Goal2Graph!A18))","v":""},{"$f":"IF(B18=\"\",\"\",INDEX(RawData!M:M,MATCH(B18,RawData!N:N,0))&\" \"&GoalEntryData!$D$3)","v":""},null,null,"",{"$f":"IF(B18=\"\",\"\",INDEX(RawData!M:M,MATCH(F18,RawData!N:N,0)))","v":""},{"$f":"IF(F18<>\"\",GoalEntryData!$C$3,\"\")","v":""},{"$f":"IF(F18=\"\",\"\",GoalEntryData!$W$3+((GoalEntryData!$C$3-GoalEntryData!$W$3)*(($F18-GoalEntryData!$Y$3)/(GoalEntryData!$G$3-GoalEntryData!$Y$3))))","v":""}]
[12,{"$f":"IF(RawData!N13=0,\"\",LARGE(RawData!N:N,Goal2Graph!A19))","v":""},{"$f":"IF(B19=\"\",\"\",INDEX(RawData!M:M,MATCH(B19,RawData!N:N,0))&\" \"&GoalEntryData!$D$3)","v":""},null,null,"",{"$f":"IF(B19=\"\",\"\",INDEX(RawData!M:M,MATCH(F19,RawData!N:N,0)))","v":""},{"$f":"IF(F19<>\"\",GoalEntryData!$C$3,\"\")","v":""},{"$f":"IF(F19=\"\",\"\",GoalEntryData!$W$3+((GoalEntryData!$C$3-GoalEntryData!$W$3)*(($F19-GoalEntryData!$Y$3)/(GoalEntryData!$G$3-GoalEntryData!$Y$3))))","v":""}]
[13,{"$f":"IF(RawData!N14=0,\"\",LARGE(RawData!N:N,Goal2Graph!A20))","v":""},{"$f":"IF(B20=\"\",\"\",INDEX(RawData!M:M,MATCH(B20,RawData!N:N,0))&\" \"&GoalEntryData!$D$3)","v":""},null,null,"",{"$f":"IF(B20=\"\",\"\",INDEX(RawData!M:M,MATCH(F20,RawData!N:N,0)))","v":""},{"$f":"IF(F20<>\"\",GoalEntryData!$C$3,\"\")","v":""},{"$f":"IF(F20=\"\",\"\",GoalEntryData!$W$3+((GoalEntryData!$C$3-GoalEntryData!$W$3)*(($F20-GoalEntryData!$Y$3)/(GoalEntryData!$G$3-GoalEntryData!$Y$3))))","v":""}]
[14,{"$f":"IF(RawData!N15=0,\"\",LARGE(RawData!N:N,Goal2Graph!A21))","v":""},{"$f":"IF(B21=\"\",\"\",INDEX(RawData!M:M,MATCH(B21,RawData!N:N,0))&\" \"&GoalEntryData!$D$3)","v":""},null,null,"",{"$f":"IF(B21=\"\",\"\",INDEX(RawData!M:M,MATCH(F21,RawData!N:N,0)))","v":""},{"$f":"IF(F21<>\"\",GoalEntryData!$C$3,\"\")","v":""},{"$f":"IF(F21=\"\",\"\",GoalEntryData!$W$3+((GoalEntryData!$C$3-GoalEntryData!$W$3)*(($F21-GoalEntryData!$Y$3)/(GoalEntryData!$G$3-GoalEntryData!$Y$3))))","v":""}]
[15,{"$f":"IF(RawData!N16=0,\"\",LARGE(RawData!N:N,Goal2Graph!A22))","v":""},{"$f":"IF(B22=\"\",\"\",INDEX(RawData!M:M,MATCH(B22,RawData!N:N,0))&\" \"&GoalEntryData!$D$3)","v":""},null,null,"",{"$f":"IF(B22=\"\",\"\",INDEX(RawData!M:M,MATCH(F22,RawData!N:N,0)))","v":""},{"$f":"IF(F22<>\"\",GoalEntryData!$C$3,\"\")","v":""},{"$f":"IF(F22=\"\",\"\",GoalEntryData!$W$3+((GoalEntryData!$C$3-GoalEntryData!$W$3)*(($F22-GoalEntryData!$Y$3)/(GoalEntryData!$G$3-GoalEntryData!$Y$3))))","v":""}]
[16,{"$f":"IF(RawData!N17=0,\"\",LARGE(RawData!N:N,Goal2Graph!A23))","v":""},{"$f":"IF(B23=\"\",\"\",INDEX(RawData!M:M,MATCH(B23,RawData!N:N,0))&\" \"&GoalEntryData!$D$3)","v":""},null,null,"",{"$f":"IF(B23=\"\",\"\",INDEX(RawData!M:M,MATCH(F23,RawData!N:N,0)))","v":""},{"$f":"IF(F23<>\"\",GoalEntryData!$C$3,\"\")","v":""},{"$f":"IF(F23=\"\",\"\",GoalEntryData!$W$3+((GoalEntryData!$C$3-GoalEntryData!$W$3)*(($F23-GoalEntryData!$Y$3)/(GoalEntryData!$G$3-GoalEntryData!$Y$3))))","v":""}]
[17,{"$f":"IF(RawData!N18=0,\"\",LARGE(RawData!N:N,Goal2Graph!A24))","v":""},{"$f":"IF(B24=\"\",\"\",INDEX(RawData!M:M,MATCH(B24,RawData!N:N,0))&\" \"&GoalEntryData!$D$3)","v":""},null,null,"",{"$f":"IF(B24=\"\",\"\",INDEX(RawData!M:M,MATCH(F24,RawData!N:N,0)))","v":""},{"$f":"IF(F24<>\"\",GoalEntryData!$C$3,\"\")","v":""},{"$f":"IF(F24=\"\",\"\",GoalEntryData!$W$3+((GoalEntryData!$C$3-GoalEntryData!$W$3)*(($F24-GoalEntryData!$Y$3)/(GoalEntryData!$G$3-GoalEntryData!$Y$3))))","v":""}]
[18,{"$f":"IF(RawData!N19=0,\"\",LARGE(RawData!N:N,Goal2Graph!A25))","v":""},{"$f":"IF(B25=\"\",\"\",INDEX(RawData!M:M,MATCH(B25,RawData!N:N,0))&\" \"&GoalEntryData!$D$3)","v":""},null,null,"",{"$f":"IF(B25=\"\",\"\",INDEX(RawData!M:M,MATCH(F25,RawData!N:N,0)))","v":""},{"$f":"IF(F25<>\"\",GoalEntryData!$C$3,\"\")","v":""},{"$f":"IF(F25=\"\",\"\",GoalEntryData!$W$3+((GoalEntryData!$C$3-GoalEntryData!$W$3)*(($F25-GoalEntryData!$Y$3)/(GoalEntryData!$G$3-GoalEntryData!$Y$3))))","v":""}]
[19,{"$f":"IF(RawData!N20=0,\"\",LARGE(RawData!N:N,Goal2Graph!A26))","v":""},{"$f":"IF(B26=\"\",\"\",INDEX(RawData!M:M,MATCH(B26,RawData!N:N,0))&\" \"&GoalEntryData!$D$3)","v":""},null,null,"",{"$f":"IF(B26=\"\",\"\",INDEX(RawData!M:M,MATCH(F26,RawData!N:N,0)))","v":""},{"$f":"IF(F26<>\"\",GoalEntryData!$C$3,\"\")","v":""},{"$f":"IF(F26=\"\",\"\",GoalEntryData!$W$3+((GoalEntryData!$C$3-GoalEntryData!$W$3)*(($F26-GoalEntryData!$Y$3)/(GoalEntryData!$G$3-GoalEntryData!$Y$3))))","v":""}]
[20,{"$f":"IF(RawData!N21=0,\"\",LARGE(RawData!N:N,Goal2Graph!A27))","v":""},{"$f":"IF(B27=\"\",\"\",INDEX(RawData!M:M,MATCH(B27,RawData!N:N,0))&\" \"&GoalEntryData!$D$3)","v":""},null,null,"",{"$f":"IF(B27=\"\",\"\",INDEX(RawData!M:M,MATCH(F27,RawData!N:N,0)))","v":""},{"$f":"IF(F27<>\"\",GoalEntryData!$C$3,\"\")","v":""},{"$f":"IF(F27=\"\",\"\",GoalEntryData!$W$3+((GoalEntryData!$C$3-GoalEntryData!$W$3)*(($F27-GoalEntryData!$Y$3)/(GoalEntryData!$G$3-GoalEntryData!$Y$3))))","v":""}]
[21,{"$f":"IF(RawData!N22=0,\"\",LARGE(RawData!N:N,Goal2Graph!A28))","v":""},{"$f":"IF(B28=\"\",\"\",INDEX(RawData!M:M,MATCH(B28,RawData!N:N,0))&\" \"&GoalEntryData!$D$3)","v":""},null,null,"",{"$f":"IF(B28=\"\",\"\",INDEX(RawData!M:M,MATCH(F28,RawData!N:N,0)))","v":""},{"$f":"IF(F28<>\"\",GoalEntryData!$C$3,\"\")","v":""},{"$f":"IF(F28=\"\",\"\",GoalEntryData!$W$3+((GoalEntryData!$C$3-GoalEntryData!$W$3)*(($F28-GoalEntryData!$Y$3)/(GoalEntryData!$G$3-GoalEntryData!$Y$3))))","v":""}]
[22,{"$f":"IF(RawData!N23=0,\"\",LARGE(RawData!N:N,Goal2Graph!A29))","v":""},{"$f":"IF(B29=\"\",\"\",INDEX(RawData!M:M,MATCH(B29,RawData!N:N,0))&\" \"&GoalEntryData!$D$3)","v":""},null,null,"",{"$f":"IF(B29=\"\",\"\",INDEX(RawData!M:M,MATCH(F29,RawData!N:N,0)))","v":""},{"$f":"IF(F29<>\"\",GoalEntryData!$C$3,\"\")","v":""},{"$f":"IF(F29=\"\",\"\",GoalEntryData!$W$3+((GoalEntryData!$C$3-GoalEntryData!$W$3)*(($F29-GoalEntryData!$Y$3)/(GoalEntryData!$G$3-GoalEntryData!$Y$3))))","v":""}]
[23,{"$f":"IF(RawData!N24=0,\"\",LARGE(RawData!N:N,Goal2Graph!A30))","v":""},{"$f":"IF(B30=\"\",\"\",INDEX(RawData!M:M,MATCH(B30,RawData!N:N,0))&\" \"&GoalEntryData!$D$3)","v":""},null,null,"",{"$f":"IF(B30=\"\",\"\",INDEX(RawData!M:M,MATCH(F30,RawData!N:N,0)))","v":""},{"$f":"IF(F30<>\"\",GoalEntryData!$C$3,\"\")","v":""},{"$f":"IF(F30=\"\",\"\",GoalEntryData!$W$3+((GoalEntryData!$C$3-GoalEntryData!$W$3)*(($F30-GoalEntryData!$Y$3)/(GoalEntryData!$G$3-GoalEntryData!$Y$3))))","v":""}]
[24,{"$f":"IF(RawData!N25=0,\"\",LARGE(RawData!N:N,Goal2Graph!A31))","v":""},{"$f":"IF(B31=\"\",\"\",INDEX(RawData!M:M,MATCH(B31,RawData!N:N,0))&\" \"&GoalEntryData!$D$3)","v":""},null,null,"",{"$f":"IF(B31=\"\",\"\",INDEX(RawData!M:M,MATCH(F31,RawData!N:N,0)))","v":""},{"$f":"IF(F31<>\"\",GoalEntryData!$C$3,\"\")","v":""},{"$f":"IF(F31=\"\",\"\",GoalEntryData!$W$3+((GoalEntryData!$C$3-GoalEntryData!$W$3)*(($F31-GoalEntryData!$Y$3)/(GoalEntryData!$G$3-GoalEntryData!$Y$3))))","v":""}]
[25,{"$f":"IF(RawData!N26=0,\"\",LARGE(RawData!N:N,Goal2Graph!A32))","v":""},{"$f":"IF(B32=\"\",\"\",INDEX(RawData!M:M,MATCH(B32,RawData!N:N,0))&\" \"&GoalEntryData!$D$3)","v":""},null,null,"",{"$f":"IF(B32=\"\",\"\",INDEX(RawData!M:M,MATCH(F32,RawData!N:N,0)))","v":""},{"$f":"IF(F32<>\"\",GoalEntryData!$C$3,\"\")","v":""},{"$f":"IF(F32=\"\",\"\",GoalEntryData!$W$3+((GoalEntryData!$C$3-GoalEntryData!$W$3)*(($F32-GoalEntryData!$Y$3)/(GoalEntryData!$G$3-GoalEntryData!$Y$3))))","v":""}]
[26,{"$f":"IF(RawData!N27=0,\"\",LARGE(RawData!N:N,Goal2Graph!A33))","v":""},{"$f":"IF(B33=\"\",\"\",INDEX(RawData!M:M,MATCH(B33,RawData!N:N,0))&\" \"&GoalEntryData!$D$3)","v":""},null,null,"",{"$f":"IF(B33=\"\",\"\",INDEX(RawData!M:M,MATCH(F33,RawData!N:N,0)))","v":""},{"$f":"IF(F33<>\"\",GoalEntryData!$C$3,\"\")","v":""},{"$f":"IF(F33=\"\",\"\",GoalEntryData!$W$3+((GoalEntryData!$C$3-GoalEntryData!$W$3)*(($F33-GoalEntryData!$Y$3)/(GoalEntryData!$G$3-GoalEntryData!$Y$3))))","v":""}]
[27,{"$f":"IF(RawData!N28=0,\"\",LARGE(RawData!N:N,Goal2Graph!A34))","v":""},{"$f":"IF(B34=\"\",\"\",INDEX(RawData!M:M,MATCH(B34,RawData!N:N,0))&\" \"&GoalEntryData!$D$3)","v":""},null,null,"",{"$f":"IF(B34=\"\",\"\",INDEX(RawData!M:M,MATCH(F34,RawData!N:N,0)))","v":""},{"$f":"IF(F34<>\"\",GoalEntryData!$C$3,\"\")","v":""},{"$f":"IF(F34=\"\",\"\",GoalEntryData!$W$3+((GoalEntryData!$C$3-GoalEntryData!$W$3)*(($F34-GoalEntryData!$Y$3)/(GoalEntryData!$G$3-GoalEntryData!$Y$3))))","v":""}]
[28,{"$f":"IF(RawData!N29=0,\"\",LARGE(RawData!N:N,Goal2Graph!A35))","v":""},{"$f":"IF(B35=\"\",\"\",INDEX(RawData!M:M,MATCH(B35,RawData!N:N,0))&\" \"&GoalEntryData!$D$3)","v":""},null,null,"",{"$f":"IF(B35=\"\",\"\",INDEX(RawData!M:M,MATCH(F35,RawData!N:N,0)))","v":""},{"$f":"IF(F35<>\"\",GoalEntryData!$C$3,\"\")","v":""},{"$f":"IF(F35=\"\",\"\",GoalEntryData!$W$3+((GoalEntryData!$C$3-GoalEntryData!$W$3)*(($F35-GoalEntryData!$Y$3)/(GoalEntryData!$G$3-GoalEntryData!$Y$3))))","v":""}]
[29,{"$f":"IF(RawData!N30=0,\"\",LARGE(RawData!N:N,Goal2Graph!A36))","v":""},{"$f":"IF(B36=\"\",\"\",INDEX(RawData!M:M,MATCH(B36,RawData!N:N,0))&\" \"&GoalEntryData!$D$3)","v":""},null,null,"",{"$f":"IF(B36=\"\",\"\",INDEX(RawData!M:M,MATCH(F36,RawData!N:N,0)))","v":""},{"$f":"IF(F36<>\"\",GoalEntryData!$C$3,\"\")","v":""},{"$f":"IF(F36=\"\",\"\",GoalEntryData!$W$3+((GoalEntryData!$C$3-GoalEntryData!$W$3)*(($F36-GoalEntryData!$Y$3)/(GoalEntryData!$G$3-GoalEntryData!$Y$3))))","v":""}]
[30,{"$f":"IF(RawData!N31=0,\"\",LARGE(RawData!N:N,Goal2Graph!A37))","v":""},{"$f":"IF(B37=\"\",\"\",INDEX(RawData!M:M,MATCH(B37,RawData!N:N,0))&\" \"&GoalEntryData!$D$3)","v":""},null,null,"",{"$f":"IF(B37=\"\",\"\",INDEX(RawData!M:M,MATCH(F37,RawData!N:N,0)))","v":""},{"$f":"IF(F37<>\"\",GoalEntryData!$C$3,\"\")","v":""},{"$f":"IF(F37=\"\",\"\",GoalEntryData!$W$3+((GoalEntryData!$C$3-GoalEntryData!$W$3)*(($F37-GoalEntryData!$Y$3)/(GoalEntryData!$G$3-GoalEntryData!$Y$3))))","v":""}]

{"sheet":"Goal1Print","index":7,"n_rows":36,"n_cols":9,"rows_kept":36,"cut":false,"hidden":true,"merged":[[35,8,35,9],[37,2,37,7],[28,2,28,3],[29,2,29,3],[30,2,30,3],[31,2,31,3],[32,2,32,3],[28,5,28,6],[29,5,29,6],[30,5,30,6],[26,2,26,3],[27,2,27,3],[1,3,1,8],[2,3,2,8],[3,3,4,8],[25,1,25,9],[26,5,26,6],[27,5,27,6],[31,8,31,9],[32,8,32,9],[33,8,33,9],[34,8,34,9],[33,5,33,6],[34,5,34,6],[26,8,26,9],[27,8,27,9],[28,8,28,9],[29,8,29,9],[30,8,30,9],[31,5,31,6],[32,5,32,6],[33,2,33,3],[34,2,34,3],[39,2,40,7],[35,2,35,3],[35,5,35,6]]}
[]
[null,null,null,{"$f":"Goal1Graph!C2","v":""}]
[]
[null,null,null,{"$f":"Goal1Graph!B4","v":""}]
[]
[]
[]
[]
[]
[]
[]
[]
[]
[]
[]
[]
[]
[]
[]
[]
[]
[]
[]
[]
[]
[null,"Last 30 Behavior Incidents"]
[null,{"$f":"Goal1Graph!$B8","v":""},{"$f":"Goal1Graph!$C8","v":""},null,{"$f":"Goal1Graph!B18","v":""},{"$f":"Goal1Graph!C18","v":""},null,{"$f":"Goal1Graph!B28","v":""},{"$f":"Goal1Graph!C28","v":""}]
[null,{"$f":"Goal1Graph!$B9","v":""},{"$f":"Goal1Graph!$C9","v":""},null,{"$f":"Goal1Graph!B19","v":""},{"$f":"Goal1Graph!C19","v":""},null,{"$f":"Goal1Graph!B29","v":""},{"$f":"Goal1Graph!C29","v":""}]
[null,{"$f":"Goal1Graph!$B10","v":""},{"$f":"Goal1Graph!$C10","v":""},null,{"$f":"Goal1Graph!B20","v":""},{"$f":"Goal1Graph!C20","v":""},null,{"$f":"Goal1Graph!B30","v":""},{"$f":"Goal1Graph!C30","v":""}]
[null,{"$f":"Goal1Graph!$B11","v":""},{"$f":"Goal1Graph!$C11","v":""},null,{"$f":"Goal1Graph!B21","v":""},{"$f":"Goal1Graph!C21","v":""},null,{"$f":"Goal1Graph!B31","v":""},{"$f":"Goal1Graph!C31","v":""}]
[null,{"$f":"Goal1Graph!$B12","v":""},{"$f":"Goal1Graph!$C12","v":""},null,{"$f":"Goal1Graph!B22","v":""},{"$f":"Goal1Graph!C22","v":""},null,{"$f":"Goal1Graph!B32","v":""},{"$f":"Goal1Graph!C32","v":""}]
[null,{"$f":"Goal1Graph!$B13","v":""},{"$f":"Goal1Graph!$C13","v":""},null,{"$f":"Goal1Graph!B23","v":""},{"$f":"Goal1Graph!C23","v":""},null,{"$f":"Goal1Graph!B33","v":""},{"$f":"Goal1Graph!C33","v":""}]
[null,{"$f":"Goal1Graph!$B14","v":""},{"$f":"Goal1Graph!$C14","v":""},null,{"$f":"Goal1Graph!B24","v":""},{"$f":"Goal1Graph!C24","v":""},null,{"$f":"Goal1Graph!B34","v":""},{"$f":"Goal1Graph!C34","v":""}]
[null,{"$f":"Goal1Graph!$B15","v":""},{"$f":"Goal1Graph!$C15","v":""},null,{"$f":"Goal1Graph!B25","v":""},{"$f":"Goal1Graph!C25","v":""},null,{"$f":"Goal1Graph!B35","v":""},{"$f":"Goal1Graph!C35","v":""}]
[null,{"$f":"Goal1Graph!$B16","v":""},{"$f":"Goal1Graph!$C16","v":""},null,{"$f":"Goal1Graph!B26","v":""},{"$f":"Goal1Graph!C26","v":""},null,{"$f":"Goal1Graph!B36","v":""},{"$f":"Goal1Graph!C36","v":""}]
[null,{"$f":"Goal1Graph!$B17","v":""},{"$f":"Goal1Graph!$C17","v":""},null,{"$f":"Goal1Graph!B27","v":""},{"$f":"Goal1Graph!C27","v":""},null,{"$f":"Goal1Graph!B37","v":""},{"$f":"Goal1Graph!C37","v":""}]