{"text_format":"1","workbook":"xlsx","n_sheets":8,"sheets":["DataEntry","GoalEntryData","RawData","Lookup","Goal2Print","Goal1Graph","Goal2Graph","Goal1Print"],"not_rendered":{"charts":4,"images":0,"macros":1,"external_links":0,"defined_names":11,"comments":0,"pivot_tables":0},"unopened":[],"bounds":{"document_bytes":16777216,"sheet_cells":100000,"rows_first":2000,"rows_last":500,"rows_between":2000,"halvings":0,"cell_chars":16384,"cell_head_chars":4096},"cells_cut":0,"cells_raw":0,"read":"whole","date_system":"1900"}

{"sheet":"DataEntry","index":0,"n_rows":19,"n_cols":15,"rows_kept":19,"cut":false,"hidden":false,"merged":[[21,16,21,19],[7,2,12,2],[13,2,18,2],[5,16,5,19],[11,16,11,19],[17,16,17,19],[13,13,14,13],[4,2,4,3],[4,4,4,6],[16,3,16,4],[16,5,16,12],[2,2,2,3],[2,4,2,8],[7,3,7,4],[7,5,7,12],[6,2,6,13],[8,3,8,4],[8,5,8,12],[9,3,9,4],[12,3,12,4],[9,5,9,12],[7,13,8,13],[22,2,22,5],[10,5,10,12],[11,5,11,12],[12,5,12,12],[15,3,15,4],[13,3,13,4],[13,5,13,12],[15,5,15,12],[17,3,17,4],[17,5,17,12],[18,3,18,4],[18,5,18,12],[14,3,14,4],[14,5,14,12],[10,3,10,4],[11,3,11,4]]}
[]
[]
[null,null,"Student's Name",null,null,null,null,null,null,{"$f":"IFERROR(LEFT(E3,SEARCH(\" \",E3,1)),\"\")","v":""}]
[]
[null,null,"Student ID"]
[]
[]
[null,null,null,"Target Behavior 1:",null,{"$f":"IF(GoalEntryData!$Q$2=\"\",\"\",GoalEntryData!$Q$2)","v":""},null,null,null,null,null,null,null,"Date Achieved"]
[null,null,null,"Baseline Data:",null,{"$f":"IFERROR(IF(GoalEntryData!$C$2=\"\",\"\",\"Between \"&TEXT(GoalEntryData!$R$2,\"mm/dd/yyyy\")&\" and \"&TEXT(GoalEntryData!$S$2,\"mm/dd/yyyy\")&\", \"&DataEntry!$J$3&\"received an average of \"&GoalEntryData!$W$2&\" \"&GoalEntryData!$D$2&\" a \"&GoalEntryData!$E$2),\"\")","v":""},null,null,null,null,null,null,null,null,{"$f":"TODAY()","v":"2015-03-05"}]
[null,null,null,"Goal 1:",null,{"$f":"IFERROR(IF(GoalEntryData!$C$2=\"\",\"\",\"By \"&TEXT(GoalEntryData!$G$2,\"mm/dd/yyyy\")&\", \"&$J$3&\"will receive \"&IF(GoalEntryData!$B$2=\"No more than\",\"no more than \",IF(GoalEntryData!$B$2=\"At least\",\"at least \"))&GoalEntryData!$C$2&\" \"&GoalEntryData!$D$2&\" a \"&GoalEntryData!$E$2&\" for \"&GoalEntryData!$F$2&\" consecutive \"&GoalEntryData!$E$2&\"(s)\"),\"\")","v":""},null,null,null,null,null,null,null,{"$f":"IF(GoalEntryData!J6<>\"\",GoalEntryData!J6,\"\")","v":""},{"$f":"GoalEntryData!H6","v":"00:00:00"}]
{"$rows_left_out":10}
{"sheet":"GoalEntryData","index":1,"n_rows":13,"n_cols":25,"rows_kept":13,"cut":false,"hidden":true,"merged":[]}
[null,null,null,null,null,null,null,null,null,null,null,null,null,null,null,null,null,null,null,null,null,"Dividing Factor",null,null,"BL Date"]
[1,"At least",null,"<Select one>","day",null,null,null,null,null,null,null,null,null,null,null,null,null,null,null,"Total",{"$f":"IF($C2=\"\",\"\",NETWORKDAYS($R$2,$S$2,Lookup!$A$2:$A$19)/IF($E2=\"day\",1,IF($E2=\"week\",5,IF($E2=\"2-week period\",10))))","v":""},{"$f":"IFERROR(IF($U2=\"Total\",IF($C2=\"\",\"\",ROUND($T2/$V2,1)),T2),\"\")","v":""},{"$f":"IF(MAX(RawData!C:C)=0,\"\",IF($E2=\"day\",WORKDAY(MAX(RawData!C:C),1),IF($E2=\"week\",MAX(RawData!C:C)+7,IF($E2=\"2-week period\",MAX(RawData!C:C)+14))))","v":""},{"$f":"IF(RawData!C2=0,\"\",MIN(RawData!C:C))","v":""}]
[2,"At least",null,"<Select one>","day",null,null,null,null,null,null,null,null,null,null,null,null,null,null,null,"Total",{"$f":"IF($C3=\"\",\"\",NETWORKDAYS($R$3,$S$3,Lookup!$A$2:$A$19)/IF($E3=\"day\",1,IF($E3=\"week\",5,IF($E3=\"2-week period\",10))))","v":""},{"$f":"IFERROR(IF($U3=\"Total\",IF($C3=\"\",\"\",ROUND($T3/$V3,1)),T3),\"\")","v":""},{"$f":"IF(MAX(RawData!N:N)=0,\"\",IF($E3=\"day\",WORKDAY(MAX(RawData!N:N),1),IF($E3=\"week\",MAX(RawData!N:N)+7,IF($E3=\"2-week period\",MAX(RawData!N:N)+14))))","v":""},{"$f":"IF(RawData!N2=0,\"\",MIN(RawData!N:N))","v":""}]
[]
[null,"Indicator","Threshold","Number","Method"]
["Goal1",1,{"$f":"IF($B$2=\"No more than\",\"<=\",IF($B$2=\"At least\",\">=\",\"\"))","v":">="},{"$f":"C2","v":0},{"$f":"$D$2","v":"<Select one>"},{"$f":"$E$2","v":"day"},{"$f":"F2","v":0},{"$f":"G2","v":"00:00:00"},{"$f":"IFERROR(IF(D6=0,\"N/A\",MATCH(GoalEntryData!$G6,RawData!$E:$E,0)),0)","v":"N/A"},{"$f":"IF(OR(I6=0,I6=\"N/A\"),\"\",INDEX(RawData!$C:$C,GoalEntryData!I6))","v":""}]
["Benchmark1",1,{"$f":"IF($B$2=\"No more than\",\"<=\",IF($B$2=\"At least\",\">=\",\"\"))","v":">="},{"$f":"H2","v":0},{"$f":"$D$2","v":"<Select one>"},{"$f":"$E$2","v":"day"},{"$f":"I2","v":0},{"$f":"J2","v":"00:00:00"},{"$f":"IFERROR(IF(D7=0,\"N/A\",MATCH(GoalEntryData!$G7,RawData!$G:$G,0)),0)","v":"N/A"},{"$f":"IF(OR(I7=0,I7=\"N/A\"),\"\",INDEX(RawData!$C:$C,GoalEntryData!I7))","v":""}]
["Benchmark2",1,{"$f":"IF($B$2=\"No more than\",\"<=\",IF($B$2=\"At least\",\">=\",\"\"))","v":">="},{"$f":"K2","v":0},{"$f":"$D$2","v":"<Select one>"},{"$f":"$E$2","v":"day"},{"$f":"L2","v":0},{"$f":"M2","v":"00:00:00"},{"$f":"IFERROR(IF(D8=0,\"N/A\",MATCH(GoalEntryData!$G8,RawData!$I:$I,0)),0)","v":"N/A"},{"$f":"IF(OR(I8=0,I8=\"N/A\"),\"\",INDEX(RawData!$C:$C,GoalEntryData!I8))","v":""}]
["Benchmark3",1,{"$f":"IF($B$2=\"No more than\",\"<=\",IF($B$2=\"At least\",\">=\",\"\"))","v":">="},{"$f":"N2","v":0},{"$f":"$D$2","v":"<Select one>"},{"$f":"$E$2","v":"day"},{"$f":"O2","v":0},{"$f":"P2","v":"00:00:00"},{"$f":"IFERROR(IF(D9=0,\"N/A\",MATCH(GoalEntryData!$G9,RawData!$K:$K,0)),0)","v":"N/A"},{"$f":"IF(OR(I9=0,I9=\"N/A\"),\"\",INDEX(RawData!$C:$C,GoalEntryData!I9))","v":""}]
["Goal2",2,{"$f":"IF($B$3=\"No more than\",\"<=\",IF($B$3=\"At least\",\">=\",\"\"))","v":">="},{"$f":"C3","v":0},{"$f":"$D$3","v":"<Select one>"},{"$f":"$E$3","v":"day"},{"$f":"F3","v":0},{"$f":"G3","v":"00:00:00"},{"$f":"IFERROR(IF(D10=0,\"N/A\",MATCH(GoalEntryData!$G10,RawData!$P:$P,0)),0)","v":"N/A"},{"$f":"IF(OR(I10=0,I10=\"N/A\"),\"\",INDEX(RawData!$N:$N,GoalEntryData!I10))","v":""}]
{"$rows_left_out":4}
{"sheet":"RawData","index":2,"n_rows":316,"n_cols":22,"rows_kept":316,"cut":false,"hidden":true,"merged":[]}
["Goal 1","Number","Date","Goal1","Goal2 count","BM11","BM11 count","BM21","BM21 count","BM31","BM31 count","Goal 2","Number","Date","Goal2","Goal2 count","BM12","BM12 count","BM22","BM22 count","BM32","BM32 count"]
[null,null,null,{"$f":"IF($B2=\"\",\"\",IF(GoalEntryData!$C$6=\"<=\",IF($B2<=GoalEntryData!$D$6,1,0),IF(GoalEntryData!$C$6=\">=\",IF($B2>=GoalEntryData!$D$6,1,0),\"\")))","v":""},{"$f":"D$2","v":""},{"$f":"IF($B2=\"\",\"\",IF(GoalEntryData!$C$7=\"<=\",IF($B2<=GoalEntryData!$D$7,1,0),IF(GoalEntryData!$C$7=\">=\",IF($B2>=GoalEntryData!$D$7,1,0),\"\")))","v":""},{"$f":"F$2","v":""},{"$f":"IF($B2=\"\",\"\",IF(GoalEntryData!$C$8=\"<=\",IF($B2<=GoalEntryData!$D$8,1,0),IF(GoalEntryData!$C$8=\">=\",IF($B2>=GoalEntryData!$D$8,1,0),\"\")))","v":""},{"$f":"H$2","v":""},{"$f":"IF($B2=\"\",\"\",IF(GoalEntryData!$C$9=\"<=\",IF($B2<=GoalEntryData!$D$9,1,0),IF(GoalEntryData!$C$9=\">=\",IF($B2>=GoalEntryData!$D$9,1,0),\"\")))","v":""},{"$f":"J$2","v":""},null,null,null,{"$f":"IF($M2=\"\",\"\",IF(GoalEntryData!$C$10=\"<=\",IF($M2<=GoalEntryData!$D$10,1,0),IF(GoalEntryData!$C$10=\">=\",IF($M2>=GoalEntryData!$D$10,1,0),\"\")))","v":""},{"$f":"O$2","v":""},{"$f":"IF($M2=\"\",\"\",IF(GoalEntryData!$C$11=\"<=\",IF($M2<=GoalEntryData!$D$11,1,0),IF(GoalEntryData!$C$11=\">=\",IF($M2>=GoalEntryData!$D$11,1,0),\"\")))","v":""},{"$f":"Q$2","v":""},{"$f":"IF($M2=\"\",\"\",IF(GoalEntryData!$C$12=\"<=\",IF($M2<=GoalEntryData!$D$12,1,0),IF(GoalEntryData!$C$10=\">=\",IF($M2>=GoalEntryData!$D$12,1,0),\"\")))","v":""},{"$f":"S$2","v":""},{"$f":"IF($M2=\"\",\"\",IF(GoalEntryData!$C$13=\"<=\",IF($M2<=GoalEntryData!$D$13,1,0),IF(GoalEntryData!$C$13=\">=\",IF($M2>=GoalEntryData!$D$13,1,0),\"\")))","v":""},{"$f":"U$2","v":""}]
[null,null,null,{"$f":"IF($B3=\"\",\"\",IF(GoalEntryData!$C$6=\"<=\",IF($B3<=GoalEntryData!$D$6,1,0),IF(GoalEntryData!$C$6=\">=\",IF($B3>=GoalEntryData!$D$6,1,0),\"\")))","v":""},{"$f":"IF(AND(E2>=1,D3=1),E2+1,D3)","v":""},{"$f":"IF($B3=\"\",\"\",IF(GoalEntryData!$C$7=\"<=\",IF($B3<=GoalEntryData!$D$7,1,0),IF(GoalEntryData!$C$7=\">=\",IF($B3>=GoalEntryData!$D$7,1,0),\"\")))","v":""},{"$f":"IF(AND(G2>=1,F3=1),G2+1,F3)","v":""},{"$f":"IF($B3=\"\",\"\",IF(GoalEntryData!$C$8=\"<=\",IF($B3<=GoalEntryData!$D$8,1,0),IF(GoalEntryData!$C$8=\">=\",IF($B3>=GoalEntryData!$D$8,1,0),\"\")))","v":""},{"$f":"IF(AND(I2>=1,H3=1),I2+1,H3)","v":""},{"$f":"IF($B3=\"\",\"\",IF(GoalEntryData!$C$9=\"<=\",IF($B3<=GoalEntryData!$D$9,1,0),IF(GoalEntryData!$C$9=\">=\",IF($B3>=GoalEntryData!$D$9,1,0),\"\")))","v":""},{"$f":"IF(AND(K2>=1,J3=1),K2+1,J3)","v":""},null,null,null,{"$f":"IF($M3=\"\",\"\",IF(GoalEntryData!$C$10=\"<=\",IF($M3<=GoalEntryData!$D$10,1,0),IF(GoalEntryData!$C$10=\">=\",IF($M3>=GoalEntryData!$D$10,1,0),\"\")))","v":""},{"$f":"IF(AND(P2>=1,O3=1),P2+1,O3)","v":""},{"$f":"IF($M3=\"\",\"\",IF(GoalEntryData!$C$11=\"<=\",IF($M3<=GoalEntryData!$D$11,1,0),IF(GoalEntryData!$C$11=\">=\",IF($M3>=GoalEntryData!$D$11,1,0),\"\")))","v":""},{"$f":"IF(AND(R2>=1,Q3=1),R2+1,Q3)","v":""},{"$f":"IF($M3=\"\",\"\",IF(GoalEntryData!$C$12=\"<=\",IF($M3<=GoalEntryData!$D$12,1,0),IF(GoalEntryData!$C$10=\">=\",IF($M3>=GoalEntryData!$D$12,1,0),\"\")))","v":""},{"$f":"IF(AND(T2>=1,S3=1),T2+1,S3)","v":""},{"$f":"IF($M3=\"\",\"\",IF(GoalEntryData!$C$13=\"<=\",IF($M3<=GoalEntryData!$D$13,1,0),IF(GoalEntryData!$C$13=\">=\",IF($M3>=GoalEntryData!$D$13,1,0),\"\")))","v":""},{"$f":"IF(AND(V2>=1,U3=1),V2+1,U3)","v":""}]
[null,null,null,{"$f":"IF($B4=\"\",\"\",IF(GoalEntryData!$C$6=\"<=\",IF($B4<=GoalEntryData!$D$6,1,0),IF(GoalEntryData!$C$6=\">=\",IF($B4>=GoalEntryData!$D$6,1,0),\"\")))","v":""},{"$f":"IF(AND(E3>=1,D4=1),E3+1,D4)","v":""},{"$f":"IF($B4=\"\",\"\",IF(GoalEntryData!$C$7=\"<=\",IF($B4<=GoalEntryData!$D$7,1,0),IF(GoalEntryData!$C$7=\">=\",IF($B4>=GoalEntryData!$D$7,1,0),\"\")))","v":""},{"$f":"IF(AND(G3>=1,F4=1),G3+1,F4)","v":""},{"$f":"IF($B4=\"\",\"\",IF(GoalEntryData!$C$8=\"<=\",IF($B4<=GoalEntryData!$D$8,1,0),IF(GoalEntryData!$C$8=\">=\",IF($B4>=GoalEntryData!$D$8,1,0),\"\")))","v":""},{"$f":"IF(AND(I3>=1,H4=1),I3+1,H4)","v":""},{"$f":"IF($B4=\"\",\"\",IF(GoalEntryData!$C$9=\"<=\",IF($B4<=GoalEntryData!$D$9,1,0),IF(GoalEntryData!$C$9=\">=\",IF($B4>=GoalEntryData!$D$9,1,0),\"\")))","v":""},{"$f":"IF(AND(K3>=1,J4=1),K3+1,J4)","v":""},null,null,null,{"$f":"IF($M4=\"\",\"\",IF(GoalEntryData!$C$10=\"<=\",IF($M4<=GoalEntryData!$D$10,1,0),IF(GoalEntryData!$C$10=\">=\",IF($M4>=GoalEntryData!$D$10,1,0),\"\")))","v":""},{"$f":"IF(AND(P3>=1,O4=1),P3+1,O4)","v":""},{"$f":"IF($M4=\"\",\"\",IF(GoalEntryData!$C$11=\"<=\",IF($M4<=GoalEntryData!$D$11,1,0),IF(GoalEntryData!$C$11=\">=\",IF($M4>=GoalEntryData!$D$11,1,0),\"\")))","v":""},{"$f":"IF(AND(R3>=1,Q4=1),R3+1,Q4)","v":""},{"$f":"IF($M4=\"\",\"\",IF(GoalEntryData!$C$12=\"<=\",IF($M4<=GoalEntryData!$D$12,1,0),IF(GoalEntryData!$C$10=\">=\",IF($M4>=GoalEntryData!$D$12,1,0),\"\")))","v":""},{"$f":"IF(AND(T3>=1,S4=1),T3+1,S4)","v":""},{"$f":"IF($M4=\"\",\"\",IF(GoalEntryData!$C$13=\"<=\",IF($M4<=GoalEntryData!$D$13,1,0),IF(GoalEntryData!$C$13=\">=\",IF($M4>=GoalEntryData!$D$13,1,0),\"\")))","v":""},{"$f":"IF(AND(V3>=1,U4=1),V3+1,U4)","v":""}]
[null,null,null,{"$f":"IF($B5=\"\",\"\",IF(GoalEntryData!$C$6=\"<=\",IF($B5<=GoalEntryData!$D$6,1,0),IF(GoalEntryData!$C$6=\">=\",IF($B5>=GoalEntryData!$D$6,1,0),\"\")))","v":""},"",{"$f":"IF($B5=\"\",\"\",IF(GoalEntryData!$C$7=\"<=\",IF($B5<=GoalEntryData!$D$7,1,0),IF(GoalEntryData!$C$7=\">=\",IF($B5>=GoalEntryData!$D$7,1,0),\"\")))","v":""},"",{"$f":"IF($B5=\"\",\"\",IF(GoalEntryData!$C$8=\"<=\",IF($B5<=GoalEntryData!$D$8,1,0),IF(GoalEntryData!$C$8=\">=\",IF($B5>=GoalEntryData!$D$8,1,0),\"\")))","v":""},"",{"$f":"IF($B5=\"\",\"\",IF(GoalEntryData!$C$9=\"<=\",IF($B5<=GoalEntryData!$D$9,1,0),IF(GoalEntryData!$C$9=\">=\",IF($B5>=GoalEntryData!$D$9,1,0),\"\")))","v":""},"",null,null,null,{"$f":"IF($M5=\"\",\"\",IF(GoalEntryData!$C$10=\"<=\",IF($M5<=GoalEntryData!$D$10,1,0),IF(GoalEntryData!$C$10=\">=\",IF($M5>=GoalEntryData!$D$10,1,0),\"\")))","v":""},"",{"$f":"IF($M5=\"\",\"\",IF(GoalEntryData!$C$11=\"<=\",IF($M5<=GoalEntryData!$D$11,1,0),IF(GoalEntryData!$C$11=\">=\",IF($M5>=GoalEntryData!$D$11,1,0),\"\")))","v":""},"",{"$f":"IF($M5=\"\",\"\",IF(GoalEntryData!$C$12=\"<=\",IF($M5<=GoalEntryData!$D$12,1,0),IF(GoalEntryData!$C$10=\">=\",IF($M5>=GoalEntryData!$D$12,1,0),\"\")))","v":""},"",{"$f":"IF($M5=\"\",\"\",IF(GoalEntryData!$C$13=\"<=\",IF($M5<=GoalEntryData!$D$13,1,0),IF(GoalEntryData!$C$13=\">=\",IF($M5>=GoalEntryData!$D$13,1,0),\"\")))","v":""},""]
[null,null,null,{"$f":"IF($B6=\"\",\"\",IF(GoalEntryData!$C$6=\"<=\",IF($B6<=GoalEntryData!$D$6,1,0),IF(GoalEntryData!$C$6=\">=\",IF($B6>=GoalEntryData!$D$6,1,0),\"\")))","v":""},"",{"$f":"IF($B6=\"\",\"\",IF(GoalEntryData!$C$7=\"<=\",IF($B6<=GoalEntryData!$D$7,1,0),IF(GoalEntryData!$C$7=\">=\",IF($B6>=GoalEntryData!$D$7,1,0),\"\")))","v":""},"",{"$f":"IF($B6=\"\",\"\",IF(GoalEntryData!$C$8=\"<=\",IF($B6<=GoalEntryData!$D$8,1,0),IF(GoalEntryData!$C$8=\">=\",IF($B6>=GoalEntryData!$D$8,1,0),\"\")))","v":""},"",{"$f":"IF($B6=\"\",\"\",IF(GoalEntryData!$C$9=\"<=\",IF($B6<=GoalEntryData!$D$9,1,0),IF(GoalEntryData!$C$9=\">=\",IF($B6>=GoalEntryData!$D$9,1,0),\"\")))","v":""},"",null,null,null,{"$f":"IF($M6=\"\",\"\",IF(GoalEntryData!$C$10=\"<=\",IF($M6<=GoalEntryData!$D$10,1,0),IF(GoalEntryData!$C$10=\">=\",IF($M6>=GoalEntryData!$D$10,1,0),\"\")))","v":""},"",{"$f":"IF($M6=\"\",\"\",IF(GoalEntryData!$C$11=\"<=\",IF($M6<=GoalEntryData!$D$11,1,0),IF(GoalEntryData!$C$11=\">=\",IF($M6>=GoalEntryData!$D$11,1,0),\"\")))","v":""},"",{"$f":"IF($M6=\"\",\"\",IF(GoalEntryData!$C$12=\"<=\",IF($M6<=GoalEntryData!$D$12,1,0),IF(GoalEntryData!$C$10=\">=\",IF($M6>=GoalEntryData!$D$12,1,0),\"\")))","v":""},"",{"$f":"IF($M6=\"\",\"\",IF(GoalEntryData!$C$13=\"<=\",IF($M6<=GoalEntryData!$D$13,1,0),IF(GoalEntryData!$C$13=\">=\",IF($M6>=GoalEntryData!$D$13,1,0),\"\")))","v":""},""]
[null,null,null,{"$f":"IF($B7=\"\",\"\",IF(GoalEntryData!$C$6=\"<=\",IF($B7<=GoalEntryData!$D$6,1,0),IF(GoalEntryData!$C$6=\">=\",IF($B7>=GoalEntryData!$D$6,1,0),\"\")))","v":""},"",{"$f":"IF($B7=\"\",\"\",IF(GoalEntryData!$C$7=\"<=\",IF($B7<=GoalEntryData!$D$7,1,0),IF(GoalEntryData!$C$7=\">=\",IF($B7>=GoalEntryData!$D$7,1,0),\"\")))","v":""},"",{"$f":"IF($B7=\"\",\"\",IF(GoalEntryData!$C$8=\"<=\",IF($B7<=GoalEntryData!$D$8,1,0),IF(GoalEntryData!$C$8=\">=\",IF($B7>=GoalEntryData!$D$8,1,0),\"\")))","v":""},"",{"$f":"IF($B7=\"\",\"\",IF(GoalEntryData!$C$9=\"<=\",IF($B7<=GoalEntryData!$D$9,1,0),IF(GoalEntryData!$C$9=\">=\",IF($B7>=GoalEntryData!$D$9,1,0),\"\")))","v":""},"",null,null,null,{"$f":"IF($M7=\"\",\"\",IF(GoalEntryData!$C$10=\"<=\",IF($M7<=GoalEntryData!$D$10,1,0),IF(GoalEntryData!$C$10=\">=\",IF($M7>=GoalEntryData!$D$10,1,0),\"\")))","v":""},"",{"$f":"IF($M7=\"\",\"\",IF(GoalEntryData!$C$11=\"<=\",IF($M7<=GoalEntryData!$D$11,1,0),IF(GoalEntryData!$C$11=\">=\",IF($M7>=GoalEntryData!$D$11,1,0),\"\")))","v":""},"",{"$f":"IF($M7=\"\",\"\",IF(GoalEntryData!$C$12=\"<=\",IF($M7<=GoalEntryData!$D$12,1,0),IF(GoalEntryData!$C$10=\">=\",IF($M7>=GoalEntryData!$D$12,1,0),\"\")))","v":""},"",{"$f":"IF($M7=\"\",\"\",IF(GoalEntryData!$C$13=\"<=\",IF($M7<=GoalEntryData!$D$13,1,0),IF(GoalEntryData!$C$13=\">=\",IF($M7>=GoalEntryData!$D$13,1,0),\"\")))","v":""},""]
[null,null,null,{"$f":"IF($B8=\"\",\"\",IF(GoalEntryData!$C$6=\"<=\",IF($B8<=GoalEntryData!$D$6,1,0),IF(GoalEntryData!$C$6=\">=\",IF($B8>=GoalEntryData!$D$6,1,0),\"\")))","v":""},"",{"$f":"IF($B8=\"\",\"\",IF(GoalEntryData!$C$7=\"<=\",IF($B8<=GoalEntryData!$D$7,1,0),IF(GoalEntryData!$C$7=\">=\",IF($B8>=GoalEntryData!$D$7,1,0),\"\")))","v":""},"",{"$f":"IF($B8=\"\",\"\",IF(GoalEntryData!$C$8=\"<=\",IF($B8<=GoalEntryData!$D$8,1,0),IF(GoalEntryData!$C$8=\">=\",IF($B8>=GoalEntryData!$D$8,1,0),\"\")))","v":""},"",{"$f":"IF($B8=\"\",\"\",IF(GoalEntryData!$C$9=\"<=\",IF($B8<=GoalEntryData!$D$9,1,0),IF(GoalEntryData!$C$9=\">=\",IF($B8>=GoalEntryData!$D$9,1,0),\"\")))","v":""},"",null,null,null,{"$f":"IF($M8=\"\",\"\",IF(GoalEntryData!$C$10=\"<=\",IF($M8<=GoalEntryData!$D$10,1,0),IF(GoalEntryData!$C$10=\">=\",IF($M8>=GoalEntryData!$D$10,1,0),\"\")))","v":""},"",{"$f":"IF($M8=\"\",\"\",IF(GoalEntryData!$C$11=\"<=\",IF($M8<=GoalEntryData!$D$11,1,0),IF(GoalEntryData!$C$11=\">=\",IF($M8>=GoalEntryData!$D$11,1,0),\"\")))","v":""},"",{"$f":"IF($M8=\"\",\"\",IF(GoalEntryData!$C$12=\"<=\",IF($M8<=GoalEntryData!$D$12,1,0),IF(GoalEntryData!$C$10=\">=\",IF($M8>=GoalEntryData!$D$12,1,0),\"\")))","v":""},"",{"$f":"IF($M8=\"\",\"\",IF(GoalEntryData!$C$13=\"<=\",IF($M8<=GoalEntryData!$D$13,1,0),IF(GoalEntryData!$C$13=\">=\",IF($M8>=GoalEntryData!$D$13,1,0),\"\")))","v":""},""]
[null,null,null,{"$f":"IF($B9=\"\",\"\",IF(GoalEntryData!$C$6=\"<=\",IF($B9<=GoalEntryData!$D$6,1,0),IF(GoalEntryData!$C$6=\">=\",IF($B9>=GoalEntryData!$D$6,1,0),\"\")))","v":""},"",{"$f":"IF($B9=\"\",\"\",IF(GoalEntryData!$C$7=\"<=\",IF($B9<=GoalEntryData!$D$7,1,0),IF(GoalEntryData!$C$7=\">=\",IF($B9>=GoalEntryData!$D$7,1,0),\"\")))","v":""},"",{"$f":"IF($B9=\"\",\"\",IF(GoalEntryData!$C$8=\"<=\",IF($B9<=GoalEntryData!$D$8,1,0),IF(GoalEntryData!$C$8=\">=\",IF($B9>=GoalEntryData!$D$8,1,0),\"\")))","v":""},"",{"$f":"IF($B9=\"\",\"\",IF(GoalEntryData!$C$9=\"<=\",IF($B9<=GoalEntryData!$D$9,1,0),IF(GoalEntryData!$C$9=\">=\",IF($B9>=GoalEntryData!$D$9,1,0),\"\")))","v":""},"",null,null,null,{"$f":"IF($M9=\"\",\"\",IF(GoalEntryData!$C$10=\"<=\",IF($M9<=GoalEntryData!$D$10,1,0),IF(GoalEntryData!$C$10=\">=\",IF($M9>=GoalEntryData!$D$10,1,0),\"\")))","v":""},"",{"$f":"IF($M9=\"\",\"\",IF(GoalEntryData!$C$11=\"<=\",IF($M9<=GoalEntryData!$D$11,1,0),IF(GoalEntryData!$C$11=\">=\",IF($M9>=GoalEntryData!$D$11,1,0),\"\")))","v":""},"",{"$f":"IF($M9=\"\",\"\",IF(GoalEntryData!$C$12=\"<=\",IF($M9<=GoalEntryData!$D$12,1,0),IF(GoalEntryData!$C$10=\">=\",IF($M9>=GoalEntryData!$D$12,1,0),\"\")))","v":""},"",{"$f":"IF($M9=\"\",\"\",IF(GoalEntryData!$C$13=\"<=\",IF($M9<=GoalEntryData!$D$13,1,0),IF(GoalEntryData!$C$13=\">=\",IF($M9>=GoalEntryData!$D$13,1,0),\"\")))","v":""},""]
[null,null,null,{"$f":"IF($B10=\"\",\"\",IF(GoalEntryData!$C$6=\"<=\",IF($B10<=GoalEntryData!$D$6,1,0),IF(GoalEntryData!$C$6=\">=\",IF($B10>=GoalEntryData!$D$6,1,0),\"\")))","v":""},"",{"$f":"IF($B10=\"\",\"\",IF(GoalEntryData!$C$7=\"<=\",IF($B10<=GoalEntryData!$D$7,1,0),IF(GoalEntryData!$C$7=\">=\",IF($B10>=GoalEntryData!$D$7,1,0),\"\")))","v":""},"",{"$f":"IF($B10=\"\",\"\",IF(GoalEntryData!$C$8=\"<=\",IF($B10<=GoalEntryData!$D$8,1,0),IF(GoalEntryData!$C$8=\">=\",IF($B10>=GoalEntryData!$D$8,1,0),\"\")))","v":""},"",{"$f":"IF($B10=\"\",\"\",IF(GoalEntryData!$C$9=\"<=\",IF($B10<=GoalEntryData!$D$9,1,0),IF(GoalEntryData!$C$9=\">=\",IF($B10>=GoalEntryData!$D$9,1,0),\"\")))","v":""},"",null,null,null,{"$f":"IF($M10=\"\",\"\",IF(GoalEntryData!$C$10=\"<=\",IF($M10<=GoalEntryData!$D$10,1,0),IF(GoalEntryData!$C$10=\">=\",IF($M10>=GoalEntryData!$D$10,1,0),\"\")))","v":""},"",{"$f":"IF($M10=\"\",\"\",IF(GoalEntryData!$C$11=\"<=\",IF($M10<=GoalEntryData!$D$11,1,0),IF(GoalEntryData!$C$11=\">=\",IF($M10>=GoalEntryData!$D$11,1,0),\"\")))","v":""},"",{"$f":"IF($M10=\"\",\"\",IF(GoalEntryData!$C$12=\"<=\",IF($M10<=GoalEntryData!$D$12,1,0),IF(GoalEntryData!$C$10=\">=\",IF($M10>=GoalEntryData!$D$12,1,0),\"\")))","v":""},"",{"$f":"IF($M10=\"\",\"\",IF(GoalEntryData!$C$13=\"<=\",IF($M10<=GoalEntryData!$D$13,1,0),IF(GoalEntryData!$C$13=\">=\",IF($M10>=GoalEntryData!$D$13,1,0),\"\")))","v":""},""]
{"$rows_left_out":307}
{"sheet":"Lookup","index":3,"n_rows":19,"n_cols":3,"rows_kept":19,"cut":false,"hidden":true,"merged":[]}
["Holidays","Goal","Data Per"]
["2014-12-23",1,{"$f":"GoalEntryData!#REF!","v":{"$error":"#REF!"}}]
["2014-12-24",2,{"$f":"GoalEntryData!#REF!","v":{"$error":"#REF!"}}]
["2014-12-25"]
["2014-12-26"]
["2014-12-27"]
["2014-12-28"]
["2014-12-29"]
["2014-12-30"]
["2014-12-31"]
{"$rows_left_out":10}
{"sheet":"Goal2Print","index":4,"n_rows":36,"n_cols":9,"rows_kept":36,"cut":false,"hidden":true,"merged":[[35,2,35,3],[35,5,35,6],[35,8,35,9],[37,2,37,7],[39,2,40,7],[33,2,33,3],[33,5,33,6],[33,8,33,9],[34,2,34,3],[34,5,34,6],[34,8,34,9],[31,2,31,3],[31,5,31,6],[31,8,31,9],[32,2,32,3],[32,5,32,6],[32,8,32,9],[29,2,29,3],[29,5,29,6],[29,8,29,9],[30,2,30,3],[30,5,30,6],[30,8,30,9],[27,2,27,3],[27,5,27,6],[27,8,27,9],[28,2,28,3],[28,5,28,6],[28,8,28,9],[1,3,1,8],[2,3,2,8],[3,3,4,8],[25,1,25,9],[26,2,26,3],[26,5,26,6],[26,8,26,9]]}
[]
[null,null,null,{"$f":"Goal2Graph!C2","v":""}]
[]
[null,null,null,{"$f":"Goal2Graph!B4","v":""}]
[]
[]
[]
[]
[]
[]
{"$rows_left_out":27}
{"sheet":"Goal1Graph","index":5,"n_rows":37,"n_cols":9,"rows_kept":37,"cut":false,"hidden":true,"merged":[[33,2,33,4],[34,2,34,4],[35,2,35,4],[36,2,36,4],[27,2,27,4],[28,2,28,4],[29,2,29,4],[30,2,30,4],[31,2,31,4],[32,2,32,4],[26,2,26,4],[15,2,15,4],[16,2,16,4],[17,2,17,4],[18,2,18,4],[19,2,19,4],[20,2,20,4],[21,2,21,4],[22,2,22,4],[23,2,23,4],[24,2,24,4],[25,2,25,4],[14,2,14,4],[3,1,3,8],[5,1,5,4],[6,1,6,4],[7,2,7,4],[8,2,8,4],[9,2,9,4],[10,2,10,4],[11,2,11,4],[12,2,12,4],[13,2,13,4]]}
[]
[null,null,{"$f":"IF(DataEntry!F8=\"\",\"\",\"Target Behavior: \"&DataEntry!F8)","v":""}]
[]
[null,{"$f":"IF(DataEntry!F10=\"\",\"\",\"Goal: \"&DataEntry!F10)","v":""}]
[]
[null,"Data Entry (Last 30 entries):"]
[1,null,null,null,null,{"$f":"GoalEntryData!$E$2","v":"day"},{"$f":"GoalEntryData!$D$2","v":"<Select one>"},"Goal","Aim Line"]
[1,{"$f":"IF(RawData!C2=0,\"\",LARGE(RawData!C:C,Goal1Graph!A8))","v":""},{"$f":"IF(B8=\"\",\"\",INDEX(RawData!B:B,MATCH(B8,RawData!C:C,0))&\" \"&GoalEntryData!$D$2)","v":""},null,null,{"$f":"B8","v":""},{"$f":"IF(B8=\"\",\"\",INDEX(RawData!B:B,MATCH(F8,RawData!C:C,0)))","v":""},{"$f":"IF(F8<>\"\",GoalEntryData!$C$2,\"\")","v":""},{"$f":"IF(F8=\"\",\"\",GoalEntryData!$W$2+((GoalEntryData!$C$2-GoalEntryData!$W$2)*(($F8-GoalEntryData!$Y$2)/(GoalEntryData!$G$2-GoalEntryData!$Y$2))))","v":""}]
[2,{"$f":"IF(RawData!C3=0,\"\",LARGE(RawData!C:C,Goal1Graph!A9))","v":""},{"$f":"IF(B9=\"\",\"\",INDEX(RawData!B:B,MATCH(B9,RawData!C:C,0))&\" \"&GoalEntryData!$D$2)","v":""},null,null,{"$f":"B9","v":""},{"$f":"IF(B9=\"\",\"\",INDEX(RawData!B:B,MATCH(F9,RawData!C:C,0)))","v":""},{"$f":"IF(F9<>\"\",GoalEntryData!$C$2,\"\")","v":""},{"$f":"IF(F9=\"\",\"\",GoalEntryData!$W$2+((GoalEntryData!$C$2-GoalEntryData!$W$2)*(($F9-GoalEntryData!$Y$2)/(GoalEntryData!$G$2-GoalEntryData!$Y$2))))","v":""}]
[3,{"$f":"IF(RawData!C4=0,\"\",LARGE(RawData!C:C,Goal1Graph!A10))","v":""},{"$f":"IF(B10=\"\",\"\",INDEX(RawData!B:B,MATCH(B10,RawData!C:C,0))&\" \"&GoalEntryData!$D$2)","v":""},null,null,{"$f":"B10","v":""},{"$f":"IF(B10=\"\",\"\",INDEX(RawData!B:B,MATCH(F10,RawData!C:C,0)))","v":""},{"$f":"IF(F10<>\"\",GoalEntryData!$C$2,\"\")","v":""},{"$f":"IF(F10=\"\",\"\",GoalEntryData!$W$2+((GoalEntryData!$C$2-GoalEntryData!$W$2)*(($F10-GoalEntryData!$Y$2)/(GoalEntryData!$G$2-GoalEntryData!$Y$2))))","v":""}]
{"$rows_left_out":28}
{"sheet":"Goal2Graph","index":6,"n_rows":37,"n_cols":9,"rows_kept":37,"cut":false,"hidden":true,"merged":[[1,2,1,8],[3,1,3,8],[20,2,20,4],[9,2,9,4],[10,2,10,4],[11,2,11,4],[12,2,12,4],[13,2,13,4],[14,2,14,4],[5,1,5,4],[7,2,7,4],[8,2,8,4],[6,1,6,4],[34,2,34,4],[35,2,35,4],[36,2,36,4],[27,2,27,4],[28,2,28,4],[29,2,29,4],[30,2,30,4],[31,2,31,4],[32,2,32,4],[33,2,33,4],[26,2,26,4],[15,2,15,4],[16,2,16,4],[17,2,17,4],[18,2,18,4],[19,2,19,4],[21,2,21,4],[22,2,22,4],[23,2,23,4],[24,2,24,4],[25,2,25,4]]}
[]
[null,null,{"$f":"IF(DataEntry!F14=\"\",\"\",\"Target Behavior: \"&DataEntry!F14)","v":""}]
[]
[null,{"$f":"IF(DataEntry!F14=\"\",\"\",\"Goal: \"&DataEntry!F16)","v":""}]
[]
[null,"Data Entry (Last 30 entries):"]
[1,null,null,null,null,{"$f":"GoalEntryData!$E$3","v":"day"},{"$f":"GoalEntryData!$D$3","v":"<Select one>"},"Goal","Aim Line"]
[1,{"$f":"IF(RawData!N2=0,\"\",LARGE(RawData!N:N,Goal2Graph!A8))","v":""},{"$f":"IF(B8=\"\",\"\",INDEX(RawData!M:M,MATCH(B8,RawData!N:N,0))&\" \"&GoalEntryData!$D$3)","v":""},null,null,{"$f":"B8","v":""},{"$f":"IF(B8=\"\",\"\",INDEX(RawData!M:M,MATCH(F8,RawData!N:N,0)))","v":""},{"$f":"IF(F8<>\"\",GoalEntryData!$C$3,\"\")","v":""},{"$f":"IF(F8=\"\",\"\",GoalEntryData!$W$3+((GoalEntryData!$C$3-GoalEntryData!$W$3)*(($F8-GoalEntryData!$Y$3)/(GoalEntryData!$G$3-GoalEntryData!$Y$3))))","v":""}]
[2,{"$f":"IF(RawData!N3=0,\"\",LARGE(RawData!N:N,Goal2Graph!A9))","v":""},{"$f":"IF(B9=\"\",\"\",INDEX(RawData!M:M,MATCH(B9,RawData!N:N,0))&\" \"&GoalEntryData!$D$3)","v":""},null,null,{"$f":"B9","v":""},{"$f":"IF(B9=\"\",\"\",INDEX(RawData!M:M,MATCH(F9,RawData!N:N,0)))","v":""},{"$f":"IF(F9<>\"\",GoalEntryData!$C$3,\"\")","v":""},{"$f":"IF(F9=\"\",\"\",GoalEntryData!$W$3+((GoalEntryData!$C$3-GoalEntryData!$W$3)*(($F9-GoalEntryData!$Y$3)/(GoalEntryData!$G$3-GoalEntryData!$Y$3))))","v":""}]
[3,{"$f":"IF(RawData!N4=0,\"\",LARGE(RawData!N:N,Goal2Graph!A10))","v":""},{"$f":"IF(B10=\"\",\"\",INDEX(RawData!M:M,MATCH(B10,RawData!N:N,0))&\" \"&GoalEntryData!$D$3)","v":""},null,null,{"$f":"B10","v":""},{"$f":"IF(B10=\"\",\"\",INDEX(RawData!M:M,MATCH(F10,RawData!N:N,0)))","v":""},{"$f":"IF(F10<>\"\",GoalEntryData!$C$3,\"\")","v":""},{"$f":"IF(F10=\"\",\"\",GoalEntryData!$W$3+((GoalEntryData!$C$3-GoalEntryData!$W$3)*(($F10-GoalEntryData!$Y$3)/(GoalEntryData!$G$3-GoalEntryData!$Y$3))))","v":""}]
{"$rows_left_out":28}
{"sheet":"Goal1Print","index":7,"n_rows":36,"n_cols":9,"rows_kept":36,"cut":false,"hidden":true,"merged":[[35,8,35,9],[37,2,37,7],[28,2,28,3],[29,2,29,3],[30,2,30,3],[31,2,31,3],[32,2,32,3],[28,5,28,6],[29,5,29,6],[30,5,30,6],[26,2,26,3],[27,2,27,3],[1,3,1,8],[2,3,2,8],[3,3,4,8],[25,1,25,9],[26,5,26,6],[27,5,27,6],[31,8,31,9],[32,8,32,9],[33,8,33,9],[34,8,34,9],[33,5,33,6],[34,5,34,6],[26,8,26,9],[27,8,27,9],[28,8,28,9],[29,8,29,9],[30,8,30,9],[31,5,31,6],[32,5,32,6],[33,2,33,3],[34,2,34,3],[39,2,40,7],[35,2,35,3],[35,5,35,6]]}
[]
[null,null,null,{"$f":"Goal1Graph!C2","v":""}]
[]
[null,null,null,{"$f":"Goal1Graph!B4","v":""}]
[]
[]
[]
[]
[]
[]
{"$rows_left_out":26}